ALT Linux Girar Builder robot reports
 help / color / mirror / Atom feed
* [#369270] TESTED pods.git=2.1.2-alt1
@ 2025-01-12  0:06 Girar awaiter (oleg)
  2025-02-27 22:41 ` [#369270] [test-only] FAILED (try 2) pods.git=2.1.2-alt1 Girar awaiter (oleg)
  2025-02-27 23:09 ` [#369270] [test-only] FAILED (try 3) pods.git=2.1.2-alt1 Girar awaiter (oleg)
  0 siblings, 2 replies; 3+ messages in thread
From: Girar awaiter (oleg) @ 2025-01-12  0:06 UTC (permalink / raw)
  To: Oleg Shchavelev; +Cc: sisyphus-incominger, girar-builder-sisyphus

https://git.altlinux.org/tasks/369270/logs/events.1.1.log
https://packages.altlinux.org/tasks/369270

subtask  name  aarch64  i586  ppc64le  x86_64
   #100  pods    14:04  8:31    14:44    7:16

2025-Jan-11 23:45:19 :: test-only task #369270 for sisyphus started by oleg:
#100 build 2.1.2-alt1 from /people/oleg/packages/pods.git fetched at 2025-Jan-11 23:45:17
2025-Jan-11 23:45:22 :: [ppc64le] #100 pods.git 2.1.2-alt1: build start
2025-Jan-11 23:45:22 :: [i586] #100 pods.git 2.1.2-alt1: build start
2025-Jan-11 23:45:22 :: [x86_64] #100 pods.git 2.1.2-alt1: build start
2025-Jan-11 23:45:22 :: [aarch64] #100 pods.git 2.1.2-alt1: build start
2025-Jan-11 23:52:38 :: [x86_64] #100 pods.git 2.1.2-alt1: build OK
2025-Jan-11 23:53:53 :: [i586] #100 pods.git 2.1.2-alt1: build OK
2025-Jan-11 23:59:26 :: [aarch64] #100 pods.git 2.1.2-alt1: build OK
2025-Jan-12 00:00:06 :: [ppc64le] #100 pods.git 2.1.2-alt1: build OK
2025-Jan-12 00:00:18 :: #100: pods.git 2.1.2-alt1: build check OK
2025-Jan-12 00:00:20 :: build check OK
2025-Jan-12 00:00:23 :: noarch check OK
2025-Jan-12 00:00:24 :: plan: src +1 -0 =19986, aarch64 +2 -0 =34701, i586 +2 -0 =33725, ppc64le +2 -0 =33277, x86_64 +2 -0 =35520
2025-Jan-12 00:01:05 :: patched apt indices
2025-Jan-12 00:01:16 :: created next repo
2025-Jan-12 00:01:25 :: duplicate provides check OK
2025-Jan-12 00:02:06 :: dependencies check OK
2025-Jan-12 00:02:42 :: [x86_64 i586 aarch64 ppc64le] ELF symbols check OK
	x86_64: pods=2.1.2-alt1 post-install unowned files:
 /usr/share/icons/hicolor/scalable/apps
 /usr/share/icons/hicolor/symbolic
 /usr/share/icons/hicolor/symbolic/apps
 /usr/share/metainfo
2025-Jan-12 00:03:16 :: [x86_64] #100 pods: install check OK
	i586: pods=2.1.2-alt1 post-install unowned files:
 /usr/share/icons/hicolor/scalable/apps
 /usr/share/icons/hicolor/symbolic
 /usr/share/icons/hicolor/symbolic/apps
 /usr/share/metainfo
2025-Jan-12 00:03:20 :: [i586] #100 pods: install check OK
	aarch64: pods=2.1.2-alt1 post-install unowned files:
 /usr/share/icons/hicolor/scalable/apps
 /usr/share/icons/hicolor/symbolic
 /usr/share/icons/hicolor/symbolic/apps
 /usr/share/metainfo
2025-Jan-12 00:03:24 :: [aarch64] #100 pods: install check OK
	ppc64le: pods=2.1.2-alt1 post-install unowned files:
 /usr/share/icons/hicolor/scalable/apps
 /usr/share/icons/hicolor/symbolic
 /usr/share/icons/hicolor/symbolic/apps
 /usr/share/metainfo
2025-Jan-12 00:03:31 :: [ppc64le] #100 pods: install check OK
2025-Jan-12 00:04:48 :: [aarch64] #100 pods-debuginfo: install check OK
2025-Jan-12 00:05:12 :: [x86_64] #100 pods-debuginfo: install check OK
2025-Jan-12 00:05:12 :: [ppc64le] #100 pods-debuginfo: install check OK
2025-Jan-12 00:05:42 :: [i586] #100 pods-debuginfo: install check OK
2025-Jan-12 00:05:59 :: [x86_64-i586] generated apt indices
2025-Jan-12 00:05:59 :: [x86_64-i586] created next repo
2025-Jan-12 00:06:11 :: [x86_64-i586] dependencies check OK
2025-Jan-12 00:06:11 :: gears inheritance check OK
2025-Jan-12 00:06:12 :: srpm inheritance check OK
girar-check-perms: access to pods DENIED for oleg: does not belong to maintainers list yet
check-subtask-perms: #100: pods: Operation not permitted
2025-Jan-12 00:06:12 :: acl check IGNORED
2025-Jan-12 00:06:25 :: created contents_index files
2025-Jan-12 00:06:35 :: created hash files: aarch64 i586 ppc64le src x86_64
2025-Jan-12 00:06:38 :: task #369270 for sisyphus TESTED


^ permalink raw reply	[flat|nested] 3+ messages in thread

* [#369270] [test-only] FAILED (try 2) pods.git=2.1.2-alt1
  2025-01-12  0:06 [#369270] TESTED pods.git=2.1.2-alt1 Girar awaiter (oleg)
@ 2025-02-27 22:41 ` Girar awaiter (oleg)
  2025-02-27 23:09 ` [#369270] [test-only] FAILED (try 3) pods.git=2.1.2-alt1 Girar awaiter (oleg)
  1 sibling, 0 replies; 3+ messages in thread
From: Girar awaiter (oleg) @ 2025-02-27 22:41 UTC (permalink / raw)
  To: Oleg Shchavelev; +Cc: sisyphus-incominger, girar-builder-sisyphus

https://git.altlinux.org/tasks/369270/logs/events.2.1.log
https://packages.altlinux.org/tasks/369270

subtask  name  aarch64    i586  ppc64le  x86_64
   #200  pods    19:26  failed    16:46    8:02

2025-Feb-27 22:21:57 :: test-only task #369270 for sisyphus resumed by oleg:
#100 removed
#200 build 2.1.2-alt1 from /people/oleg/packages/pods.git fetched at 2025-Feb-27 22:20:59
2025-Feb-27 22:21:59 :: [x86_64] #200 pods.git 2.1.2-alt1: build start
2025-Feb-27 22:21:59 :: [aarch64] #200 pods.git 2.1.2-alt1: build start
2025-Feb-27 22:21:59 :: [ppc64le] #200 pods.git 2.1.2-alt1: build start
2025-Feb-27 22:21:59 :: [i586] #200 pods.git 2.1.2-alt1: build start
2025-Feb-27 22:30:01 :: [x86_64] #200 pods.git 2.1.2-alt1: build OK
[i586]    Compiling pods v2.1.2 (/usr/src/RPM/BUILD/pods-2.1.2)
[i586] rustc-LLVM ERROR: out of memory
[i586] Allocation failed
[i586] error: could not compile `pods` (bin "pods")
[i586] Caused by:
[i586]   process didn't exit successfully: `rustc --crate-name pods --edition=2021 src/main.rs --error-format=json --json=diagnostic-rendered-ansi,artifacts,future-incompat --crate-type bin --emit=dep-info,link -C opt-level=3 -C lto -C codegen-units=1 --check-cfg 'cfg(docsrs,test)' --check-cfg 'cfg(feature, values())' -C metadata=48ec0ae9a3dc3ac9 -C extra-filename=-a8ba7f95724ba905 --out-dir /usr/src/RPM/BUILD/pods-2.1.2/i586-alt-linux/src/release/deps -L dependency=/usr/src/RPM/BUILD/pods-2.1.2/i586-alt-linux/src/release/deps --extern anyhow=/usr/src/RPM/BUILD/pods-2.1.2/i586-alt-linux/src/release/deps/libanyhow-2e1c7f3458a596ac.rlib --extern ashpd=/usr/src/RPM/BUILD/pods-2.1.2/i586-alt-linux/src/release/deps/libashpd-4d927571df854710.rlib --extern futures=/usr/src/RPM/BUILD/pods-2.1.2/i586-alt-linux/src/release/deps/libfutures-9320ca16cc3cc927.rlib --extern gettextrs=/usr/src/RPM/BUILD/pods-2.1.2/i586-alt-linux/src/release/deps/libgettextrs-8cc2e7e6108c134e.rlib --extern gtk=/usr/src/RPM/BUILD/pods-2.1.2/i586-alt-linux/src/release/deps/libgtk4-05fee781d46608b4.rlib --extern indexmap=/usr/src/RPM/BUILD/pods-2.1.2/i586-alt-linux/src/release/deps/libindexmap-76fb12c54dadc474.rlib --extern adw=/usr/src/RPM/BUILD/pods-2.1.2/i586-alt-linux/src/release/deps/liblibadwaita-9216a2aa05e51357.rlib --extern log=/usr/src/RPM/BUILD/pods-2.1.2/i586-alt-linux/src/release/deps/liblog-307ad8197d6d3be1.rlib --extern multi_log=/usr/src/RPM/BUILD/pods-2.1.2/i586-alt-linux/src/release/deps/libmulti_log-726c98416252ed2f.rlib --extern names=/usr/src/RPM/BUILD/pods-2.1.2/i586-alt-linux/src/release/deps/libnames-5a219aa3f1d8ebe2.rlib --extern oo7=/usr/src/RPM/BUILD/pods-2.1.2/i586-alt-linux/src/release/deps/liboo7-bec2fb7aa6ae5b0c.rlib --extern paste=/usr/src/RPM/BUILD/pods-2.1.2/i586-alt-linux/src/release/deps/libpaste-71ce4c26cc9bfe86.so --extern podman_api=/usr/src/RPM/BUILD/pods-2.1.2/i586-alt-linux/src/release/deps/libpodman_api-f372d0ad12e7ff34.rlib --extern serde=/usr/src/RPM/BUILD/pods-2.1.2/i586-alt-linux/src/release/deps/libserde-b1e2ba3107edf218.rlib --extern serde_json=/usr/src/RPM/BUILD/pods-2.1.2/i586-alt-linux/src/release/deps/libserde_json-341884deb0515eb1.rlib --extern simplelog=/usr/src/RPM/BUILD/pods-2.1.2/i586-alt-linux/src/release/deps/libsimplelog-a4f49bf14e35ab3c.rlib --extern sourceview5=/usr/src/RPM/BUILD/pods-2.1.2/i586-alt-linux/src/release/deps/libsourceview5-9830ef4e66e84de3.rlib --extern syslog=/usr/src/RPM/BUILD/pods-2.1.2/i586-alt-linux/src/release/deps/libsyslog-704a6bff9e937921.rlib --extern tokio=/usr/src/RPM/BUILD/pods-2.1.2/i586-alt-linux/src/release/deps/libtokio-3e69185d226dc25f.rlib --extern tokio_tar=/usr/src/RPM/BUILD/pods-2.1.2/i586-alt-linux/src/release/deps/libtokio_tar-fc80cacff2d30b03.rlib --extern vte=/usr/src/RPM/BUILD/pods-2.1.2/i586-alt-linux/src/release/deps/libvte-77846a94756bf15e.rlib --extern vte4=/usr/src/RPM/BUILD/pods-2.1.2/i586-alt-linux/src/release/deps/libvte4-fb5f276bbfdc31e9.rlib -Cdebuginfo=1` (signal: 6, SIGABRT: process abort signal)
[i586] FAILED: src/pods 
[i586] /usr/bin/env CARGO_HOME=/usr/src/RPM/BUILD/pods-2.1.2/i586-alt-linux/cargo-home /usr/bin/cargo build --manifest-path /usr/src/RPM/BUILD/pods-2.1.2/Cargo.toml --target-dir /usr/src/RPM/BUILD/pods-2.1.2/i586-alt-linux/src --release && cp src/release/pods src/pods
2025-Feb-27 22:30:57 :: [i586] pods.git 2.1.2-alt1: remote: build failed
2025-Feb-27 22:30:57 :: [i586] #200 pods.git 2.1.2-alt1: build FAILED
2025-Feb-27 22:30:57 :: [i586] requesting cancellation of task processing
2025-Feb-27 22:38:45 :: [ppc64le] #200 pods.git 2.1.2-alt1: build OK
2025-Feb-27 22:41:25 :: [aarch64] #200 pods.git 2.1.2-alt1: build OK
2025-Feb-27 22:30:57 :: [i586] build FAILED
2025-Feb-27 22:41:25 :: task #369270 for sisyphus FAILED


^ permalink raw reply	[flat|nested] 3+ messages in thread

* [#369270] [test-only] FAILED (try 3) pods.git=2.1.2-alt1
  2025-01-12  0:06 [#369270] TESTED pods.git=2.1.2-alt1 Girar awaiter (oleg)
  2025-02-27 22:41 ` [#369270] [test-only] FAILED (try 2) pods.git=2.1.2-alt1 Girar awaiter (oleg)
@ 2025-02-27 23:09 ` Girar awaiter (oleg)
  1 sibling, 0 replies; 3+ messages in thread
From: Girar awaiter (oleg) @ 2025-02-27 23:09 UTC (permalink / raw)
  To: Oleg Shchavelev; +Cc: sisyphus-incominger, girar-builder-sisyphus

https://git.altlinux.org/tasks/369270/logs/events.3.1.log
https://packages.altlinux.org/tasks/369270

subtask  name  aarch64    i586  ppc64le  x86_64
   #300  pods    16:01  failed    16:38    8:05

2025-Feb-27 22:53:05 :: test-only task #369270 for sisyphus resumed by oleg:
#100 removed
#200 removed
#300 build 2.1.2-alt1 from /people/oleg/packages/pods.git fetched at 2025-Feb-27 22:45:50
2025-Feb-27 22:53:06 :: [i586] #300 pods.git 2.1.2-alt1: build start
2025-Feb-27 22:53:06 :: [x86_64] #300 pods.git 2.1.2-alt1: build start
2025-Feb-27 22:53:06 :: [ppc64le] #300 pods.git 2.1.2-alt1: build start
2025-Feb-27 22:53:06 :: [aarch64] #300 pods.git 2.1.2-alt1: build start
2025-Feb-27 23:01:11 :: [x86_64] #300 pods.git 2.1.2-alt1: build OK
[i586]    Compiling pods v2.1.2 (/usr/src/RPM/BUILD/pods-2.1.2)
[i586] rustc-LLVM ERROR: out of memory
[i586] Allocation failed
[i586] error: could not compile `pods` (bin "pods")
[i586] Caused by:
[i586]   process didn't exit successfully: `rustc --crate-name pods --edition=2021 src/main.rs --error-format=json --json=diagnostic-rendered-ansi,artifacts,future-incompat --crate-type bin --emit=dep-info,link -C opt-level=3 -C lto -C codegen-units=1 --check-cfg 'cfg(docsrs,test)' --check-cfg 'cfg(feature, values())' -C metadata=48ec0ae9a3dc3ac9 -C extra-filename=-a8ba7f95724ba905 --out-dir /usr/src/RPM/BUILD/pods-2.1.2/i586-alt-linux/src/release/deps -L dependency=/usr/src/RPM/BUILD/pods-2.1.2/i586-alt-linux/src/release/deps --extern anyhow=/usr/src/RPM/BUILD/pods-2.1.2/i586-alt-linux/src/release/deps/libanyhow-2e1c7f3458a596ac.rlib --extern ashpd=/usr/src/RPM/BUILD/pods-2.1.2/i586-alt-linux/src/release/deps/libashpd-4d927571df854710.rlib --extern futures=/usr/src/RPM/BUILD/pods-2.1.2/i586-alt-linux/src/release/deps/libfutures-9320ca16cc3cc927.rlib --extern gettextrs=/usr/src/RPM/BUILD/pods-2.1.2/i586-alt-linux/src/release/deps/libgettextrs-8cc2e7e6108c134e.rlib --extern gtk=/usr/src/RPM/BUILD/pods-2.1.2/i586-alt-linux/src/release/deps/libgtk4-05fee781d46608b4.rlib --extern indexmap=/usr/src/RPM/BUILD/pods-2.1.2/i586-alt-linux/src/release/deps/libindexmap-76fb12c54dadc474.rlib --extern adw=/usr/src/RPM/BUILD/pods-2.1.2/i586-alt-linux/src/release/deps/liblibadwaita-9216a2aa05e51357.rlib --extern log=/usr/src/RPM/BUILD/pods-2.1.2/i586-alt-linux/src/release/deps/liblog-307ad8197d6d3be1.rlib --extern multi_log=/usr/src/RPM/BUILD/pods-2.1.2/i586-alt-linux/src/release/deps/libmulti_log-726c98416252ed2f.rlib --extern names=/usr/src/RPM/BUILD/pods-2.1.2/i586-alt-linux/src/release/deps/libnames-5a219aa3f1d8ebe2.rlib --extern oo7=/usr/src/RPM/BUILD/pods-2.1.2/i586-alt-linux/src/release/deps/liboo7-bec2fb7aa6ae5b0c.rlib --extern paste=/usr/src/RPM/BUILD/pods-2.1.2/i586-alt-linux/src/release/deps/libpaste-71ce4c26cc9bfe86.so --extern podman_api=/usr/src/RPM/BUILD/pods-2.1.2/i586-alt-linux/src/release/deps/libpodman_api-f372d0ad12e7ff34.rlib --extern serde=/usr/src/RPM/BUILD/pods-2.1.2/i586-alt-linux/src/release/deps/libserde-b1e2ba3107edf218.rlib --extern serde_json=/usr/src/RPM/BUILD/pods-2.1.2/i586-alt-linux/src/release/deps/libserde_json-341884deb0515eb1.rlib --extern simplelog=/usr/src/RPM/BUILD/pods-2.1.2/i586-alt-linux/src/release/deps/libsimplelog-a4f49bf14e35ab3c.rlib --extern sourceview5=/usr/src/RPM/BUILD/pods-2.1.2/i586-alt-linux/src/release/deps/libsourceview5-9830ef4e66e84de3.rlib --extern syslog=/usr/src/RPM/BUILD/pods-2.1.2/i586-alt-linux/src/release/deps/libsyslog-704a6bff9e937921.rlib --extern tokio=/usr/src/RPM/BUILD/pods-2.1.2/i586-alt-linux/src/release/deps/libtokio-3e69185d226dc25f.rlib --extern tokio_tar=/usr/src/RPM/BUILD/pods-2.1.2/i586-alt-linux/src/release/deps/libtokio_tar-fc80cacff2d30b03.rlib --extern vte=/usr/src/RPM/BUILD/pods-2.1.2/i586-alt-linux/src/release/deps/libvte-77846a94756bf15e.rlib --extern vte4=/usr/src/RPM/BUILD/pods-2.1.2/i586-alt-linux/src/release/deps/libvte4-fb5f276bbfdc31e9.rlib -Cdebuginfo=1` (signal: 6, SIGABRT: process abort signal)
[i586] FAILED: src/pods 
[i586] /usr/bin/env CARGO_HOME=/usr/src/RPM/BUILD/pods-2.1.2/i586-alt-linux/cargo-home /usr/bin/cargo build --manifest-path /usr/src/RPM/BUILD/pods-2.1.2/Cargo.toml --target-dir /usr/src/RPM/BUILD/pods-2.1.2/i586-alt-linux/src --release && cp src/release/pods src/pods
2025-Feb-27 23:02:03 :: [i586] pods.git 2.1.2-alt1: remote: build failed
2025-Feb-27 23:02:03 :: [i586] #300 pods.git 2.1.2-alt1: build FAILED
2025-Feb-27 23:02:03 :: [i586] requesting cancellation of task processing
2025-Feb-27 23:09:07 :: [aarch64] #300 pods.git 2.1.2-alt1: build OK
2025-Feb-27 23:09:44 :: [ppc64le] #300 pods.git 2.1.2-alt1: build OK
2025-Feb-27 23:02:03 :: [i586] build FAILED
2025-Feb-27 23:09:44 :: task #369270 for sisyphus FAILED


^ permalink raw reply	[flat|nested] 3+ messages in thread

end of thread, other threads:[~2025-02-27 23:09 UTC | newest]

Thread overview: 3+ messages (download: mbox.gz / follow: Atom feed)
-- links below jump to the message on this page --
2025-01-12  0:06 [#369270] TESTED pods.git=2.1.2-alt1 Girar awaiter (oleg)
2025-02-27 22:41 ` [#369270] [test-only] FAILED (try 2) pods.git=2.1.2-alt1 Girar awaiter (oleg)
2025-02-27 23:09 ` [#369270] [test-only] FAILED (try 3) pods.git=2.1.2-alt1 Girar awaiter (oleg)

ALT Linux Girar Builder robot reports

This inbox may be cloned and mirrored by anyone:

	git clone --mirror http://lore.altlinux.org/sisyphus-incominger/0 sisyphus-incominger/git/0.git

	# If you have public-inbox 1.1+ installed, you may
	# initialize and index your mirror using the following commands:
	public-inbox-init -V2 sisyphus-incominger sisyphus-incominger/ http://lore.altlinux.org/sisyphus-incominger \
		sisyphus-incominger@lists.altlinux.org sisyphus-incominger@lists.altlinux.ru sisyphus-incominger@lists.altlinux.com
	public-inbox-index sisyphus-incominger

Example config snippet for mirrors.
Newsgroup available over NNTP:
	nntp://lore.altlinux.org/org.altlinux.lists.sisyphus-incominger


AGPL code for this site: git clone https://public-inbox.org/public-inbox.git