ALT Linux Girar Builder robot reports
 help / color / mirror / Atom feed
* [#359836] FAILED python3-module-pydicom-data.git=1.0.0-alt0.6.git8da482f ...
@ 2024-10-15 14:16 Girar awaiter (grenka)
  2024-10-15 15:19 ` [#359836] FAILED (try 2) python3-module-pydicom-data.git=1.0.0-alt0.6.git8da482f Girar awaiter (grenka)
  2024-10-15 15:58 ` [#359836] DONE (try 3) python3-module-pydicom-data.git=1.0.0-alt0.6.git8da482f Girar pender (grenka)
  0 siblings, 2 replies; 3+ messages in thread
From: Girar awaiter (grenka) @ 2024-10-15 14:16 UTC (permalink / raw)
  To: Grigory Ustinov; +Cc: sisyphus-incominger, girar-builder-sisyphus

https://git.altlinux.org/tasks/359836/logs/events.1.1.log

subtask  name                         aarch64    i586  ppc64le  x86_64
   #100  python3-module-pydicom-data     1:34      58     1:55      56
   #200  python3-module-pydicom          1:40  failed        ?      55

2024-Oct-15 14:13:36 :: task #359836 for sisyphus started by grenka:
#100 build 1.0.0-alt0.6.git8da482f from /people/grenka/packages/python3-module-pydicom-data.git fetched at 2024-Oct-15 14:11:55
#200 build 3.0.1-alt1 from /people/grenka/packages/python3-module-pydicom.git fetched at 2024-Oct-15 14:13:13
2024-Oct-15 14:13:38 :: created build repo
2024-Oct-15 14:13:39 :: [i586] #100 python3-module-pydicom-data.git 1.0.0-alt0.6.git8da482f: build start
2024-Oct-15 14:13:39 :: [aarch64] #100 python3-module-pydicom-data.git 1.0.0-alt0.6.git8da482f: build start
2024-Oct-15 14:13:39 :: [ppc64le] #100 python3-module-pydicom-data.git 1.0.0-alt0.6.git8da482f: build start
2024-Oct-15 14:13:39 :: [x86_64] #100 python3-module-pydicom-data.git 1.0.0-alt0.6.git8da482f: build start
2024-Oct-15 14:14:35 :: [x86_64] #100 python3-module-pydicom-data.git 1.0.0-alt0.6.git8da482f: build OK
2024-Oct-15 14:14:36 :: [x86_64] #200 python3-module-pydicom.git 3.0.1-alt1: build start
2024-Oct-15 14:14:37 :: [i586] #100 python3-module-pydicom-data.git 1.0.0-alt0.6.git8da482f: build OK
2024-Oct-15 14:14:38 :: [i586] #200 python3-module-pydicom.git 3.0.1-alt1: build start
2024-Oct-15 14:15:13 :: [aarch64] #100 python3-module-pydicom-data.git 1.0.0-alt0.6.git8da482f: build OK
2024-Oct-15 14:15:14 :: [aarch64] #200 python3-module-pydicom.git 3.0.1-alt1: build start
[i586] >           total = (nr_frames - 1) * 8 + sum([len(f) for f in frames[:-1]])
[i586] E           OverflowError: cannot fit 'int' into an index-sized integer
[i586] .run_venv/lib/python3/site-packages/pydicom/encaps.py:1123: OverflowError
[i586] --
[i586] >           total = (nr_frames - 1) * 8 + sum([len(f) for f in frames[:-1]])
[i586] E           OverflowError: cannot fit 'int' into an index-sized integer
[i586] .run_venv/lib/python3/site-packages/pydicom/encaps.py:1123: OverflowError
[i586] =========================== short test summary info ============================
[i586] FAILED tests/test_encaps.py::TestEncapsulate::test_encapsulate_bot_large_raises
[i586] FAILED tests/test_encaps.py::TestEncapsulateBufferFunc::test_encapsulate_bot_large_raises
[i586] ========= 2 failed, 2375 passed, 1637 skipped, 3 deselected in 21.96s ==========
[i586] INFO     : Command's result: FAILURE
[i586] INFO     : Command's error: Command '['python3', '-m', 'pytest', '-knot test_fetch_data_files and not test_deepcopy_bufferedreader_raises']' returned non-zero exit status 1.
2024-Oct-15 14:15:28 :: [i586] python3-module-pydicom.git 3.0.1-alt1: remote: build failed
2024-Oct-15 14:15:28 :: [i586] #200 python3-module-pydicom.git 3.0.1-alt1: build FAILED
2024-Oct-15 14:15:29 :: [i586] requesting cancellation of task processing
2024-Oct-15 14:15:31 :: [x86_64] #200 python3-module-pydicom.git 3.0.1-alt1: build OK
2024-Oct-15 14:15:34 :: [ppc64le] #100 python3-module-pydicom-data.git 1.0.0-alt0.6.git8da482f: build OK
2024-Oct-15 14:15:34 :: [ppc64le] task processing CANCELLED
2024-Oct-15 14:16:54 :: [aarch64] #200 python3-module-pydicom.git 3.0.1-alt1: build OK
2024-Oct-15 14:15:29 :: [i586] build FAILED
2024-Oct-15 14:15:34 :: [ppc64le] build FAILED
2024-Oct-15 14:16:54 :: task #359836 for sisyphus FAILED


^ permalink raw reply	[flat|nested] 3+ messages in thread

end of thread, other threads:[~2024-10-15 15:58 UTC | newest]

Thread overview: 3+ messages (download: mbox.gz / follow: Atom feed)
-- links below jump to the message on this page --
2024-10-15 14:16 [#359836] FAILED python3-module-pydicom-data.git=1.0.0-alt0.6.git8da482f Girar awaiter (grenka)
2024-10-15 15:19 ` [#359836] FAILED (try 2) python3-module-pydicom-data.git=1.0.0-alt0.6.git8da482f Girar awaiter (grenka)
2024-10-15 15:58 ` [#359836] DONE (try 3) python3-module-pydicom-data.git=1.0.0-alt0.6.git8da482f Girar pender (grenka)

ALT Linux Girar Builder robot reports

This inbox may be cloned and mirrored by anyone:

	git clone --mirror http://lore.altlinux.org/sisyphus-incominger/0 sisyphus-incominger/git/0.git

	# If you have public-inbox 1.1+ installed, you may
	# initialize and index your mirror using the following commands:
	public-inbox-init -V2 sisyphus-incominger sisyphus-incominger/ http://lore.altlinux.org/sisyphus-incominger \
		sisyphus-incominger@lists.altlinux.org sisyphus-incominger@lists.altlinux.ru sisyphus-incominger@lists.altlinux.com
	public-inbox-index sisyphus-incominger

Example config snippet for mirrors.
Newsgroup available over NNTP:
	nntp://lore.altlinux.org/org.altlinux.lists.sisyphus-incominger


AGPL code for this site: git clone https://public-inbox.org/public-inbox.git