ALT Linux Girar Builder robot reports
 help / color / mirror / Atom feed
* [#359511] [test-only] FAILED python3-module-harfile.git=0.3.0-alt1 ...
@ 2024-10-11  8:29 Girar awaiter (enimalojd)
  2024-10-11 11:01 ` [#359511] [test-only] FAILED (try 2) python3-module-harfile.git=0.3.0-alt1 Girar awaiter (enimalojd)
                   ` (4 more replies)
  0 siblings, 5 replies; 6+ messages in thread
From: Girar awaiter (enimalojd) @ 2024-10-11  8:29 UTC (permalink / raw)
  To: Evgeniy Martynenko; +Cc: sisyphus-incominger, girar-builder-sisyphus

https://git.altlinux.org/tasks/359511/logs/events.1.1.log

subtask  name                                  aarch64    i586  ppc64le  x86_64
   #100  python3-module-harfile                   1:10      42     1:29      42
   #200  python3-module-backoff                     49      31       53      31
   #300  python3-module-hypothesis-graphql        4:34    2:25     6:02    2:28
   #400  python3-module-hypothesis-jsonschema    31:53   16:30    48:54   14:00
   #500  python3-module-hypothesis-openapi           ?      41        ?    1:11
   #600  python3-module-junit-xml                    ?      25        ?      26
   #700  python3-module-pyrate-limiter               ?    5:46        ?    5:46
  #1000  python3-module-starlette-testclient         ?      23        ?      25
  #1100  python3-module-schemathesis                 ?  failed        ?   10:27

2024-Oct-11 07:32:14 :: test-only task #359511 for sisyphus started by enimalojd:
#100 build 0.3.0-alt1 from /people/enimalojd/packages/python3-module-harfile.git fetched at 2024-Oct-11 07:27:00
#200 build 2.2.1-alt1 from /people/enimalojd/packages/python3-module-backoff.git fetched at 2024-Oct-11 07:27:20
#300 build 0.11.1-alt1 from /people/enimalojd/packages/python3-module-hypothesis-graphql.git fetched at 2024-Oct-11 07:27:45
#400 build 0.23.1-alt1 from /people/enimalojd/packages/python3-module-hypothesis-jsonschema.git fetched at 2024-Oct-11 07:28:13
#500 build 0.2.1-alt1 from /people/enimalojd/packages/python3-module-hypothesis-openapi.git fetched at 2024-Oct-11 07:28:31
#600 build 1.9-alt1 from /people/enimalojd/packages/python3-module-junit-xml.git fetched at 2024-Oct-11 07:28:56
#700 build 3.7.0-alt1 from /people/enimalojd/packages/python3-module-pyrate-limiter.git fetched at 2024-Oct-11 07:29:15
#1000 build 0.4.0-alt1 from /people/enimalojd/packages/python3-module-starlette-testclient.git fetched at 2024-Oct-11 07:29:49
#1100 build 3.36.4-alt1 from /people/enimalojd/packages/python3-module-schemathesis.git fetched at 2024-Oct-11 07:31:08
2024-Oct-11 07:32:14 :: created build repo
2024-Oct-11 07:32:16 :: [x86_64] #100 python3-module-harfile.git 0.3.0-alt1: build start
2024-Oct-11 07:32:16 :: [i586] #100 python3-module-harfile.git 0.3.0-alt1: build start
2024-Oct-11 07:32:16 :: [aarch64] #100 python3-module-harfile.git 0.3.0-alt1: build start
2024-Oct-11 07:32:16 :: [ppc64le] #100 python3-module-harfile.git 0.3.0-alt1: build start
2024-Oct-11 07:32:58 :: [x86_64] #100 python3-module-harfile.git 0.3.0-alt1: build OK
2024-Oct-11 07:32:58 :: [i586] #100 python3-module-harfile.git 0.3.0-alt1: build OK
2024-Oct-11 07:32:59 :: [x86_64] #200 python3-module-backoff.git 2.2.1-alt1: build start
2024-Oct-11 07:32:59 :: [i586] #200 python3-module-backoff.git 2.2.1-alt1: build start
2024-Oct-11 07:33:26 :: [aarch64] #100 python3-module-harfile.git 0.3.0-alt1: build OK
2024-Oct-11 07:33:26 :: [aarch64] #200 python3-module-backoff.git 2.2.1-alt1: build start
2024-Oct-11 07:33:30 :: [i586] #200 python3-module-backoff.git 2.2.1-alt1: build OK
2024-Oct-11 07:33:30 :: [x86_64] #200 python3-module-backoff.git 2.2.1-alt1: build OK
2024-Oct-11 07:33:31 :: [i586] #300 python3-module-hypothesis-graphql.git 0.11.1-alt1: build start
2024-Oct-11 07:33:31 :: [x86_64] #300 python3-module-hypothesis-graphql.git 0.11.1-alt1: build start
2024-Oct-11 07:33:45 :: [ppc64le] #100 python3-module-harfile.git 0.3.0-alt1: build OK
2024-Oct-11 07:33:46 :: [ppc64le] #200 python3-module-backoff.git 2.2.1-alt1: build start
2024-Oct-11 07:34:15 :: [aarch64] #200 python3-module-backoff.git 2.2.1-alt1: build OK
2024-Oct-11 07:34:15 :: [aarch64] #300 python3-module-hypothesis-graphql.git 0.11.1-alt1: build start
2024-Oct-11 07:34:39 :: [ppc64le] #200 python3-module-backoff.git 2.2.1-alt1: build OK
2024-Oct-11 07:34:40 :: [ppc64le] #300 python3-module-hypothesis-graphql.git 0.11.1-alt1: build start
2024-Oct-11 07:35:56 :: [i586] #300 python3-module-hypothesis-graphql.git 0.11.1-alt1: build OK
2024-Oct-11 07:35:56 :: [i586] #400 python3-module-hypothesis-jsonschema.git 0.23.1-alt1: build start
2024-Oct-11 07:35:59 :: [x86_64] #300 python3-module-hypothesis-graphql.git 0.11.1-alt1: build OK
2024-Oct-11 07:36:00 :: [x86_64] #400 python3-module-hypothesis-jsonschema.git 0.23.1-alt1: build start
2024-Oct-11 07:38:49 :: [aarch64] #300 python3-module-hypothesis-graphql.git 0.11.1-alt1: build OK
2024-Oct-11 07:38:50 :: [aarch64] #400 python3-module-hypothesis-jsonschema.git 0.23.1-alt1: build start
2024-Oct-11 07:40:42 :: [ppc64le] #300 python3-module-hypothesis-graphql.git 0.11.1-alt1: build OK
2024-Oct-11 07:40:43 :: [ppc64le] #400 python3-module-hypothesis-jsonschema.git 0.23.1-alt1: build start
2024-Oct-11 07:50:00 :: [x86_64] #400 python3-module-hypothesis-jsonschema.git 0.23.1-alt1: build OK
2024-Oct-11 07:50:00 :: [x86_64] #500 python3-module-hypothesis-openapi.git 0.2.1-alt1: build start
2024-Oct-11 07:51:11 :: [x86_64] #500 python3-module-hypothesis-openapi.git 0.2.1-alt1: build OK
2024-Oct-11 07:51:11 :: [x86_64] #600 python3-module-junit-xml.git 1.9-alt1: build start
2024-Oct-11 07:51:37 :: [x86_64] #600 python3-module-junit-xml.git 1.9-alt1: build OK
2024-Oct-11 07:51:38 :: [x86_64] #700 python3-module-pyrate-limiter.git 3.7.0-alt1: build start
2024-Oct-11 07:52:26 :: [i586] #400 python3-module-hypothesis-jsonschema.git 0.23.1-alt1: build OK
2024-Oct-11 07:52:27 :: [i586] #500 python3-module-hypothesis-openapi.git 0.2.1-alt1: build start
2024-Oct-11 07:53:08 :: [i586] #500 python3-module-hypothesis-openapi.git 0.2.1-alt1: build OK
2024-Oct-11 07:53:09 :: [i586] #600 python3-module-junit-xml.git 1.9-alt1: build start
2024-Oct-11 07:53:34 :: [i586] #600 python3-module-junit-xml.git 1.9-alt1: build OK
2024-Oct-11 07:53:35 :: [i586] #700 python3-module-pyrate-limiter.git 3.7.0-alt1: build start
2024-Oct-11 07:57:24 :: [x86_64] #700 python3-module-pyrate-limiter.git 3.7.0-alt1: build OK
2024-Oct-11 07:57:24 :: [x86_64] #1000 python3-module-starlette-testclient.git 0.4.0-alt1: build start
2024-Oct-11 07:57:49 :: [x86_64] #1000 python3-module-starlette-testclient.git 0.4.0-alt1: build OK
2024-Oct-11 07:57:49 :: [x86_64] #1100 python3-module-schemathesis.git 3.36.4-alt1: build start
2024-Oct-11 07:59:21 :: [i586] #700 python3-module-pyrate-limiter.git 3.7.0-alt1: build OK
2024-Oct-11 07:59:22 :: [i586] #1000 python3-module-starlette-testclient.git 0.4.0-alt1: build start
2024-Oct-11 07:59:45 :: [i586] #1000 python3-module-starlette-testclient.git 0.4.0-alt1: build OK
2024-Oct-11 07:59:46 :: [i586] #1100 python3-module-schemathesis.git 3.36.4-alt1: build start
2024-Oct-11 08:08:16 :: [x86_64] #1100 python3-module-schemathesis.git 3.36.4-alt1: build OK
[i586] XPASS test/contrib/test_unique_data.py::test_python_tests[None] - The `schemathesis.contrib.unique_data` hook is deprecated
[i586] FAILED test/contrib/test_unique_data.py::test_cli[None] - assert [+ received]...
[i586] FAILED test/specs/openapi/test_randomized.py::test_random_schemas - Assertion...
[i586] = 2 failed, 2647 passed, 4 skipped, 4 xpassed, 5754 warnings in 491.03s (0:08:11) =
[i586] INFO     : Command's result: FAILURE
[i586] INFO     : Command's error: Command '['python3', '-m', 'pytest', 'test/']' returned non-zero exit status 1.
2024-Oct-11 08:09:16 :: [i586] python3-module-schemathesis.git 3.36.4-alt1: remote: build failed
2024-Oct-11 08:09:16 :: [i586] #1100 python3-module-schemathesis.git 3.36.4-alt1: build FAILED
2024-Oct-11 08:09:16 :: [i586] requesting cancellation of task processing
2024-Oct-11 08:10:43 :: [aarch64] #400 python3-module-hypothesis-jsonschema.git 0.23.1-alt1: build OK
2024-Oct-11 08:10:43 :: [aarch64] task processing CANCELLED
2024-Oct-11 08:29:37 :: [ppc64le] #400 python3-module-hypothesis-jsonschema.git 0.23.1-alt1: build OK
2024-Oct-11 08:29:37 :: [ppc64le] task processing CANCELLED
2024-Oct-11 08:09:16 :: [i586] build FAILED
2024-Oct-11 08:10:43 :: [aarch64] build FAILED
2024-Oct-11 08:29:38 :: [ppc64le] build FAILED
2024-Oct-11 08:29:38 :: task #359511 for sisyphus FAILED


^ permalink raw reply	[flat|nested] 6+ messages in thread

* [#359511] [test-only] FAILED (try 2) python3-module-harfile.git=0.3.0-alt1 ...
  2024-10-11  8:29 [#359511] [test-only] FAILED python3-module-harfile.git=0.3.0-alt1 Girar awaiter (enimalojd)
@ 2024-10-11 11:01 ` Girar awaiter (enimalojd)
  2024-10-11 12:16 ` [#359511] [test-only] FAILED (try 3) python3-module-harfile.git=0.3.0-alt1 Girar awaiter (enimalojd)
                   ` (3 subsequent siblings)
  4 siblings, 0 replies; 6+ messages in thread
From: Girar awaiter (enimalojd) @ 2024-10-11 11:01 UTC (permalink / raw)
  To: Evgeniy Martynenko; +Cc: sisyphus-incominger, girar-builder-sisyphus

https://git.altlinux.org/tasks/359511/logs/events.2.1.log

subtask  name                                 aarch64    i586  ppc64le  x86_64
   #500  python3-module-hypothesis-openapi       1:29      44     1:57    1:08
   #600  python3-module-junit-xml                  41      26       43      26
   #700  python3-module-pyrate-limiter           6:04    5:47     6:12    5:46
  #1000  python3-module-starlette-testclient       38      24       41      25
  #1100  python3-module-schemathesis           failed  failed    24:19    7:37

2024-Oct-11 10:25:10 :: test-only task #359511 for sisyphus resumed by enimalojd:
#100 build 0.3.0-alt1 from /people/enimalojd/packages/python3-module-harfile.git fetched at 2024-Oct-11 07:27:00
#200 build 2.2.1-alt1 from /people/enimalojd/packages/python3-module-backoff.git fetched at 2024-Oct-11 07:27:20
#300 build 0.11.1-alt1 from /people/enimalojd/packages/python3-module-hypothesis-graphql.git fetched at 2024-Oct-11 07:27:45
#400 build 0.23.1-alt1 from /people/enimalojd/packages/python3-module-hypothesis-jsonschema.git fetched at 2024-Oct-11 07:28:13
#500 build 0.2.1-alt1 from /people/enimalojd/packages/python3-module-hypothesis-openapi.git fetched at 2024-Oct-11 07:28:31
#600 build 1.9-alt1 from /people/enimalojd/packages/python3-module-junit-xml.git fetched at 2024-Oct-11 07:28:56
#700 build 3.7.0-alt1 from /people/enimalojd/packages/python3-module-pyrate-limiter.git fetched at 2024-Oct-11 07:29:15
#1000 build 0.4.0-alt1 from /people/enimalojd/packages/python3-module-starlette-testclient.git fetched at 2024-Oct-11 07:29:49
#1100 build 3.36.4-alt1 from /people/enimalojd/packages/python3-module-schemathesis.git fetched at 2024-Oct-11 07:31:08
2024-Oct-11 10:25:11 :: created build repo
2024-Oct-11 10:25:11 :: #500: force rebuild
2024-Oct-11 10:25:11 :: #600: force rebuild
2024-Oct-11 10:25:12 :: #700: force rebuild
2024-Oct-11 10:25:12 :: #1000: force rebuild
2024-Oct-11 10:25:12 :: #1100: force rebuild
2024-Oct-11 10:25:12 :: [i586] #100 python3-module-harfile.git 0.3.0-alt1: build start
2024-Oct-11 10:25:12 :: [aarch64] #100 python3-module-harfile.git 0.3.0-alt1: build start
2024-Oct-11 10:25:12 :: [ppc64le] #100 python3-module-harfile.git 0.3.0-alt1: build start
2024-Oct-11 10:25:12 :: [x86_64] #100 python3-module-harfile.git 0.3.0-alt1: build start
2024-Oct-11 10:25:30 :: [i586] #100 python3-module-harfile.git 0.3.0-alt1: build OK (cached)
2024-Oct-11 10:25:30 :: [i586] #200 python3-module-backoff.git 2.2.1-alt1: build start
2024-Oct-11 10:25:30 :: [x86_64] #100 python3-module-harfile.git 0.3.0-alt1: build OK (cached)
2024-Oct-11 10:25:30 :: [x86_64] #200 python3-module-backoff.git 2.2.1-alt1: build start
2024-Oct-11 10:25:43 :: [i586] #200 python3-module-backoff.git 2.2.1-alt1: build OK (cached)
2024-Oct-11 10:25:43 :: [i586] #300 python3-module-hypothesis-graphql.git 0.11.1-alt1: build start
2024-Oct-11 10:25:44 :: [x86_64] #200 python3-module-backoff.git 2.2.1-alt1: build OK (cached)
2024-Oct-11 10:25:44 :: [x86_64] #300 python3-module-hypothesis-graphql.git 0.11.1-alt1: build start
2024-Oct-11 10:25:46 :: [aarch64] #100 python3-module-harfile.git 0.3.0-alt1: build OK (cached)
2024-Oct-11 10:25:46 :: [aarch64] #200 python3-module-backoff.git 2.2.1-alt1: build start
2024-Oct-11 10:25:53 :: [ppc64le] #100 python3-module-harfile.git 0.3.0-alt1: build OK (cached)
2024-Oct-11 10:25:53 :: [ppc64le] #200 python3-module-backoff.git 2.2.1-alt1: build start
2024-Oct-11 10:25:56 :: [i586] #300 python3-module-hypothesis-graphql.git 0.11.1-alt1: build OK (cached)
2024-Oct-11 10:25:56 :: [i586] #400 python3-module-hypothesis-jsonschema.git 0.23.1-alt1: build start
2024-Oct-11 10:25:57 :: [x86_64] #300 python3-module-hypothesis-graphql.git 0.11.1-alt1: build OK (cached)
2024-Oct-11 10:25:57 :: [x86_64] #400 python3-module-hypothesis-jsonschema.git 0.23.1-alt1: build start
2024-Oct-11 10:26:09 :: [i586] #400 python3-module-hypothesis-jsonschema.git 0.23.1-alt1: build OK (cached)
2024-Oct-11 10:26:09 :: [i586] #500 python3-module-hypothesis-openapi.git 0.2.1-alt1: build start
2024-Oct-11 10:26:10 :: [aarch64] #200 python3-module-backoff.git 2.2.1-alt1: build OK (cached)
2024-Oct-11 10:26:10 :: [aarch64] #300 python3-module-hypothesis-graphql.git 0.11.1-alt1: build start
2024-Oct-11 10:26:11 :: [x86_64] #400 python3-module-hypothesis-jsonschema.git 0.23.1-alt1: build OK (cached)
2024-Oct-11 10:26:11 :: [x86_64] #500 python3-module-hypothesis-openapi.git 0.2.1-alt1: build start
2024-Oct-11 10:26:18 :: [ppc64le] #200 python3-module-backoff.git 2.2.1-alt1: build OK (cached)
2024-Oct-11 10:26:18 :: [ppc64le] #300 python3-module-hypothesis-graphql.git 0.11.1-alt1: build start
2024-Oct-11 10:26:33 :: [aarch64] #300 python3-module-hypothesis-graphql.git 0.11.1-alt1: build OK (cached)
2024-Oct-11 10:26:34 :: [aarch64] #400 python3-module-hypothesis-jsonschema.git 0.23.1-alt1: build start
2024-Oct-11 10:26:42 :: [ppc64le] #300 python3-module-hypothesis-graphql.git 0.11.1-alt1: build OK (cached)
2024-Oct-11 10:26:42 :: [ppc64le] #400 python3-module-hypothesis-jsonschema.git 0.23.1-alt1: build start
2024-Oct-11 10:26:53 :: [i586] #500 python3-module-hypothesis-openapi.git 0.2.1-alt1: build OK
2024-Oct-11 10:26:53 :: [i586] #600 python3-module-junit-xml.git 1.9-alt1: build start
2024-Oct-11 10:26:57 :: [aarch64] #400 python3-module-hypothesis-jsonschema.git 0.23.1-alt1: build OK (cached)
2024-Oct-11 10:26:58 :: [aarch64] #500 python3-module-hypothesis-openapi.git 0.2.1-alt1: build start
2024-Oct-11 10:27:10 :: [ppc64le] #400 python3-module-hypothesis-jsonschema.git 0.23.1-alt1: build OK (cached)
2024-Oct-11 10:27:10 :: [ppc64le] #500 python3-module-hypothesis-openapi.git 0.2.1-alt1: build start
2024-Oct-11 10:27:19 :: [i586] #600 python3-module-junit-xml.git 1.9-alt1: build OK
2024-Oct-11 10:27:19 :: [i586] #700 python3-module-pyrate-limiter.git 3.7.0-alt1: build start
2024-Oct-11 10:27:19 :: [x86_64] #500 python3-module-hypothesis-openapi.git 0.2.1-alt1: build OK
2024-Oct-11 10:27:19 :: [x86_64] #600 python3-module-junit-xml.git 1.9-alt1: build start
2024-Oct-11 10:27:45 :: [x86_64] #600 python3-module-junit-xml.git 1.9-alt1: build OK
2024-Oct-11 10:27:46 :: [x86_64] #700 python3-module-pyrate-limiter.git 3.7.0-alt1: build start
2024-Oct-11 10:28:27 :: [aarch64] #500 python3-module-hypothesis-openapi.git 0.2.1-alt1: build OK
2024-Oct-11 10:28:27 :: [aarch64] #600 python3-module-junit-xml.git 1.9-alt1: build start
2024-Oct-11 10:29:07 :: [ppc64le] #500 python3-module-hypothesis-openapi.git 0.2.1-alt1: build OK
2024-Oct-11 10:29:07 :: [ppc64le] #600 python3-module-junit-xml.git 1.9-alt1: build start
2024-Oct-11 10:29:08 :: [aarch64] #600 python3-module-junit-xml.git 1.9-alt1: build OK
2024-Oct-11 10:29:09 :: [aarch64] #700 python3-module-pyrate-limiter.git 3.7.0-alt1: build start
2024-Oct-11 10:29:50 :: [ppc64le] #600 python3-module-junit-xml.git 1.9-alt1: build OK
2024-Oct-11 10:29:50 :: [ppc64le] #700 python3-module-pyrate-limiter.git 3.7.0-alt1: build start
2024-Oct-11 10:33:06 :: [i586] #700 python3-module-pyrate-limiter.git 3.7.0-alt1: build OK
2024-Oct-11 10:33:06 :: [i586] #1000 python3-module-starlette-testclient.git 0.4.0-alt1: build start
2024-Oct-11 10:33:30 :: [i586] #1000 python3-module-starlette-testclient.git 0.4.0-alt1: build OK
2024-Oct-11 10:33:30 :: [i586] #1100 python3-module-schemathesis.git 3.36.4-alt1: build start
2024-Oct-11 10:33:32 :: [x86_64] #700 python3-module-pyrate-limiter.git 3.7.0-alt1: build OK
2024-Oct-11 10:33:32 :: [x86_64] #1000 python3-module-starlette-testclient.git 0.4.0-alt1: build start
2024-Oct-11 10:33:57 :: [x86_64] #1000 python3-module-starlette-testclient.git 0.4.0-alt1: build OK
2024-Oct-11 10:33:57 :: [x86_64] #1100 python3-module-schemathesis.git 3.36.4-alt1: build start
2024-Oct-11 10:35:13 :: [aarch64] #700 python3-module-pyrate-limiter.git 3.7.0-alt1: build OK
2024-Oct-11 10:35:14 :: [aarch64] #1000 python3-module-starlette-testclient.git 0.4.0-alt1: build start
2024-Oct-11 10:35:52 :: [aarch64] #1000 python3-module-starlette-testclient.git 0.4.0-alt1: build OK
2024-Oct-11 10:35:53 :: [aarch64] #1100 python3-module-schemathesis.git 3.36.4-alt1: build start
2024-Oct-11 10:36:02 :: [ppc64le] #700 python3-module-pyrate-limiter.git 3.7.0-alt1: build OK
2024-Oct-11 10:36:02 :: [ppc64le] #1000 python3-module-starlette-testclient.git 0.4.0-alt1: build start
2024-Oct-11 10:36:43 :: [ppc64le] #1000 python3-module-starlette-testclient.git 0.4.0-alt1: build OK
2024-Oct-11 10:36:43 :: [ppc64le] #1100 python3-module-schemathesis.git 3.36.4-alt1: build start
2024-Oct-11 10:41:34 :: [x86_64] #1100 python3-module-schemathesis.git 3.36.4-alt1: build OK
[i586] XPASS test/contrib/test_unique_data.py::test_python_tests[None] - The `schemathesis.contrib.unique_data` hook is deprecated
[i586] FAILED test/specs/openapi/test_randomized.py::test_random_schemas - Assertion...
[i586] = 1 failed, 2648 passed, 4 skipped, 4 xpassed, 5720 warnings in 481.15s (0:08:01) =
[i586] INFO     : Command's result: FAILURE
[i586] INFO     : Command's error: Command '['python3', '-m', 'pytest', 'test/']' returned non-zero exit status 1.
2024-Oct-11 10:42:50 :: [i586] python3-module-schemathesis.git 3.36.4-alt1: remote: build failed
2024-Oct-11 10:42:50 :: [i586] #1100 python3-module-schemathesis.git 3.36.4-alt1: build FAILED
2024-Oct-11 10:42:50 :: [i586] requesting cancellation of task processing
[aarch64] XPASS test/contrib/test_unique_data.py::test_python_tests[None] - The `schemathesis.contrib.unique_data` hook is deprecated
[aarch64] FAILED test/specs/openapi/test_randomized.py::test_random_schemas - hypothesi...
[aarch64] = 1 failed, 2648 passed, 4 skipped, 4 xpassed, 5734 warnings in 1226.07s (0:20:26) =
[aarch64] INFO     : Command's result: FAILURE
[aarch64] INFO     : Command's error: Command '['python3', '-m', 'pytest', 'test/']' returned non-zero exit status 1.
2024-Oct-11 10:58:11 :: [aarch64] python3-module-schemathesis.git 3.36.4-alt1: remote: build failed
2024-Oct-11 10:58:11 :: [aarch64] #1100 python3-module-schemathesis.git 3.36.4-alt1: build FAILED
2024-Oct-11 11:01:02 :: [ppc64le] #1100 python3-module-schemathesis.git 3.36.4-alt1: build OK
2024-Oct-11 10:42:50 :: [i586] build FAILED
2024-Oct-11 10:58:11 :: [aarch64] build FAILED
2024-Oct-11 11:01:02 :: task #359511 for sisyphus FAILED


^ permalink raw reply	[flat|nested] 6+ messages in thread

* [#359511] [test-only] FAILED (try 3) python3-module-harfile.git=0.3.0-alt1 ...
  2024-10-11  8:29 [#359511] [test-only] FAILED python3-module-harfile.git=0.3.0-alt1 Girar awaiter (enimalojd)
  2024-10-11 11:01 ` [#359511] [test-only] FAILED (try 2) python3-module-harfile.git=0.3.0-alt1 Girar awaiter (enimalojd)
@ 2024-10-11 12:16 ` Girar awaiter (enimalojd)
  2024-11-28 14:47 ` [#359511] [test-only] FAILED (try 4) python3-module-harfile.git=0.3.0-alt1 Girar awaiter (enimalojd)
                   ` (2 subsequent siblings)
  4 siblings, 0 replies; 6+ messages in thread
From: Girar awaiter (enimalojd) @ 2024-10-11 12:16 UTC (permalink / raw)
  To: Evgeniy Martynenko; +Cc: sisyphus-incominger, girar-builder-sisyphus

https://git.altlinux.org/tasks/359511/logs/events.3.1.log

subtask  name                                  aarch64   i586  ppc64le  x86_64
   #100  python3-module-harfile                   1:13     45     1:27      42
   #300  python3-module-hypothesis-graphql        4:53   2:28     6:10    2:30
   #400  python3-module-hypothesis-jsonschema    32:00  17:33    53:19   15:09
   #500  python3-module-hypothesis-openapi        1:31     44     1:38      58
  #1100  python3-module-schemathesis            failed   7:12        ?   10:32

2024-Oct-11 11:13:12 :: test-only task #359511 for sisyphus resumed by enimalojd:
#100 build 0.3.0-alt1 from /people/enimalojd/packages/python3-module-harfile.git fetched at 2024-Oct-11 07:27:00
#200 build 2.2.1-alt1 from /people/enimalojd/packages/python3-module-backoff.git fetched at 2024-Oct-11 07:27:20
#300 build 0.11.1-alt1 from /people/enimalojd/packages/python3-module-hypothesis-graphql.git fetched at 2024-Oct-11 07:27:45
#400 build 0.23.1-alt1 from /people/enimalojd/packages/python3-module-hypothesis-jsonschema.git fetched at 2024-Oct-11 07:28:13
#500 build 0.2.1-alt1 from /people/enimalojd/packages/python3-module-hypothesis-openapi.git fetched at 2024-Oct-11 07:28:31
#600 build 1.9-alt1 from /people/enimalojd/packages/python3-module-junit-xml.git fetched at 2024-Oct-11 07:28:56
#700 build 3.7.0-alt1 from /people/enimalojd/packages/python3-module-pyrate-limiter.git fetched at 2024-Oct-11 07:29:15
#1000 build 0.4.0-alt1 from /people/enimalojd/packages/python3-module-starlette-testclient.git fetched at 2024-Oct-11 07:29:49
#1100 build 3.36.4-alt1 from /people/enimalojd/packages/python3-module-schemathesis.git fetched at 2024-Oct-11 07:31:08
2024-Oct-11 11:13:13 :: created build repo
2024-Oct-11 11:13:13 :: #1100: force rebuild
2024-Oct-11 11:13:14 :: [x86_64] #100 python3-module-harfile.git 0.3.0-alt1: build start
2024-Oct-11 11:13:14 :: [aarch64] #100 python3-module-harfile.git 0.3.0-alt1: build start
2024-Oct-11 11:13:14 :: [i586] #100 python3-module-harfile.git 0.3.0-alt1: build start
2024-Oct-11 11:13:14 :: [ppc64le] #100 python3-module-harfile.git 0.3.0-alt1: build start
2024-Oct-11 11:13:56 :: [x86_64] #100 python3-module-harfile.git 0.3.0-alt1: build OK
2024-Oct-11 11:13:56 :: [x86_64] #200 python3-module-backoff.git 2.2.1-alt1: build start
2024-Oct-11 11:13:59 :: [i586] #100 python3-module-harfile.git 0.3.0-alt1: build OK
2024-Oct-11 11:13:59 :: [i586] #200 python3-module-backoff.git 2.2.1-alt1: build start
2024-Oct-11 11:14:09 :: [x86_64] #200 python3-module-backoff.git 2.2.1-alt1: build OK (cached)
2024-Oct-11 11:14:10 :: [x86_64] #300 python3-module-hypothesis-graphql.git 0.11.1-alt1: build start
2024-Oct-11 11:14:12 :: [i586] #200 python3-module-backoff.git 2.2.1-alt1: build OK (cached)
2024-Oct-11 11:14:12 :: [i586] #300 python3-module-hypothesis-graphql.git 0.11.1-alt1: build start
2024-Oct-11 11:14:27 :: [aarch64] #100 python3-module-harfile.git 0.3.0-alt1: build OK
2024-Oct-11 11:14:28 :: [aarch64] #200 python3-module-backoff.git 2.2.1-alt1: build start
2024-Oct-11 11:14:41 :: [ppc64le] #100 python3-module-harfile.git 0.3.0-alt1: build OK
2024-Oct-11 11:14:41 :: [ppc64le] #200 python3-module-backoff.git 2.2.1-alt1: build start
2024-Oct-11 11:14:51 :: [aarch64] #200 python3-module-backoff.git 2.2.1-alt1: build OK (cached)
2024-Oct-11 11:14:51 :: [aarch64] #300 python3-module-hypothesis-graphql.git 0.11.1-alt1: build start
2024-Oct-11 11:15:06 :: [ppc64le] #200 python3-module-backoff.git 2.2.1-alt1: build OK (cached)
2024-Oct-11 11:15:07 :: [ppc64le] #300 python3-module-hypothesis-graphql.git 0.11.1-alt1: build start
2024-Oct-11 11:16:40 :: [x86_64] #300 python3-module-hypothesis-graphql.git 0.11.1-alt1: build OK
2024-Oct-11 11:16:40 :: [x86_64] #400 python3-module-hypothesis-jsonschema.git 0.23.1-alt1: build start
2024-Oct-11 11:16:40 :: [i586] #300 python3-module-hypothesis-graphql.git 0.11.1-alt1: build OK
2024-Oct-11 11:16:40 :: [i586] #400 python3-module-hypothesis-jsonschema.git 0.23.1-alt1: build start
2024-Oct-11 11:19:44 :: [aarch64] #300 python3-module-hypothesis-graphql.git 0.11.1-alt1: build OK
2024-Oct-11 11:19:44 :: [aarch64] #400 python3-module-hypothesis-jsonschema.git 0.23.1-alt1: build start
2024-Oct-11 11:21:17 :: [ppc64le] #300 python3-module-hypothesis-graphql.git 0.11.1-alt1: build OK
2024-Oct-11 11:21:18 :: [ppc64le] #400 python3-module-hypothesis-jsonschema.git 0.23.1-alt1: build start
2024-Oct-11 11:31:49 :: [x86_64] #400 python3-module-hypothesis-jsonschema.git 0.23.1-alt1: build OK
2024-Oct-11 11:31:49 :: [x86_64] #500 python3-module-hypothesis-openapi.git 0.2.1-alt1: build start
2024-Oct-11 11:32:47 :: [x86_64] #500 python3-module-hypothesis-openapi.git 0.2.1-alt1: build OK
2024-Oct-11 11:32:48 :: [x86_64] #600 python3-module-junit-xml.git 1.9-alt1: build start
2024-Oct-11 11:33:00 :: [x86_64] #600 python3-module-junit-xml.git 1.9-alt1: build OK (cached)
2024-Oct-11 11:33:00 :: [x86_64] #700 python3-module-pyrate-limiter.git 3.7.0-alt1: build start
2024-Oct-11 11:33:14 :: [x86_64] #700 python3-module-pyrate-limiter.git 3.7.0-alt1: build OK (cached)
2024-Oct-11 11:33:14 :: [x86_64] #1000 python3-module-starlette-testclient.git 0.4.0-alt1: build start
2024-Oct-11 11:33:28 :: [x86_64] #1000 python3-module-starlette-testclient.git 0.4.0-alt1: build OK (cached)
2024-Oct-11 11:33:28 :: [x86_64] #1100 python3-module-schemathesis.git 3.36.4-alt1: build start
2024-Oct-11 11:34:13 :: [i586] #400 python3-module-hypothesis-jsonschema.git 0.23.1-alt1: build OK
2024-Oct-11 11:34:13 :: [i586] #500 python3-module-hypothesis-openapi.git 0.2.1-alt1: build start
2024-Oct-11 11:34:57 :: [i586] #500 python3-module-hypothesis-openapi.git 0.2.1-alt1: build OK
2024-Oct-11 11:34:57 :: [i586] #600 python3-module-junit-xml.git 1.9-alt1: build start
2024-Oct-11 11:35:09 :: [i586] #600 python3-module-junit-xml.git 1.9-alt1: build OK (cached)
2024-Oct-11 11:35:09 :: [i586] #700 python3-module-pyrate-limiter.git 3.7.0-alt1: build start
2024-Oct-11 11:35:22 :: [i586] #700 python3-module-pyrate-limiter.git 3.7.0-alt1: build OK (cached)
2024-Oct-11 11:35:22 :: [i586] #1000 python3-module-starlette-testclient.git 0.4.0-alt1: build start
2024-Oct-11 11:35:34 :: [i586] #1000 python3-module-starlette-testclient.git 0.4.0-alt1: build OK (cached)
2024-Oct-11 11:35:35 :: [i586] #1100 python3-module-schemathesis.git 3.36.4-alt1: build start
2024-Oct-11 11:42:47 :: [i586] #1100 python3-module-schemathesis.git 3.36.4-alt1: build OK
2024-Oct-11 11:44:00 :: [x86_64] #1100 python3-module-schemathesis.git 3.36.4-alt1: build OK
2024-Oct-11 11:51:44 :: [aarch64] #400 python3-module-hypothesis-jsonschema.git 0.23.1-alt1: build OK
2024-Oct-11 11:51:44 :: [aarch64] #500 python3-module-hypothesis-openapi.git 0.2.1-alt1: build start
2024-Oct-11 11:53:15 :: [aarch64] #500 python3-module-hypothesis-openapi.git 0.2.1-alt1: build OK
2024-Oct-11 11:53:15 :: [aarch64] #600 python3-module-junit-xml.git 1.9-alt1: build start
2024-Oct-11 11:53:38 :: [aarch64] #600 python3-module-junit-xml.git 1.9-alt1: build OK (cached)
2024-Oct-11 11:53:38 :: [aarch64] #700 python3-module-pyrate-limiter.git 3.7.0-alt1: build start
2024-Oct-11 11:54:02 :: [aarch64] #700 python3-module-pyrate-limiter.git 3.7.0-alt1: build OK (cached)
2024-Oct-11 11:54:03 :: [aarch64] #1000 python3-module-starlette-testclient.git 0.4.0-alt1: build start
2024-Oct-11 11:54:26 :: [aarch64] #1000 python3-module-starlette-testclient.git 0.4.0-alt1: build OK (cached)
2024-Oct-11 11:54:27 :: [aarch64] #1100 python3-module-schemathesis.git 3.36.4-alt1: build start
2024-Oct-11 12:14:37 :: [ppc64le] #400 python3-module-hypothesis-jsonschema.git 0.23.1-alt1: build OK
2024-Oct-11 12:14:38 :: [ppc64le] #500 python3-module-hypothesis-openapi.git 0.2.1-alt1: build start
[aarch64] XPASS test/contrib/test_unique_data.py::test_python_tests[None] - The `schemathesis.contrib.unique_data` hook is deprecated
[aarch64] FAILED test/specs/openapi/test_randomized.py::test_random_schemas - hypothesi...
[aarch64] = 1 failed, 2648 passed, 4 skipped, 4 xpassed, 5669 warnings in 1184.68s (0:19:44) =
[aarch64] INFO     : Command's result: FAILURE
[aarch64] INFO     : Command's error: Command '['python3', '-m', 'pytest', 'test/']' returned non-zero exit status 1.
2024-Oct-11 12:16:06 :: [aarch64] python3-module-schemathesis.git 3.36.4-alt1: remote: build failed
2024-Oct-11 12:16:06 :: [aarch64] #1100 python3-module-schemathesis.git 3.36.4-alt1: build FAILED
2024-Oct-11 12:16:06 :: [aarch64] requesting cancellation of task processing
2024-Oct-11 12:16:16 :: [ppc64le] #500 python3-module-hypothesis-openapi.git 0.2.1-alt1: build OK
2024-Oct-11 12:16:16 :: [ppc64le] task processing CANCELLED
2024-Oct-11 12:16:06 :: [aarch64] build FAILED
2024-Oct-11 12:16:17 :: [ppc64le] build FAILED
2024-Oct-11 12:16:17 :: task #359511 for sisyphus FAILED


^ permalink raw reply	[flat|nested] 6+ messages in thread

* [#359511] [test-only] FAILED (try 4) python3-module-harfile.git=0.3.0-alt1 ...
  2024-10-11  8:29 [#359511] [test-only] FAILED python3-module-harfile.git=0.3.0-alt1 Girar awaiter (enimalojd)
  2024-10-11 11:01 ` [#359511] [test-only] FAILED (try 2) python3-module-harfile.git=0.3.0-alt1 Girar awaiter (enimalojd)
  2024-10-11 12:16 ` [#359511] [test-only] FAILED (try 3) python3-module-harfile.git=0.3.0-alt1 Girar awaiter (enimalojd)
@ 2024-11-28 14:47 ` Girar awaiter (enimalojd)
  2025-01-09 11:54 ` [#359511] [test-only] FAILED (try 5) python3-module-harfile.git=0.3.0-alt1 Girar awaiter (enimalojd)
  2025-01-09 15:01 ` [#359511] [test-only] FAILED (try 6) python3-module-harfile.git=0.3.0-alt1 Girar awaiter (enimalojd)
  4 siblings, 0 replies; 6+ messages in thread
From: Girar awaiter (enimalojd) @ 2024-11-28 14:47 UTC (permalink / raw)
  To: Evgeniy Martynenko; +Cc: sisyphus-incominger, girar-builder-sisyphus

https://git.altlinux.org/tasks/359511/logs/events.4.1.log

subtask  name                                  aarch64    i586  ppc64le  x86_64
   #100  python3-module-harfile                   1:18      43     1:29      42
   #200  python3-module-backoff                     44      27       44      27
   #300  python3-module-hypothesis-graphql        4:44    2:30     6:02    2:29
   #400  python3-module-hypothesis-jsonschema    36:19   16:59    55:36   14:22
   #500  python3-module-hypothesis-openapi        1:34      46     1:44      56
   #600  python3-module-junit-xml                   42      26       45      26
   #700  python3-module-pyrate-limiter            6:03    5:42     6:07    5:41
  #1000  python3-module-starlette-testclient      1:10      24        ?      24
  #1200  python3-module-schemathesis            failed  failed        ?  failed

2024-Nov-28 12:27:57 :: test-only task #359511 for sisyphus resumed by enimalojd:
#100 build 0.3.0-alt1 from /people/enimalojd/packages/python3-module-harfile.git fetched at 2024-Oct-11 07:27:00
#200 build 2.2.1-alt1 from /people/enimalojd/packages/python3-module-backoff.git fetched at 2024-Oct-11 07:27:20
#300 build 0.11.1-alt1 from /people/enimalojd/packages/python3-module-hypothesis-graphql.git fetched at 2024-Oct-11 07:27:45
#400 build 0.23.1-alt1 from /people/enimalojd/packages/python3-module-hypothesis-jsonschema.git fetched at 2024-Oct-11 07:28:13
#500 build 0.2.1-alt1 from /people/enimalojd/packages/python3-module-hypothesis-openapi.git fetched at 2024-Oct-11 07:28:31
#600 build 1.9-alt1 from /people/enimalojd/packages/python3-module-junit-xml.git fetched at 2024-Oct-11 07:28:56
#700 build 3.7.0-alt1 from /people/enimalojd/packages/python3-module-pyrate-limiter.git fetched at 2024-Oct-11 07:29:15
#1000 build 0.4.0-alt1 from /people/enimalojd/packages/python3-module-starlette-testclient.git fetched at 2024-Oct-11 07:29:49
#1100 removed
#1200 build 3.36.4-alt1 from /people/enimalojd/packages/python3-module-schemathesis.git fetched at 2024-Nov-28 12:27:27
2024-Nov-28 12:27:57 :: created build repo
2024-Nov-28 12:27:58 :: #600: force rebuild
2024-Nov-28 12:27:58 :: #700: force rebuild
2024-Nov-28 12:27:59 :: #1000: force rebuild
2024-Nov-28 12:27:59 :: [x86_64] #100 python3-module-harfile.git 0.3.0-alt1: build start
2024-Nov-28 12:27:59 :: [i586] #100 python3-module-harfile.git 0.3.0-alt1: build start
2024-Nov-28 12:27:59 :: [ppc64le] #100 python3-module-harfile.git 0.3.0-alt1: build start
2024-Nov-28 12:27:59 :: [aarch64] #100 python3-module-harfile.git 0.3.0-alt1: build start
2024-Nov-28 12:28:41 :: [x86_64] #100 python3-module-harfile.git 0.3.0-alt1: build OK
2024-Nov-28 12:28:41 :: [x86_64] #200 python3-module-backoff.git 2.2.1-alt1: build start
2024-Nov-28 12:28:42 :: [i586] #100 python3-module-harfile.git 0.3.0-alt1: build OK
2024-Nov-28 12:28:42 :: [i586] #200 python3-module-backoff.git 2.2.1-alt1: build start
2024-Nov-28 12:29:08 :: [x86_64] #200 python3-module-backoff.git 2.2.1-alt1: build OK
2024-Nov-28 12:29:08 :: [x86_64] #300 python3-module-hypothesis-graphql.git 0.11.1-alt1: build start
2024-Nov-28 12:29:09 :: [i586] #200 python3-module-backoff.git 2.2.1-alt1: build OK
2024-Nov-28 12:29:09 :: [i586] #300 python3-module-hypothesis-graphql.git 0.11.1-alt1: build start
2024-Nov-28 12:29:17 :: [aarch64] #100 python3-module-harfile.git 0.3.0-alt1: build OK
2024-Nov-28 12:29:17 :: [aarch64] #200 python3-module-backoff.git 2.2.1-alt1: build start
2024-Nov-28 12:29:28 :: [ppc64le] #100 python3-module-harfile.git 0.3.0-alt1: build OK
2024-Nov-28 12:29:28 :: [ppc64le] #200 python3-module-backoff.git 2.2.1-alt1: build start
2024-Nov-28 12:30:01 :: [aarch64] #200 python3-module-backoff.git 2.2.1-alt1: build OK
2024-Nov-28 12:30:01 :: [aarch64] #300 python3-module-hypothesis-graphql.git 0.11.1-alt1: build start
2024-Nov-28 12:30:12 :: [ppc64le] #200 python3-module-backoff.git 2.2.1-alt1: build OK
2024-Nov-28 12:30:12 :: [ppc64le] #300 python3-module-hypothesis-graphql.git 0.11.1-alt1: build start
2024-Nov-28 12:31:37 :: [x86_64] #300 python3-module-hypothesis-graphql.git 0.11.1-alt1: build OK
2024-Nov-28 12:31:37 :: [x86_64] #400 python3-module-hypothesis-jsonschema.git 0.23.1-alt1: build start
2024-Nov-28 12:31:39 :: [i586] #300 python3-module-hypothesis-graphql.git 0.11.1-alt1: build OK
2024-Nov-28 12:31:39 :: [i586] #400 python3-module-hypothesis-jsonschema.git 0.23.1-alt1: build start
2024-Nov-28 12:34:45 :: [aarch64] #300 python3-module-hypothesis-graphql.git 0.11.1-alt1: build OK
2024-Nov-28 12:34:45 :: [aarch64] #400 python3-module-hypothesis-jsonschema.git 0.23.1-alt1: build start
2024-Nov-28 12:36:14 :: [ppc64le] #300 python3-module-hypothesis-graphql.git 0.11.1-alt1: build OK
2024-Nov-28 12:36:14 :: [ppc64le] #400 python3-module-hypothesis-jsonschema.git 0.23.1-alt1: build start
2024-Nov-28 12:45:59 :: [x86_64] #400 python3-module-hypothesis-jsonschema.git 0.23.1-alt1: build OK
2024-Nov-28 12:45:59 :: [x86_64] #500 python3-module-hypothesis-openapi.git 0.2.1-alt1: build start
2024-Nov-28 12:46:55 :: [x86_64] #500 python3-module-hypothesis-openapi.git 0.2.1-alt1: build OK
2024-Nov-28 12:46:55 :: [x86_64] #600 python3-module-junit-xml.git 1.9-alt1: build start
2024-Nov-28 12:47:21 :: [x86_64] #600 python3-module-junit-xml.git 1.9-alt1: build OK
2024-Nov-28 12:47:21 :: [x86_64] #700 python3-module-pyrate-limiter.git 3.7.0-alt1: build start
2024-Nov-28 12:48:38 :: [i586] #400 python3-module-hypothesis-jsonschema.git 0.23.1-alt1: build OK
2024-Nov-28 12:48:38 :: [i586] #500 python3-module-hypothesis-openapi.git 0.2.1-alt1: build start
2024-Nov-28 12:49:24 :: [i586] #500 python3-module-hypothesis-openapi.git 0.2.1-alt1: build OK
2024-Nov-28 12:49:24 :: [i586] #600 python3-module-junit-xml.git 1.9-alt1: build start
2024-Nov-28 12:49:50 :: [i586] #600 python3-module-junit-xml.git 1.9-alt1: build OK
2024-Nov-28 12:49:50 :: [i586] #700 python3-module-pyrate-limiter.git 3.7.0-alt1: build start
2024-Nov-28 12:53:02 :: [x86_64] #700 python3-module-pyrate-limiter.git 3.7.0-alt1: build OK
2024-Nov-28 12:53:02 :: [x86_64] #1000 python3-module-starlette-testclient.git 0.4.0-alt1: build start
2024-Nov-28 12:53:26 :: [x86_64] #1000 python3-module-starlette-testclient.git 0.4.0-alt1: build OK
2024-Nov-28 12:53:27 :: [x86_64] #1200 python3-module-schemathesis.git 3.36.4-alt1: build start
2024-Nov-28 12:55:32 :: [i586] #700 python3-module-pyrate-limiter.git 3.7.0-alt1: build OK
2024-Nov-28 12:55:32 :: [i586] #1000 python3-module-starlette-testclient.git 0.4.0-alt1: build start
2024-Nov-28 12:55:56 :: [i586] #1000 python3-module-starlette-testclient.git 0.4.0-alt1: build OK
2024-Nov-28 12:55:56 :: [i586] #1200 python3-module-schemathesis.git 3.36.4-alt1: build start
2024-Nov-28 13:11:04 :: [aarch64] #400 python3-module-hypothesis-jsonschema.git 0.23.1-alt1: build OK
2024-Nov-28 13:11:04 :: [aarch64] #500 python3-module-hypothesis-openapi.git 0.2.1-alt1: build start
2024-Nov-28 13:12:38 :: [aarch64] #500 python3-module-hypothesis-openapi.git 0.2.1-alt1: build OK
2024-Nov-28 13:12:39 :: [aarch64] #600 python3-module-junit-xml.git 1.9-alt1: build start
2024-Nov-28 13:13:21 :: [aarch64] #600 python3-module-junit-xml.git 1.9-alt1: build OK
2024-Nov-28 13:13:21 :: [aarch64] #700 python3-module-pyrate-limiter.git 3.7.0-alt1: build start
2024-Nov-28 13:19:24 :: [aarch64] #700 python3-module-pyrate-limiter.git 3.7.0-alt1: build OK
2024-Nov-28 13:19:24 :: [aarch64] #1000 python3-module-starlette-testclient.git 0.4.0-alt1: build start
2024-Nov-28 13:20:34 :: [aarch64] #1000 python3-module-starlette-testclient.git 0.4.0-alt1: build OK
2024-Nov-28 13:20:35 :: [aarch64] #1200 python3-module-schemathesis.git 3.36.4-alt1: build start
2024-Nov-28 13:31:50 :: [ppc64le] #400 python3-module-hypothesis-jsonschema.git 0.23.1-alt1: build OK
2024-Nov-28 13:31:50 :: [ppc64le] #500 python3-module-hypothesis-openapi.git 0.2.1-alt1: build start
2024-Nov-28 13:33:34 :: [ppc64le] #500 python3-module-hypothesis-openapi.git 0.2.1-alt1: build OK
2024-Nov-28 13:33:34 :: [ppc64le] #600 python3-module-junit-xml.git 1.9-alt1: build start
2024-Nov-28 13:34:19 :: [ppc64le] #600 python3-module-junit-xml.git 1.9-alt1: build OK
2024-Nov-28 13:34:19 :: [ppc64le] #700 python3-module-pyrate-limiter.git 3.7.0-alt1: build start
[i586] XPASS test/contrib/test_unique_data.py::test_python_tests[None] - The `schemathesis.contrib.unique_data` hook is deprecated
[i586] FAILED test/cli/test_commands.py::test_recursive_reference_error_message - as...
[i586] FAILED test/specs/openapi/stateful/test_stateful.py::test_hidden_failure[Open API 2.0]
[i586] FAILED test/specs/openapi/stateful/test_stateful.py::test_hidden_failure[Open API 3.0]
[i586] = 3 failed, 2645 passed, 5 skipped, 4 xpassed, 659 warnings in 2424.23s (0:40:24) =
[i586] INFO     : Command's result: FAILURE
[i586] INFO     : Command's error: Command '['python3', '-m', 'pytest', 'test/']' returned non-zero exit status 1.
2024-Nov-28 13:37:40 :: [i586] python3-module-schemathesis.git 3.36.4-alt1: remote: build failed
2024-Nov-28 13:37:40 :: [i586] #1200 python3-module-schemathesis.git 3.36.4-alt1: build FAILED
2024-Nov-28 13:37:40 :: [i586] requesting cancellation of task processing
[x86_64] XPASS test/contrib/test_unique_data.py::test_python_tests[None] - The `schemathesis.contrib.unique_data` hook is deprecated
[x86_64] FAILED test/specs/openapi/stateful/test_stateful.py::test_hidden_failure[Open API 2.0]
[x86_64] FAILED test/specs/openapi/stateful/test_stateful.py::test_hidden_failure[Open API 3.0]
[x86_64] = 2 failed, 2646 passed, 5 skipped, 4 xpassed, 662 warnings in 2714.68s (0:45:14) =
[x86_64] INFO     : Command's result: FAILURE
[x86_64] INFO     : Command's error: Command '['python3', '-m', 'pytest', 'test/']' returned non-zero exit status 1.
2024-Nov-28 13:39:58 :: [x86_64] python3-module-schemathesis.git 3.36.4-alt1: remote: build failed
2024-Nov-28 13:39:58 :: [x86_64] #1200 python3-module-schemathesis.git 3.36.4-alt1: build FAILED
2024-Nov-28 13:40:26 :: [ppc64le] #700 python3-module-pyrate-limiter.git 3.7.0-alt1: build OK
2024-Nov-28 13:40:26 :: [ppc64le] task processing CANCELLED
[aarch64] XPASS test/contrib/test_unique_data.py::test_python_tests[None] - The `schemathesis.contrib.unique_data` hook is deprecated
[aarch64] FAILED test/specs/openapi/stateful/test_stateful.py::test_hidden_failure[Open API 2.0]
[aarch64] FAILED test/specs/openapi/stateful/test_stateful.py::test_hidden_failure[Open API 3.0]
[aarch64] = 2 failed, 2646 passed, 5 skipped, 4 xpassed, 653 warnings in 5042.00s (1:24:01) =
[aarch64] INFO     : Command's result: FAILURE
[aarch64] INFO     : Command's error: Command '['python3', '-m', 'pytest', 'test/']' returned non-zero exit status 1.
2024-Nov-28 14:47:29 :: [aarch64] python3-module-schemathesis.git 3.36.4-alt1: remote: build failed
2024-Nov-28 14:47:29 :: [aarch64] #1200 python3-module-schemathesis.git 3.36.4-alt1: build FAILED
2024-Nov-28 13:37:40 :: [i586] build FAILED
2024-Nov-28 13:39:59 :: [x86_64] build FAILED
2024-Nov-28 13:40:26 :: [ppc64le] build FAILED
2024-Nov-28 14:47:29 :: [aarch64] build FAILED
2024-Nov-28 14:47:29 :: task #359511 for sisyphus FAILED


^ permalink raw reply	[flat|nested] 6+ messages in thread

* [#359511] [test-only] FAILED (try 5) python3-module-harfile.git=0.3.0-alt1 ...
  2024-10-11  8:29 [#359511] [test-only] FAILED python3-module-harfile.git=0.3.0-alt1 Girar awaiter (enimalojd)
                   ` (2 preceding siblings ...)
  2024-11-28 14:47 ` [#359511] [test-only] FAILED (try 4) python3-module-harfile.git=0.3.0-alt1 Girar awaiter (enimalojd)
@ 2025-01-09 11:54 ` Girar awaiter (enimalojd)
  2025-01-09 15:01 ` [#359511] [test-only] FAILED (try 6) python3-module-harfile.git=0.3.0-alt1 Girar awaiter (enimalojd)
  4 siblings, 0 replies; 6+ messages in thread
From: Girar awaiter (enimalojd) @ 2025-01-09 11:54 UTC (permalink / raw)
  To: Evgeniy Martynenko; +Cc: sisyphus-incominger, girar-builder-sisyphus

https://git.altlinux.org/tasks/359511/logs/events.5.1.log
https://packages.altlinux.org/tasks/359511

subtask  name                                  aarch64    i586  ppc64le  x86_64
   #100  python3-module-harfile                   1:17      44     1:33      44
   #200  python3-module-backoff                     43      25       46      26
   #300  python3-module-hypothesis-graphql        5:14    2:35     6:22    2:48
   #400  python3-module-hypothesis-jsonschema   failed  failed  1:35:34  failed

2025-Jan-09 10:10:23 :: test-only task #359511 for sisyphus resumed by enimalojd:
#100 build 0.3.0-alt1 from /people/enimalojd/packages/python3-module-harfile.git fetched at 2024-Oct-11 07:27:00
#200 build 2.2.1-alt1 from /people/enimalojd/packages/python3-module-backoff.git fetched at 2024-Oct-11 07:27:20
#300 build 0.11.1-alt1 from /people/enimalojd/packages/python3-module-hypothesis-graphql.git fetched at 2024-Oct-11 07:27:45
#400 build 0.23.1-alt1 from /people/enimalojd/packages/python3-module-hypothesis-jsonschema.git fetched at 2024-Oct-11 07:28:13
#500 build 0.2.1-alt1 from /people/enimalojd/packages/python3-module-hypothesis-openapi.git fetched at 2024-Oct-11 07:28:31
#600 build 1.9-alt1 from /people/enimalojd/packages/python3-module-junit-xml.git fetched at 2024-Oct-11 07:28:56
#700 build 3.7.0-alt1 from /people/enimalojd/packages/python3-module-pyrate-limiter.git fetched at 2024-Oct-11 07:29:15
#1000 build 0.4.0-alt1 from /people/enimalojd/packages/python3-module-starlette-testclient.git fetched at 2024-Oct-11 07:29:49
#1100 removed
#1200 removed
#1300 build 3.39.5-alt1 from /people/enimalojd/packages/python3-module-schemathesis.git fetched at 2025-Jan-09 10:09:40
2025-Jan-09 10:10:24 :: created build repo
2025-Jan-09 10:10:25 :: #1000: force rebuild
2025-Jan-09 10:10:25 :: [i586] #100 python3-module-harfile.git 0.3.0-alt1: build start
2025-Jan-09 10:10:25 :: [ppc64le] #100 python3-module-harfile.git 0.3.0-alt1: build start
2025-Jan-09 10:10:25 :: [x86_64] #100 python3-module-harfile.git 0.3.0-alt1: build start
2025-Jan-09 10:10:25 :: [aarch64] #100 python3-module-harfile.git 0.3.0-alt1: build start
2025-Jan-09 10:11:09 :: [i586] #100 python3-module-harfile.git 0.3.0-alt1: build OK
2025-Jan-09 10:11:09 :: [i586] #200 python3-module-backoff.git 2.2.1-alt1: build start
2025-Jan-09 10:11:09 :: [x86_64] #100 python3-module-harfile.git 0.3.0-alt1: build OK
2025-Jan-09 10:11:10 :: [x86_64] #200 python3-module-backoff.git 2.2.1-alt1: build start
2025-Jan-09 10:11:34 :: [i586] #200 python3-module-backoff.git 2.2.1-alt1: build OK
2025-Jan-09 10:11:35 :: [i586] #300 python3-module-hypothesis-graphql.git 0.11.1-alt1: build start
2025-Jan-09 10:11:36 :: [x86_64] #200 python3-module-backoff.git 2.2.1-alt1: build OK
2025-Jan-09 10:11:36 :: [x86_64] #300 python3-module-hypothesis-graphql.git 0.11.1-alt1: build start
2025-Jan-09 10:11:42 :: [aarch64] #100 python3-module-harfile.git 0.3.0-alt1: build OK
2025-Jan-09 10:11:43 :: [aarch64] #200 python3-module-backoff.git 2.2.1-alt1: build start
2025-Jan-09 10:11:58 :: [ppc64le] #100 python3-module-harfile.git 0.3.0-alt1: build OK
2025-Jan-09 10:11:58 :: [ppc64le] #200 python3-module-backoff.git 2.2.1-alt1: build start
2025-Jan-09 10:12:26 :: [aarch64] #200 python3-module-backoff.git 2.2.1-alt1: build OK
2025-Jan-09 10:12:26 :: [aarch64] #300 python3-module-hypothesis-graphql.git 0.11.1-alt1: build start
2025-Jan-09 10:12:44 :: [ppc64le] #200 python3-module-backoff.git 2.2.1-alt1: build OK
2025-Jan-09 10:12:44 :: [ppc64le] #300 python3-module-hypothesis-graphql.git 0.11.1-alt1: build start
2025-Jan-09 10:14:10 :: [i586] #300 python3-module-hypothesis-graphql.git 0.11.1-alt1: build OK
2025-Jan-09 10:14:10 :: [i586] #400 python3-module-hypothesis-jsonschema.git 0.23.1-alt1: build start
2025-Jan-09 10:14:24 :: [x86_64] #300 python3-module-hypothesis-graphql.git 0.11.1-alt1: build OK
2025-Jan-09 10:14:24 :: [x86_64] #400 python3-module-hypothesis-jsonschema.git 0.23.1-alt1: build start
2025-Jan-09 10:17:40 :: [aarch64] #300 python3-module-hypothesis-graphql.git 0.11.1-alt1: build OK
2025-Jan-09 10:17:40 :: [aarch64] #400 python3-module-hypothesis-jsonschema.git 0.23.1-alt1: build start
2025-Jan-09 10:19:06 :: [ppc64le] #300 python3-module-hypothesis-graphql.git 0.11.1-alt1: build OK
2025-Jan-09 10:19:07 :: [ppc64le] #400 python3-module-hypothesis-jsonschema.git 0.23.1-alt1: build start
[i586]     raise error
[i586] E   jsonschema.exceptions.ValidationError: None is not of type 'object', 'boolean'
[i586] E   
[i586] --
[i586] =========================== short test summary info ============================
[i586] FAILED tests/test_from_schema.py::test_can_generate_for_real_large_schema[Meta-validation schema for JSON Schema Draft 8]
[i586] = 1 failed, 861 passed, 59 skipped, 109 xfailed, 2 xpassed in 2003.70s (0:33:23) =
[i586] INFO     : Command's result: FAILURE
[i586] INFO     : Command's error: Command '['python3', '-m', 'pytest']' returned non-zero exit status 1.
2025-Jan-09 10:48:16 :: [i586] python3-module-hypothesis-jsonschema.git 0.23.1-alt1: remote: build failed
2025-Jan-09 10:48:16 :: [i586] #400 python3-module-hypothesis-jsonschema.git 0.23.1-alt1: build FAILED
2025-Jan-09 10:48:16 :: [i586] requesting cancellation of task processing
[x86_64]     raise error
[x86_64] E   jsonschema.exceptions.ValidationError: None is not of type 'object', 'boolean'
[x86_64] E   
[x86_64] --
[x86_64] =========================== short test summary info ============================
[x86_64] FAILED tests/test_from_schema.py::test_can_generate_for_real_large_schema[Meta-validation schema for JSON Schema Draft 8]
[x86_64] = 1 failed, 861 passed, 59 skipped, 109 xfailed, 2 xpassed in 2402.25s (0:40:02) =
[x86_64] INFO     : Command's result: FAILURE
[x86_64] INFO     : Command's error: Command '['python3', '-m', 'pytest']' returned non-zero exit status 1.
2025-Jan-09 10:55:07 :: [x86_64] python3-module-hypothesis-jsonschema.git 0.23.1-alt1: remote: build failed
2025-Jan-09 10:55:07 :: [x86_64] #400 python3-module-hypothesis-jsonschema.git 0.23.1-alt1: build FAILED
[aarch64]     raise error
[aarch64] E   jsonschema.exceptions.ValidationError: None is not of type 'object', 'boolean'
[aarch64] E   
[aarch64] --
[aarch64] =========================== short test summary info ============================
[aarch64] FAILED tests/test_from_schema.py::test_can_generate_for_real_large_schema[Meta-validation schema for JSON Schema Draft 8]
[aarch64] = 1 failed, 861 passed, 59 skipped, 109 xfailed, 2 xpassed in 4395.34s (1:13:15) =
[aarch64] INFO     : Command's result: FAILURE
[aarch64] INFO     : Command's error: Command '['python3', '-m', 'pytest']' returned non-zero exit status 1.
2025-Jan-09 11:32:09 :: [aarch64] python3-module-hypothesis-jsonschema.git 0.23.1-alt1: remote: build failed
2025-Jan-09 11:32:09 :: [aarch64] #400 python3-module-hypothesis-jsonschema.git 0.23.1-alt1: build FAILED
2025-Jan-09 11:54:41 :: [ppc64le] #400 python3-module-hypothesis-jsonschema.git 0.23.1-alt1: build OK
2025-Jan-09 11:54:41 :: [ppc64le] task processing CANCELLED
2025-Jan-09 10:48:16 :: [i586] build FAILED
2025-Jan-09 10:55:07 :: [x86_64] build FAILED
2025-Jan-09 11:32:09 :: [aarch64] build FAILED
2025-Jan-09 11:54:41 :: [ppc64le] build FAILED
2025-Jan-09 11:54:42 :: task #359511 for sisyphus FAILED


^ permalink raw reply	[flat|nested] 6+ messages in thread

* [#359511] [test-only] FAILED (try 6) python3-module-harfile.git=0.3.0-alt1 ...
  2024-10-11  8:29 [#359511] [test-only] FAILED python3-module-harfile.git=0.3.0-alt1 Girar awaiter (enimalojd)
                   ` (3 preceding siblings ...)
  2025-01-09 11:54 ` [#359511] [test-only] FAILED (try 5) python3-module-harfile.git=0.3.0-alt1 Girar awaiter (enimalojd)
@ 2025-01-09 15:01 ` Girar awaiter (enimalojd)
  4 siblings, 0 replies; 6+ messages in thread
From: Girar awaiter (enimalojd) @ 2025-01-09 15:01 UTC (permalink / raw)
  To: Evgeniy Martynenko; +Cc: sisyphus-incominger, girar-builder-sisyphus

https://git.altlinux.org/tasks/359511/logs/events.6.1.log
https://packages.altlinux.org/tasks/359511

subtask  name                                  aarch64    i586  ppc64le  x86_64
   #100  python3-module-harfile                   1:18      45     1:38      47
   #300  python3-module-hypothesis-graphql        5:13    2:36     6:30    2:44
   #400  python3-module-hypothesis-jsonschema   failed  failed   failed  failed

2025-Jan-09 13:30:00 :: test-only task #359511 for sisyphus resumed by enimalojd:
#100 build 0.3.0-alt1 from /people/enimalojd/packages/python3-module-harfile.git fetched at 2024-Oct-11 07:27:00
#200 build 2.2.1-alt1 from /people/enimalojd/packages/python3-module-backoff.git fetched at 2024-Oct-11 07:27:20
#300 build 0.11.1-alt1 from /people/enimalojd/packages/python3-module-hypothesis-graphql.git fetched at 2024-Oct-11 07:27:45
#400 build 0.23.1-alt1 from /people/enimalojd/packages/python3-module-hypothesis-jsonschema.git fetched at 2024-Oct-11 07:28:13
#500 build 0.2.1-alt1 from /people/enimalojd/packages/python3-module-hypothesis-openapi.git fetched at 2024-Oct-11 07:28:31
#600 build 1.9-alt1 from /people/enimalojd/packages/python3-module-junit-xml.git fetched at 2024-Oct-11 07:28:56
#700 build 3.7.0-alt1 from /people/enimalojd/packages/python3-module-pyrate-limiter.git fetched at 2024-Oct-11 07:29:15
#1000 build 0.4.0-alt1 from /people/enimalojd/packages/python3-module-starlette-testclient.git fetched at 2024-Oct-11 07:29:49
#1100 removed
#1200 removed
#1300 build 3.39.5-alt1 from /people/enimalojd/packages/python3-module-schemathesis.git fetched at 2025-Jan-09 10:09:40
2025-Jan-09 13:30:01 :: created build repo
2025-Jan-09 13:30:02 :: #400: force rebuild
2025-Jan-09 13:30:02 :: #1000: force rebuild
2025-Jan-09 13:30:02 :: [i586] #100 python3-module-harfile.git 0.3.0-alt1: build start
2025-Jan-09 13:30:02 :: [ppc64le] #100 python3-module-harfile.git 0.3.0-alt1: build start
2025-Jan-09 13:30:02 :: [x86_64] #100 python3-module-harfile.git 0.3.0-alt1: build start
2025-Jan-09 13:30:02 :: [aarch64] #100 python3-module-harfile.git 0.3.0-alt1: build start
2025-Jan-09 13:30:47 :: [i586] #100 python3-module-harfile.git 0.3.0-alt1: build OK
2025-Jan-09 13:30:47 :: [i586] #200 python3-module-backoff.git 2.2.1-alt1: build start
2025-Jan-09 13:30:49 :: [x86_64] #100 python3-module-harfile.git 0.3.0-alt1: build OK
2025-Jan-09 13:30:49 :: [x86_64] #200 python3-module-backoff.git 2.2.1-alt1: build start
2025-Jan-09 13:30:59 :: [i586] #200 python3-module-backoff.git 2.2.1-alt1: build OK (cached)
2025-Jan-09 13:30:59 :: [i586] #300 python3-module-hypothesis-graphql.git 0.11.1-alt1: build start
2025-Jan-09 13:31:02 :: [x86_64] #200 python3-module-backoff.git 2.2.1-alt1: build OK (cached)
2025-Jan-09 13:31:02 :: [x86_64] #300 python3-module-hypothesis-graphql.git 0.11.1-alt1: build start
2025-Jan-09 13:31:20 :: [aarch64] #100 python3-module-harfile.git 0.3.0-alt1: build OK
2025-Jan-09 13:31:20 :: [aarch64] #200 python3-module-backoff.git 2.2.1-alt1: build start
2025-Jan-09 13:31:40 :: [ppc64le] #100 python3-module-harfile.git 0.3.0-alt1: build OK
2025-Jan-09 13:31:40 :: [ppc64le] #200 python3-module-backoff.git 2.2.1-alt1: build start
2025-Jan-09 13:31:43 :: [aarch64] #200 python3-module-backoff.git 2.2.1-alt1: build OK (cached)
2025-Jan-09 13:31:43 :: [aarch64] #300 python3-module-hypothesis-graphql.git 0.11.1-alt1: build start
2025-Jan-09 13:32:04 :: [ppc64le] #200 python3-module-backoff.git 2.2.1-alt1: build OK (cached)
2025-Jan-09 13:32:04 :: [ppc64le] #300 python3-module-hypothesis-graphql.git 0.11.1-alt1: build start
2025-Jan-09 13:33:35 :: [i586] #300 python3-module-hypothesis-graphql.git 0.11.1-alt1: build OK
2025-Jan-09 13:33:36 :: [i586] #400 python3-module-hypothesis-jsonschema.git 0.23.1-alt1: build start
2025-Jan-09 13:33:46 :: [x86_64] #300 python3-module-hypothesis-graphql.git 0.11.1-alt1: build OK
2025-Jan-09 13:33:46 :: [x86_64] #400 python3-module-hypothesis-jsonschema.git 0.23.1-alt1: build start
2025-Jan-09 13:36:56 :: [aarch64] #300 python3-module-hypothesis-graphql.git 0.11.1-alt1: build OK
2025-Jan-09 13:36:56 :: [aarch64] #400 python3-module-hypothesis-jsonschema.git 0.23.1-alt1: build start
2025-Jan-09 13:38:34 :: [ppc64le] #300 python3-module-hypothesis-graphql.git 0.11.1-alt1: build OK
2025-Jan-09 13:38:34 :: [ppc64le] #400 python3-module-hypothesis-jsonschema.git 0.23.1-alt1: build start
[x86_64]     raise error
[x86_64] E   jsonschema.exceptions.ValidationError: None is not of type 'object', 'boolean'
[x86_64] E   
[x86_64] --
[x86_64] =========================== short test summary info ============================
[x86_64] FAILED tests/test_from_schema.py::test_can_generate_for_real_large_schema[Meta-validation schema for JSON Schema Draft 8]
[x86_64] = 1 failed, 861 passed, 59 skipped, 109 xfailed, 2 xpassed in 1525.48s (0:25:25) =
[x86_64] INFO     : Command's result: FAILURE
[x86_64] INFO     : Command's error: Command '['python3', '-m', 'pytest']' returned non-zero exit status 1.
2025-Jan-09 13:59:53 :: [x86_64] python3-module-hypothesis-jsonschema.git 0.23.1-alt1: remote: build failed
2025-Jan-09 13:59:53 :: [x86_64] #400 python3-module-hypothesis-jsonschema.git 0.23.1-alt1: build FAILED
2025-Jan-09 13:59:53 :: [x86_64] requesting cancellation of task processing
[i586]     assert is_valid(instance, schema) == is_valid(instance, cc)
[i586] E   AssertionError: assert False == True
[i586] E    +  where False = is_valid([9007199254741149], {'items': {'minimum': 9007199254728478, 'multipleOf': 99.0, 'type': 'integer'}, 'type': 'array'})
[i586] --
[i586]     raise error
[i586] E   jsonschema.exceptions.ValidationError: None is not of type 'object', 'boolean'
[i586] E   
[i586] --
[i586] =========================== short test summary info ============================
[i586] FAILED tests/test_canonicalise.py::test_canonicalises_to_equivalent_fixpoint[array-schema]
[i586] FAILED tests/test_from_schema.py::test_can_generate_for_real_large_schema[Meta-validation schema for JSON Schema Draft 8]
[i586] = 2 failed, 860 passed, 59 skipped, 109 xfailed, 2 xpassed in 2331.52s (0:38:51) =
[i586] INFO     : Command's result: FAILURE
[i586] INFO     : Command's error: Command '['python3', '-m', 'pytest']' returned non-zero exit status 1.
2025-Jan-09 14:13:10 :: [i586] python3-module-hypothesis-jsonschema.git 0.23.1-alt1: remote: build failed
2025-Jan-09 14:13:10 :: [i586] #400 python3-module-hypothesis-jsonschema.git 0.23.1-alt1: build FAILED
[aarch64]     assert cc == canonicalish(cc)
[aarch64] E   AssertionError: assert {'not': {'mul...y', 'object']} == {'type': ['nu...y', 'object']}
[aarch64] E     
[aarch64] --
[aarch64]     raise error
[aarch64] E   jsonschema.exceptions.ValidationError: None is not of type 'object', 'boolean'
[aarch64] E   
[aarch64] --
[aarch64] =========================== short test summary info ============================
[aarch64] FAILED tests/test_canonicalise.py::test_canonicalises_to_equivalent_fixpoint[any-schema]
[aarch64] FAILED tests/test_from_schema.py::test_can_generate_for_real_large_schema[Meta-validation schema for JSON Schema Draft 8]
[aarch64] = 2 failed, 860 passed, 59 skipped, 109 xfailed, 2 xpassed in 4869.03s (1:21:09) =
[aarch64] INFO     : Command's result: FAILURE
[aarch64] INFO     : Command's error: Command '['python3', '-m', 'pytest']' returned non-zero exit status 1.
2025-Jan-09 14:59:18 :: [aarch64] python3-module-hypothesis-jsonschema.git 0.23.1-alt1: remote: build failed
2025-Jan-09 14:59:18 :: [aarch64] #400 python3-module-hypothesis-jsonschema.git 0.23.1-alt1: build FAILED
[ppc64le]     raise error
[ppc64le] E   jsonschema.exceptions.ValidationError: None is not of type 'object', 'boolean'
[ppc64le] E   
[ppc64le] --
[ppc64le] =========================== short test summary info ============================
[ppc64le] FAILED tests/test_from_schema.py::test_can_generate_for_real_large_schema[Meta-validation schema for JSON Schema Draft 8]
[ppc64le] = 1 failed, 861 passed, 59 skipped, 109 xfailed, 2 xpassed in 4859.99s (1:20:59) =
[ppc64le] INFO     : Command's result: FAILURE
[ppc64le] INFO     : Command's error: Command '['python3', '-m', 'pytest']' returned non-zero exit status 1.
2025-Jan-09 15:01:05 :: [ppc64le] python3-module-hypothesis-jsonschema.git 0.23.1-alt1: remote: build failed
2025-Jan-09 15:01:05 :: [ppc64le] #400 python3-module-hypothesis-jsonschema.git 0.23.1-alt1: build FAILED
2025-Jan-09 13:59:53 :: [x86_64] build FAILED
2025-Jan-09 14:13:10 :: [i586] build FAILED
2025-Jan-09 14:59:18 :: [aarch64] build FAILED
2025-Jan-09 15:01:05 :: [ppc64le] build FAILED
2025-Jan-09 15:01:05 :: task #359511 for sisyphus FAILED


^ permalink raw reply	[flat|nested] 6+ messages in thread

end of thread, other threads:[~2025-01-09 15:01 UTC | newest]

Thread overview: 6+ messages (download: mbox.gz / follow: Atom feed)
-- links below jump to the message on this page --
2024-10-11  8:29 [#359511] [test-only] FAILED python3-module-harfile.git=0.3.0-alt1 Girar awaiter (enimalojd)
2024-10-11 11:01 ` [#359511] [test-only] FAILED (try 2) python3-module-harfile.git=0.3.0-alt1 Girar awaiter (enimalojd)
2024-10-11 12:16 ` [#359511] [test-only] FAILED (try 3) python3-module-harfile.git=0.3.0-alt1 Girar awaiter (enimalojd)
2024-11-28 14:47 ` [#359511] [test-only] FAILED (try 4) python3-module-harfile.git=0.3.0-alt1 Girar awaiter (enimalojd)
2025-01-09 11:54 ` [#359511] [test-only] FAILED (try 5) python3-module-harfile.git=0.3.0-alt1 Girar awaiter (enimalojd)
2025-01-09 15:01 ` [#359511] [test-only] FAILED (try 6) python3-module-harfile.git=0.3.0-alt1 Girar awaiter (enimalojd)

ALT Linux Girar Builder robot reports

This inbox may be cloned and mirrored by anyone:

	git clone --mirror http://lore.altlinux.org/sisyphus-incominger/0 sisyphus-incominger/git/0.git

	# If you have public-inbox 1.1+ installed, you may
	# initialize and index your mirror using the following commands:
	public-inbox-init -V2 sisyphus-incominger sisyphus-incominger/ http://lore.altlinux.org/sisyphus-incominger \
		sisyphus-incominger@lists.altlinux.org sisyphus-incominger@lists.altlinux.ru sisyphus-incominger@lists.altlinux.com
	public-inbox-index sisyphus-incominger

Example config snippet for mirrors.
Newsgroup available over NNTP:
	nntp://lore.altlinux.org/org.altlinux.lists.sisyphus-incominger


AGPL code for this site: git clone https://public-inbox.org/public-inbox.git