ALT Linux Girar Builder robot reports
 help / color / mirror / Atom feed
* [#337397] FAILED ktoblzcheck.git=1.54-alt1
@ 2023-12-28 10:08 Girar awaiter (cas)
  2025-03-26 11:01 ` [#337397] DONE (try 2) gwenhywfar.git=5.12.0-alt1 Girar pender (cas)
  0 siblings, 1 reply; 2+ messages in thread
From: Girar awaiter (cas) @ 2023-12-28 10:08 UTC (permalink / raw)
  To: Andrey Cherepanov; +Cc: sisyphus-incominger, girar-builder-sisyphus

https://git.altlinux.org/tasks/337397/logs/events.1.1.log

subtask  name         aarch64    armh    i586  ppc64le  x86_64
   #100  ktoblzcheck   failed  failed  failed   failed  failed

2023-Dec-28 10:07:10 :: task #337397 for sisyphus started by cas:
#100 build 1.54-alt1 from /people/cas/packages/ktoblzcheck.git fetched at 2023-Dec-28 10:07:08
2023-Dec-28 10:07:12 :: [x86_64] #100 ktoblzcheck.git 1.54-alt1: build start
2023-Dec-28 10:07:12 :: [i586] #100 ktoblzcheck.git 1.54-alt1: build start
2023-Dec-28 10:07:12 :: [ppc64le] #100 ktoblzcheck.git 1.54-alt1: build start
2023-Dec-28 10:07:12 :: [aarch64] #100 ktoblzcheck.git 1.54-alt1: build start
2023-Dec-28 10:07:12 :: [armh] #100 ktoblzcheck.git 1.54-alt1: build start
[x86_64] -- Detecting CXX compile features - done
[x86_64] -- Could NOT find Doxygen (missing: DOXYGEN_EXECUTABLE) (Required is at least version "1.8.3")
[x86_64] -- Performing Test CMAKE_HAVE_LIBC_PTHREAD
[x86_64] -- Performing Test CMAKE_HAVE_LIBC_PTHREAD - Success
[x86_64] -- Found Threads: TRUE  
[x86_64] -- Could NOT find Python3 (missing: Python3_EXECUTABLE Python3_INCLUDE_DIRS Python3_LIBRARIES Interpreter Development Development.Module Development.Embed) 
[x86_64] -- Found Python2: /usr/bin/python2.7 (found version "2.7.18") found components: Interpreter Development Development.Module Development.Embed 
[x86_64] CMake Error at CMakeLists.txt:125 (message):
[x86_64]   Python module xlrd not found!
[x86_64] -- Configuring incomplete, errors occurred!
2023-Dec-28 10:07:30 :: [x86_64] ktoblzcheck.git 1.54-alt1: remote: build failed
2023-Dec-28 10:07:30 :: [x86_64] #100 ktoblzcheck.git 1.54-alt1: build FAILED
2023-Dec-28 10:07:30 :: [x86_64] requesting cancellation of task processing
[i586] -- Detecting CXX compile features - done
[i586] -- Could NOT find Doxygen (missing: DOXYGEN_EXECUTABLE) (Required is at least version "1.8.3")
[i586] -- Performing Test CMAKE_HAVE_LIBC_PTHREAD
[i586] -- Performing Test CMAKE_HAVE_LIBC_PTHREAD - Success
[i586] -- Found Threads: TRUE  
[i586] -- Could NOT find Python3 (missing: Python3_EXECUTABLE Python3_INCLUDE_DIRS Python3_LIBRARIES Interpreter Development Development.Module Development.Embed) 
[i586] -- Found Python2: /usr/bin/python2.7 (found version "2.7.18") found components: Interpreter Development Development.Module Development.Embed 
[i586] CMake Error at CMakeLists.txt:125 (message):
[i586]   Python module xlrd not found!
[i586] -- Configuring incomplete, errors occurred!
2023-Dec-28 10:07:31 :: [i586] ktoblzcheck.git 1.54-alt1: remote: build failed
2023-Dec-28 10:07:31 :: [i586] #100 ktoblzcheck.git 1.54-alt1: build FAILED
[ppc64le] -- Detecting CXX compile features - done
[ppc64le] -- Could NOT find Doxygen (missing: DOXYGEN_EXECUTABLE) (Required is at least version "1.8.3")
[ppc64le] -- Performing Test CMAKE_HAVE_LIBC_PTHREAD
[ppc64le] -- Performing Test CMAKE_HAVE_LIBC_PTHREAD - Success
[ppc64le] -- Found Threads: TRUE  
[ppc64le] -- Could NOT find Python3 (missing: Python3_EXECUTABLE Python3_INCLUDE_DIRS Python3_LIBRARIES Interpreter Development Development.Module Development.Embed) 
[ppc64le] -- Found Python2: /usr/bin/python2.7 (found version "2.7.18") found components: Interpreter Development Development.Module Development.Embed 
[ppc64le] CMake Error at CMakeLists.txt:125 (message):
[ppc64le]   Python module xlrd not found!
[ppc64le] -- Configuring incomplete, errors occurred!
2023-Dec-28 10:07:51 :: [ppc64le] ktoblzcheck.git 1.54-alt1: remote: build failed
2023-Dec-28 10:07:51 :: [ppc64le] #100 ktoblzcheck.git 1.54-alt1: build FAILED
[armh] -- Detecting CXX compile features - done
[armh] -- Could NOT find Doxygen (missing: DOXYGEN_EXECUTABLE) (Required is at least version "1.8.3")
[armh] -- Performing Test CMAKE_HAVE_LIBC_PTHREAD
[armh] -- Performing Test CMAKE_HAVE_LIBC_PTHREAD - Success
[armh] -- Found Threads: TRUE  
[armh] -- Could NOT find Python3 (missing: Python3_EXECUTABLE Python3_INCLUDE_DIRS Python3_LIBRARIES Interpreter Development Development.Module Development.Embed) 
[armh] -- Found Python2: /usr/bin/python2.7 (found version "2.7.18") found components: Interpreter Development Development.Module Development.Embed 
[armh] CMake Error at CMakeLists.txt:125 (message):
[armh]   Python module xlrd not found!
[armh] -- Configuring incomplete, errors occurred!
2023-Dec-28 10:08:06 :: [armh] ktoblzcheck.git 1.54-alt1: remote: build failed
2023-Dec-28 10:08:06 :: [armh] #100 ktoblzcheck.git 1.54-alt1: build FAILED
[aarch64] -- Detecting CXX compile features - done
[aarch64] -- Could NOT find Doxygen (missing: DOXYGEN_EXECUTABLE) (Required is at least version "1.8.3")
[aarch64] -- Performing Test CMAKE_HAVE_LIBC_PTHREAD
[aarch64] -- Performing Test CMAKE_HAVE_LIBC_PTHREAD - Success
[aarch64] -- Found Threads: TRUE  
[aarch64] -- Could NOT find Python3 (missing: Python3_EXECUTABLE Python3_INCLUDE_DIRS Python3_LIBRARIES Interpreter Development Development.Module Development.Embed) 
[aarch64] -- Found Python2: /usr/bin/python2.7 (found version "2.7.18") found components: Interpreter Development Development.Module Development.Embed 
[aarch64] CMake Error at CMakeLists.txt:125 (message):
[aarch64]   Python module xlrd not found!
[aarch64] -- Configuring incomplete, errors occurred!
2023-Dec-28 10:08:11 :: [aarch64] ktoblzcheck.git 1.54-alt1: remote: build failed
2023-Dec-28 10:08:11 :: [aarch64] #100 ktoblzcheck.git 1.54-alt1: build FAILED
2023-Dec-28 10:07:30 :: [x86_64] build FAILED
2023-Dec-28 10:07:31 :: [i586] build FAILED
2023-Dec-28 10:07:51 :: [ppc64le] build FAILED
2023-Dec-28 10:08:06 :: [armh] build FAILED
2023-Dec-28 10:08:11 :: [aarch64] build FAILED
2023-Dec-28 10:08:11 :: task #337397 for sisyphus FAILED


^ permalink raw reply	[flat|nested] 2+ messages in thread

* [#337397] DONE (try 2) gwenhywfar.git=5.12.0-alt1
  2023-12-28 10:08 [#337397] FAILED ktoblzcheck.git=1.54-alt1 Girar awaiter (cas)
@ 2025-03-26 11:01 ` Girar pender (cas)
  0 siblings, 0 replies; 2+ messages in thread
From: Girar pender (cas) @ 2025-03-26 11:01 UTC (permalink / raw)
  To: Andrey Cherepanov; +Cc: sisyphus-incominger, girar-builder-sisyphus

https://git.altlinux.org/tasks/archive/done/_329/337397/logs/events.2.2.log
https://packages.altlinux.org/tasks/337397

subtask  name        aarch64  i586  x86_64
   #200  gwenhywfar     3:11  2:16    2:05

2025-Mar-26 10:54:49 :: task #337397 for sisyphus resumed by cas:
#100 removed
#200 build 5.12.0-alt1 from /people/cas/packages/gwenhywfar.git fetched at 2025-Mar-10 09:54:09
2025-Mar-26 10:54:50 :: [x86_64] #200 gwenhywfar.git 5.12.0-alt1: build start
2025-Mar-26 10:54:50 :: [i586] #200 gwenhywfar.git 5.12.0-alt1: build start
2025-Mar-26 10:54:50 :: [aarch64] #200 gwenhywfar.git 5.12.0-alt1: build start
2025-Mar-26 10:55:02 :: [i586] #200 gwenhywfar.git 5.12.0-alt1: build OK (cached)
2025-Mar-26 10:55:02 :: [x86_64] #200 gwenhywfar.git 5.12.0-alt1: build OK (cached)
2025-Mar-26 10:55:21 :: [aarch64] #200 gwenhywfar.git 5.12.0-alt1: build OK (cached)
2025-Mar-26 10:55:50 :: #200: gwenhywfar.git 5.12.0-alt1: build check OK
2025-Mar-26 10:55:51 :: build check OK
2025-Mar-26 10:55:59 :: noarch check OK
2025-Mar-26 10:56:01 :: plan: src +1 -1 =20035, aarch64 +10 -10 =34763, i586 +10 -10 =33631, x86_64 +10 -10 =35568
#200 gwenhywfar 5.10.2-alt1 -> 5.12.0-alt1
 Mon Mar 10 2025 Andrey Cherepanov <cas@altlinux> 5.12.0-alt1
 - New version.
2025-Mar-26 10:56:45 :: patched apt indices
2025-Mar-26 10:56:55 :: created next repo
2025-Mar-26 10:57:06 :: duplicate provides check OK
2025-Mar-26 10:57:47 :: dependencies check OK
2025-Mar-26 10:57:48 :: [x86_64 i586 aarch64] no need to repeat ELF symbols check
2025-Mar-26 10:57:48 :: [x86_64 i586 aarch64] ELF symbols check OK
	i586: libgwenhywfar=5.12.0-alt1 post-install unowned files:
 /usr/share/gwenhywfar
 /usr/share/gwenhywfar/dialogs
2025-Mar-26 10:57:59 :: [i586] #200 libgwenhywfar: install check OK (cached)
	x86_64: libgwenhywfar=5.12.0-alt1 post-install unowned files:
 /usr/share/gwenhywfar
 /usr/share/gwenhywfar/dialogs
2025-Mar-26 10:57:59 :: [x86_64] #200 libgwenhywfar: install check OK (cached)
2025-Mar-26 10:58:03 :: [i586] #200 libgwenhywfar-debuginfo: install check OK (cached)
2025-Mar-26 10:58:04 :: [x86_64] #200 libgwenhywfar-debuginfo: install check OK (cached)
	aarch64: libgwenhywfar=5.12.0-alt1 post-install unowned files:
 /usr/share/gwenhywfar
 /usr/share/gwenhywfar/dialogs
2025-Mar-26 10:58:07 :: [aarch64] #200 libgwenhywfar: install check OK (cached)
	i586: libgwenhywfar-devel=5.12.0-alt1 post-install unowned files:
 /usr/lib/cmake
 /usr/share/gwenbuild
 /usr/share/gwenbuild/templates
 /usr/share/gwenhywfar/gwenbuild
 /usr/share/gwenhywfar/typemaker2
2025-Mar-26 10:58:08 :: [i586] #200 libgwenhywfar-devel: install check OK (cached)
	x86_64: libgwenhywfar-devel=5.12.0-alt1 post-install unowned files:
 /usr/lib64/cmake
 /usr/share/gwenbuild
 /usr/share/gwenbuild/templates
 /usr/share/gwenhywfar/gwenbuild
 /usr/share/gwenhywfar/typemaker2
2025-Mar-26 10:58:09 :: [x86_64] #200 libgwenhywfar-devel: install check OK (cached)
2025-Mar-26 10:58:12 :: [i586] #200 libgwenhywfar-devel-debuginfo: install check OK (cached)
2025-Mar-26 10:58:14 :: [x86_64] #200 libgwenhywfar-devel-debuginfo: install check OK (cached)
2025-Mar-26 10:58:15 :: [aarch64] #200 libgwenhywfar-debuginfo: install check OK (cached)
2025-Mar-26 10:58:17 :: [i586] #200 libgwenhywfar-gtk2: install check OK (cached)
2025-Mar-26 10:58:18 :: [x86_64] #200 libgwenhywfar-gtk2: install check OK (cached)
2025-Mar-26 10:58:21 :: [i586] #200 libgwenhywfar-gtk2-debuginfo: install check OK (cached)
2025-Mar-26 10:58:23 :: [x86_64] #200 libgwenhywfar-gtk2-debuginfo: install check OK (cached)
	aarch64: libgwenhywfar-devel=5.12.0-alt1 post-install unowned files:
 /usr/lib64/cmake
 /usr/share/gwenbuild
 /usr/share/gwenbuild/templates
 /usr/share/gwenhywfar/gwenbuild
 /usr/share/gwenhywfar/typemaker2
2025-Mar-26 10:58:23 :: [aarch64] #200 libgwenhywfar-devel: install check OK (cached)
2025-Mar-26 10:58:26 :: [i586] #200 libgwenhywfar-gtk3: install check OK (cached)
2025-Mar-26 10:58:28 :: [x86_64] #200 libgwenhywfar-gtk3: install check OK (cached)
2025-Mar-26 10:58:30 :: [i586] #200 libgwenhywfar-gtk3-debuginfo: install check OK (cached)
2025-Mar-26 10:58:32 :: [aarch64] #200 libgwenhywfar-devel-debuginfo: install check OK (cached)
2025-Mar-26 10:58:32 :: [x86_64] #200 libgwenhywfar-gtk3-debuginfo: install check OK (cached)
2025-Mar-26 10:58:35 :: [i586] #200 libgwenhywfar-qt5: install check OK (cached)
2025-Mar-26 10:58:37 :: [x86_64] #200 libgwenhywfar-qt5: install check OK (cached)
2025-Mar-26 10:58:40 :: [aarch64] #200 libgwenhywfar-gtk2: install check OK (cached)
2025-Mar-26 10:58:40 :: [i586] #200 libgwenhywfar-qt5-debuginfo: install check OK (cached)
2025-Mar-26 10:58:43 :: [x86_64] #200 libgwenhywfar-qt5-debuginfo: install check OK (cached)
2025-Mar-26 10:58:48 :: [aarch64] #200 libgwenhywfar-gtk2-debuginfo: install check OK (cached)
2025-Mar-26 10:58:56 :: [aarch64] #200 libgwenhywfar-gtk3: install check OK (cached)
2025-Mar-26 10:59:07 :: [aarch64] #200 libgwenhywfar-gtk3-debuginfo: install check OK (cached)
2025-Mar-26 10:59:16 :: [aarch64] #200 libgwenhywfar-qt5: install check OK (cached)
2025-Mar-26 10:59:26 :: [aarch64] #200 libgwenhywfar-qt5-debuginfo: install check OK (cached)
2025-Mar-26 10:59:27 :: [x86_64-i586] plan: #0 +5 -5 =11580
2025-Mar-26 10:59:43 :: [x86_64-i586] generated apt indices
2025-Mar-26 10:59:44 :: [x86_64-i586] created next repo
2025-Mar-26 10:59:54 :: [x86_64-i586] dependencies check OK
2025-Mar-26 10:59:56 :: gears inheritance check OK
2025-Mar-26 10:59:56 :: srpm inheritance check OK
girar-check-perms: access to gwenhywfar ALLOWED for cas: project leader
check-subtask-perms: #200: gwenhywfar: allowed for cas
2025-Mar-26 10:59:56 :: acl check OK
2025-Mar-26 11:00:08 :: created contents_index files
2025-Mar-26 11:00:15 :: created hash files: aarch64 i586 src x86_64-i586 x86_64
2025-Mar-26 11:00:18 :: task #337397 for sisyphus TESTED
2025-Mar-26 11:00:18 :: task is ready for commit
2025-Mar-26 11:00:22 :: repo clone OK
2025-Mar-26 11:00:23 :: packages update OK
2025-Mar-26 11:00:30 :: [x86_64 i586 aarch64] update OK
2025-Mar-26 11:00:31 :: [x86_64-i586] update OK
2025-Mar-26 11:00:31 :: repo update OK
2025-Mar-26 11:00:42 :: repo save OK
2025-Mar-26 11:00:42 :: src index update OK
2025-Mar-26 11:00:42 :: updated /gears/g/gwenhywfar.git branch `sisyphus'
2025-Mar-26 11:01:04 :: gears update OK
2025-Mar-26 11:01:04 :: task #337397 for sisyphus DONE


^ permalink raw reply	[flat|nested] 2+ messages in thread

end of thread, other threads:[~2025-03-26 11:01 UTC | newest]

Thread overview: 2+ messages (download: mbox.gz / follow: Atom feed)
-- links below jump to the message on this page --
2023-12-28 10:08 [#337397] FAILED ktoblzcheck.git=1.54-alt1 Girar awaiter (cas)
2025-03-26 11:01 ` [#337397] DONE (try 2) gwenhywfar.git=5.12.0-alt1 Girar pender (cas)

ALT Linux Girar Builder robot reports

This inbox may be cloned and mirrored by anyone:

	git clone --mirror http://lore.altlinux.org/sisyphus-incominger/0 sisyphus-incominger/git/0.git

	# If you have public-inbox 1.1+ installed, you may
	# initialize and index your mirror using the following commands:
	public-inbox-init -V2 sisyphus-incominger sisyphus-incominger/ http://lore.altlinux.org/sisyphus-incominger \
		sisyphus-incominger@lists.altlinux.org sisyphus-incominger@lists.altlinux.ru sisyphus-incominger@lists.altlinux.com
	public-inbox-index sisyphus-incominger

Example config snippet for mirrors.
Newsgroup available over NNTP:
	nntp://lore.altlinux.org/org.altlinux.lists.sisyphus-incominger


AGPL code for this site: git clone https://public-inbox.org/public-inbox.git