ALT Linux Girar Builder robot reports
 help / color / mirror / Atom feed
* [#266243] [test-only] p9 FAILED gerbera.git=1.6.4-alt1
@ 2021-02-12 22:10 Girar awaiter (zerg)
  2021-02-15  5:46 ` [#266243] [test-only] p9 FAILED (try 2) libupnp.git=libupnp-1.14.0-alt1 gerbera.git=1.6.4-alt1 Girar awaiter (zerg)
  2021-02-15  5:52 ` [#266243] [test-only] p9 FAILED (try 3) spdlog.git=1.8.0-alt1 libupnp.git=libupnp-1.14.0-alt1 Girar awaiter (zerg)
  0 siblings, 2 replies; 3+ messages in thread
From: Girar awaiter (zerg) @ 2021-02-12 22:10 UTC (permalink / raw)
  To: Sergey V. Turchin; +Cc: sisyphus-incominger, girar-builder-p9

http://git.altlinux.org/tasks/266243/logs/events.1.1.log

subtask  name     aarch64  armh    i586  ppc64le  x86_64
   #100  gerbera   failed     -  failed   failed  failed

2021-Feb-12 22:10:28 :: test-only task #266243 for p9 started by zerg:
2021-Feb-12 22:10:29 :: message: replace_for_mediatomb
#100 build 1.6.4-alt1 from /gears/g/gerbera.git fetched at 2021-Feb-12 16:35:12
2021-Feb-12 22:10:29 :: [i586] #100 gerbera.git 1.6.4-alt1: build start
2021-Feb-12 22:10:29 :: [x86_64] #100 gerbera.git 1.6.4-alt1: build start
2021-Feb-12 22:10:29 :: [aarch64] #100 gerbera.git 1.6.4-alt1: build start
2021-Feb-12 22:10:29 :: [ppc64le] #100 gerbera.git 1.6.4-alt1: build start
2021-Feb-12 22:10:29 :: [armh] #100 gerbera.git 1.6.4-alt1: build start
[x86_64] warning: Macro %cmake not found
[x86_64] warning: Macro %cmake_build not found
[x86_64] warning: Macro %cmakeinstall_std not found
[x86_64] Reading Package Lists...
[x86_64] Building Dependency Tree...
[x86_64] MI2a: mark cmake
[x86_64] MI2a:  target libarchive.so.13()(64bit)
[x86_64] MI2a:   mark libarchive13
[x86_64] MI2a:    target libcrypto.so.1.1()(64bit)
[x86_64] MI2a:     mark libcrypto1.1
[x86_64] MI2a:      target ca-certificates
[x86_64] MI2a:       mark ca-certificates
[x86_64] MI2a:        target ca-trust
[x86_64] MI2a:         mark ca-trust
[x86_64] MI2a:          target p11-kit-trust
[x86_64] MI2a:           mark p11-kit-trust
[x86_64] MI2a:            target /etc/alternatives/packages.d
[x86_64] MI2a:             mark alternatives
[x86_64] MI2a:              target rpm-macros-alternatives
[x86_64] MI2a:               mark rpm-macros-alternatives
[x86_64] MI2a:            target libtasn1.so.6()(64bit)
[x86_64] MI2a:             mark libtasn1
[x86_64] MI2a:            target libp11-kit
[x86_64] MI2a:             mark libp11-kit
[x86_64] MI2a:  target libcurl.so.4()(64bit)
[x86_64] MI2a:   mark libcurl
[x86_64] MI2a:    target libbrotlidec.so.1()(64bit)
[x86_64] MI2a:     mark libbrotlidec
[x86_64] MI2a:      target libbrotlicommon
[x86_64] MI2a:       mark libbrotlicommon
[x86_64] MI2a:    target libgssapi_krb5.so.2()(64bit)
[x86_64] MI2a:     mark libkrb5
[x86_64] MI2a:      target libcom_err.so.2()(64bit)
[x86_64] MI2a:       mark libcom_err
[x86_64] MI2a:      target libkeyutils.so.1()(64bit)
[x86_64] MI2a:       mark libkeyutils
[x86_64] MI2a:      target libssl.so.1.1()(64bit)
[x86_64] MI2a:       mark libssl1.1
[x86_64] MI2a:      target libverto.so.1()(64bit)
[x86_64] MI2a:       mark libverto
[x86_64] MI2a:    target libidn2.so.0()(64bit)
[x86_64] MI2a:     mark libidn2
[x86_64] MI2a:    target liblber-2.4.so.2()(64bit)
[x86_64] MI2a:     mark libldap
[x86_64] MI2a:      target libsasl2.so.3()(64bit)
[x86_64] MI2a:       mark libsasl2-3
[x86_64] MI2a:    target libnghttp2.so.14()(64bit)
[x86_64] MI2a:     mark libnghttp2
[x86_64] MI2a:    target libpsl.so.5()(64bit)
[x86_64] MI2a:     mark libpsl
[x86_64] MI2a:      target publicsuffix-list-dafsa
[x86_64] MI2a:       mark publicsuffix-list-dafsa
[x86_64] MI2a:  target libexpat.so.1()(64bit)
[x86_64] MI2a:   mark libexpat
[x86_64] MI2a:  target libjsoncpp.so.19()(64bit)
[x86_64] MI2a:   mark libjsoncpp19
[x86_64] MI2a:  target librhash.so.0()(64bit)
[x86_64] MI2a:   mark librhash
[x86_64] MI2a:  target libuv.so.1()(64bit)
[x86_64] MI2a:   mark libuv
[x86_64] MI2a:  target cmake-modules
[x86_64] MI2a:   mark cmake-modules
[x86_64] MI2a:    target dump
[x86_64] MI2a:     mark dump
[x86_64] MI2a:      target libe2p.so.2()(64bit)
[x86_64] MI2a:       mark libe2fs
[x86_64] MI2a:      target rmt
[x86_64] MI2a:       mark rmt
[x86_64] MI2a:  target rpm-macros-cmake
[x86_64] MI2a:   mark rpm-macros-cmake
[x86_64] MI2a: mark gcc-c++
[x86_64] MI2a:  target gcc8-c++
[x86_64] MI2a:   mark gcc8-c++
[x86_64] MI2a:    target libstdc++8-devel
[x86_64] MI2a:     mark libstdc++8-devel
[x86_64] MI2a:      target gcc-c++-common
[x86_64] MI2a:       mark gcc-c++-common
[x86_64] Selected version cmake#3.16.3-alt1:p9+245760.100.3.1@1582902649 for cmake>=3.14
[x86_64] E: Version >='1.12.1' for 'libupnp-devel' was not found
[x86_64] hsh-install: Failed to calculate package file list.
[x86_64] hsh-install: Failed to generate package file list.
2021-Feb-12 22:10:39 :: [x86_64] gerbera.git 1.6.4-alt1: remote: cannot build src.rpm
2021-Feb-12 22:10:39 :: [x86_64] #100 gerbera.git 1.6.4-alt1: build FAILED
2021-Feb-12 22:10:39 :: [x86_64] requesting cancellation of task processing
[i586] warning: Macro %cmake not found
[i586] warning: Macro %cmake_build not found
[i586] warning: Macro %cmakeinstall_std not found
[i586] Reading Package Lists...
[i586] Building Dependency Tree...
[i586] MI2a: mark cmake
[i586] MI2a:  target libarchive.so.13
[i586] MI2a:   mark libarchive13
[i586] MI2a:    target libcrypto.so.1.1
[i586] MI2a:     mark libcrypto1.1
[i586] MI2a:      target ca-certificates
[i586] MI2a:       mark ca-certificates
[i586] MI2a:        target ca-trust
[i586] MI2a:         mark ca-trust
[i586] MI2a:          target p11-kit-trust
[i586] MI2a:           mark p11-kit-trust
[i586] MI2a:            target /etc/alternatives/packages.d
[i586] MI2a:             mark alternatives
[i586] MI2a:              target rpm-macros-alternatives
[i586] MI2a:               mark rpm-macros-alternatives
[i586] MI2a:            target libtasn1.so.6
[i586] MI2a:             mark libtasn1
[i586] MI2a:            target libp11-kit
[i586] MI2a:             mark libp11-kit
[i586] MI2a:  target libcurl.so.4
[i586] MI2a:   mark libcurl
[i586] MI2a:    target libbrotlidec.so.1
[i586] MI2a:     mark libbrotlidec
[i586] MI2a:      target libbrotlicommon
[i586] MI2a:       mark libbrotlicommon
[i586] MI2a:    target libgssapi_krb5.so.2
[i586] MI2a:     mark libkrb5
[i586] MI2a:      target libcom_err.so.2
[i586] MI2a:       mark libcom_err
[i586] MI2a:      target libkeyutils.so.1
[i586] MI2a:       mark libkeyutils
[i586] MI2a:      target libssl.so.1.1
[i586] MI2a:       mark libssl1.1
[i586] MI2a:      target libverto.so.1
[i586] MI2a:       mark libverto
[i586] MI2a:    target libidn2.so.0
[i586] MI2a:     mark libidn2
[i586] MI2a:    target liblber-2.4.so.2
[i586] MI2a:     mark libldap
[i586] MI2a:      target libsasl2.so.3
[i586] MI2a:       mark libsasl2-3
[i586] MI2a:    target libnghttp2.so.14
[i586] MI2a:     mark libnghttp2
[i586] MI2a:    target libpsl.so.5
[i586] MI2a:     mark libpsl
[i586] MI2a:      target publicsuffix-list-dafsa
[i586] MI2a:       mark publicsuffix-list-dafsa
[i586] MI2a:  target libexpat.so.1
[i586] MI2a:   mark libexpat
[i586] MI2a:  target libjsoncpp.so.19
[i586] MI2a:   mark libjsoncpp19
[i586] MI2a:  target librhash.so.0
[i586] MI2a:   mark librhash
[i586] MI2a:  target libuv.so.1
[i586] MI2a:   mark libuv
[i586] MI2a:  target cmake-modules
[i586] MI2a:   mark cmake-modules
[i586] MI2a:    target dump
[i586] MI2a:     mark dump
[i586] MI2a:      target libe2p.so.2
[i586] MI2a:       mark libe2fs
[i586] MI2a:      target rmt
[i586] MI2a:       mark rmt
[i586] MI2a:  target rpm-macros-cmake
[i586] MI2a:   mark rpm-macros-cmake
[i586] MI2a: mark gcc-c++
[i586] MI2a:  target gcc8-c++
[i586] MI2a:   mark gcc8-c++
[i586] MI2a:    target libstdc++8-devel
[i586] MI2a:     mark libstdc++8-devel
[i586] MI2a:      target gcc-c++-common
[i586] MI2a:       mark gcc-c++-common
[i586] Selected version cmake#3.16.3-alt1:p9+245760.100.3.1@1582902678 for cmake>=3.14
[i586] E: Version >='1.12.1' for 'libupnp-devel' was not found
[i586] hsh-install: Failed to calculate package file list.
[i586] hsh-install: Failed to generate package file list.
2021-Feb-12 22:10:40 :: [i586] gerbera.git 1.6.4-alt1: remote: cannot build src.rpm
2021-Feb-12 22:10:40 :: [i586] #100 gerbera.git 1.6.4-alt1: build FAILED
[aarch64] warning: Macro %cmake not found
[aarch64] warning: Macro %cmake_build not found
[aarch64] warning: Macro %cmakeinstall_std not found
[aarch64] Reading Package Lists...
[aarch64] Building Dependency Tree...
[aarch64] MI2a: mark cmake
[aarch64] MI2a:  target libarchive.so.13()(64bit)
[aarch64] MI2a:   mark libarchive13
[aarch64] MI2a:    target libcrypto.so.1.1()(64bit)
[aarch64] MI2a:     mark libcrypto1.1
[aarch64] MI2a:      target ca-certificates
[aarch64] MI2a:       mark ca-certificates
[aarch64] MI2a:        target ca-trust
[aarch64] MI2a:         mark ca-trust
[aarch64] MI2a:          target p11-kit-trust
[aarch64] MI2a:           mark p11-kit-trust
[aarch64] MI2a:            target /etc/alternatives/packages.d
[aarch64] MI2a:             mark alternatives
[aarch64] MI2a:              target rpm-macros-alternatives
[aarch64] MI2a:               mark rpm-macros-alternatives
[aarch64] MI2a:            target libtasn1.so.6()(64bit)
[aarch64] MI2a:             mark libtasn1
[aarch64] MI2a:            target libp11-kit
[aarch64] MI2a:             mark libp11-kit
[aarch64] MI2a:  target libcurl.so.4()(64bit)
[aarch64] MI2a:   mark libcurl
[aarch64] MI2a:    target libbrotlidec.so.1()(64bit)
[aarch64] MI2a:     mark libbrotlidec
[aarch64] MI2a:      target libbrotlicommon
[aarch64] MI2a:       mark libbrotlicommon
[aarch64] MI2a:    target libgssapi_krb5.so.2()(64bit)
[aarch64] MI2a:     mark libkrb5
[aarch64] MI2a:      target libcom_err.so.2()(64bit)
[aarch64] MI2a:       mark libcom_err
[aarch64] MI2a:      target libkeyutils.so.1()(64bit)
[aarch64] MI2a:       mark libkeyutils
[aarch64] MI2a:      target libssl.so.1.1()(64bit)
[aarch64] MI2a:       mark libssl1.1
[aarch64] MI2a:      target libverto.so.1()(64bit)
[aarch64] MI2a:       mark libverto
[aarch64] MI2a:    target libidn2.so.0()(64bit)
[aarch64] MI2a:     mark libidn2
[aarch64] MI2a:    target liblber-2.4.so.2()(64bit)
[aarch64] MI2a:     mark libldap
[aarch64] MI2a:      target libsasl2.so.3()(64bit)
[aarch64] MI2a:       mark libsasl2-3
[aarch64] MI2a:    target libnghttp2.so.14()(64bit)
[aarch64] MI2a:     mark libnghttp2
[aarch64] MI2a:    target libpsl.so.5()(64bit)
[aarch64] MI2a:     mark libpsl
[aarch64] MI2a:      target publicsuffix-list-dafsa
[aarch64] MI2a:       mark publicsuffix-list-dafsa
[aarch64] MI2a:  target libexpat.so.1()(64bit)
[aarch64] MI2a:   mark libexpat
[aarch64] MI2a:  target libjsoncpp.so.19()(64bit)
[aarch64] MI2a:   mark libjsoncpp19
[aarch64] MI2a:  target librhash.so.0()(64bit)
[aarch64] MI2a:   mark librhash
[aarch64] MI2a:  target libuv.so.1()(64bit)
[aarch64] MI2a:   mark libuv
[aarch64] MI2a:  target cmake-modules
[aarch64] MI2a:   mark cmake-modules
[aarch64] MI2a:    target dump
[aarch64] MI2a:     mark dump
[aarch64] MI2a:      target libe2p.so.2()(64bit)
[aarch64] MI2a:       mark libe2fs
[aarch64] MI2a:      target rmt
[aarch64] MI2a:       mark rmt
[aarch64] MI2a:  target rpm-macros-cmake
[aarch64] MI2a:   mark rpm-macros-cmake
[aarch64] MI2a: mark gcc-c++
[aarch64] MI2a:  target gcc8-c++
[aarch64] MI2a:   mark gcc8-c++
[aarch64] MI2a:    target libstdc++8-devel
[aarch64] MI2a:     mark libstdc++8-devel
[aarch64] MI2a:      target gcc-c++-common
[aarch64] MI2a:       mark gcc-c++-common
[aarch64] Selected version cmake#3.16.3-alt1:p9+245760.100.3.1@1582902679 for cmake>=3.14
[aarch64] E: Version >='1.12.1' for 'libupnp-devel' was not found
[aarch64] hsh-install: Failed to calculate package file list.
[aarch64] hsh-install: Failed to generate package file list.
2021-Feb-12 22:10:40 :: [aarch64] gerbera.git 1.6.4-alt1: remote: cannot build src.rpm
2021-Feb-12 22:10:40 :: [aarch64] #100 gerbera.git 1.6.4-alt1: build FAILED
[ppc64le] warning: Macro %cmake not found
[ppc64le] warning: Macro %cmake_build not found
[ppc64le] warning: Macro %cmakeinstall_std not found
[ppc64le] Reading Package Lists...
[ppc64le] Building Dependency Tree...
[ppc64le] MI2a: mark cmake
[ppc64le] MI2a:  target libarchive.so.13()(64bit)
[ppc64le] MI2a:   mark libarchive13
[ppc64le] MI2a:    target libcrypto.so.1.1()(64bit)
[ppc64le] MI2a:     mark libcrypto1.1
[ppc64le] MI2a:      target ca-certificates
[ppc64le] MI2a:       mark ca-certificates
[ppc64le] MI2a:        target ca-trust
[ppc64le] MI2a:         mark ca-trust
[ppc64le] MI2a:          target p11-kit-trust
[ppc64le] MI2a:           mark p11-kit-trust
[ppc64le] MI2a:            target /etc/alternatives/packages.d
[ppc64le] MI2a:             mark alternatives
[ppc64le] MI2a:              target rpm-macros-alternatives
[ppc64le] MI2a:               mark rpm-macros-alternatives
[ppc64le] MI2a:            target libtasn1.so.6()(64bit)
[ppc64le] MI2a:             mark libtasn1
[ppc64le] MI2a:            target libp11-kit
[ppc64le] MI2a:             mark libp11-kit
[ppc64le] MI2a:  target libcurl.so.4()(64bit)
[ppc64le] MI2a:   mark libcurl
[ppc64le] MI2a:    target libbrotlidec.so.1()(64bit)
[ppc64le] MI2a:     mark libbrotlidec
[ppc64le] MI2a:      target libbrotlicommon
[ppc64le] MI2a:       mark libbrotlicommon
[ppc64le] MI2a:    target libgssapi_krb5.so.2()(64bit)
[ppc64le] MI2a:     mark libkrb5
[ppc64le] MI2a:      target libcom_err.so.2()(64bit)
[ppc64le] MI2a:       mark libcom_err
[ppc64le] MI2a:      target libkeyutils.so.1()(64bit)
[ppc64le] MI2a:       mark libkeyutils
[ppc64le] MI2a:      target libssl.so.1.1()(64bit)
[ppc64le] MI2a:       mark libssl1.1
[ppc64le] MI2a:      target libverto.so.1()(64bit)
[ppc64le] MI2a:       mark libverto
[ppc64le] MI2a:    target libidn2.so.0()(64bit)
[ppc64le] MI2a:     mark libidn2
[ppc64le] MI2a:    target liblber-2.4.so.2()(64bit)
[ppc64le] MI2a:     mark libldap
[ppc64le] MI2a:      target libsasl2.so.3()(64bit)
[ppc64le] MI2a:       mark libsasl2-3
[ppc64le] MI2a:    target libnghttp2.so.14()(64bit)
[ppc64le] MI2a:     mark libnghttp2
[ppc64le] MI2a:    target libpsl.so.5()(64bit)
[ppc64le] MI2a:     mark libpsl
[ppc64le] MI2a:      target publicsuffix-list-dafsa
[ppc64le] MI2a:       mark publicsuffix-list-dafsa
[ppc64le] MI2a:  target libexpat.so.1()(64bit)
[ppc64le] MI2a:   mark libexpat
[ppc64le] MI2a:  target libjsoncpp.so.19()(64bit)
[ppc64le] MI2a:   mark libjsoncpp19
[ppc64le] MI2a:  target librhash.so.0()(64bit)
[ppc64le] MI2a:   mark librhash
[ppc64le] MI2a:  target libuv.so.1()(64bit)
[ppc64le] MI2a:   mark libuv
[ppc64le] MI2a:  target cmake-modules
[ppc64le] MI2a:   mark cmake-modules
[ppc64le] MI2a:    target dump
[ppc64le] MI2a:     mark dump
[ppc64le] MI2a:      target libe2p.so.2()(64bit)
[ppc64le] MI2a:       mark libe2fs
[ppc64le] MI2a:      target rmt
[ppc64le] MI2a:       mark rmt
[ppc64le] MI2a:  target rpm-macros-cmake
[ppc64le] MI2a:   mark rpm-macros-cmake
[ppc64le] MI2a: mark gcc-c++
[ppc64le] MI2a:  target gcc8-c++
[ppc64le] MI2a:   mark gcc8-c++
[ppc64le] MI2a:    target libstdc++8-devel
[ppc64le] MI2a:     mark libstdc++8-devel
[ppc64le] MI2a:      target gcc-c++-common
[ppc64le] MI2a:       mark gcc-c++-common
[ppc64le] Selected version cmake#3.16.3-alt1:p9+245760.100.3.1@1582902787 for cmake>=3.14
[ppc64le] E: Version >='1.12.1' for 'libupnp-devel' was not found
[ppc64le] hsh-install: Failed to calculate package file list.
[ppc64le] hsh-install: Failed to generate package file list.
2021-Feb-12 22:10:43 :: [ppc64le] gerbera.git 1.6.4-alt1: remote: cannot build src.rpm
2021-Feb-12 22:10:43 :: [ppc64le] #100 gerbera.git 1.6.4-alt1: build FAILED
[armh] warning: Macro %cmake not found
[armh] warning: Macro %cmake_build not found
[armh] warning: Macro %cmakeinstall_std not found
[armh] Reading Package Lists...
[armh] Building Dependency Tree...
[armh] MI2a: mark cmake
[armh] MI2a:  target libarchive.so.13
[armh] MI2a:   mark libarchive13
[armh] MI2a:    target libcrypto.so.1.1
[armh] MI2a:     mark libcrypto1.1
[armh] MI2a:      target ca-certificates
[armh] MI2a:       mark ca-certificates
[armh] MI2a:        target ca-trust
[armh] MI2a:         mark ca-trust
[armh] MI2a:          target p11-kit-trust
[armh] MI2a:           mark p11-kit-trust
[armh] MI2a:            target /etc/alternatives/packages.d
[armh] MI2a:             mark alternatives
[armh] MI2a:              target rpm-macros-alternatives
[armh] MI2a:               mark rpm-macros-alternatives
[armh] MI2a:            target libtasn1.so.6
[armh] MI2a:             mark libtasn1
[armh] MI2a:            target libp11-kit
[armh] MI2a:             mark libp11-kit
[armh] MI2a:  target libcurl.so.4
[armh] MI2a:   mark libcurl
[armh] MI2a:    target libbrotlidec.so.1
[armh] MI2a:     mark libbrotlidec
[armh] MI2a:      target libbrotlicommon
[armh] MI2a:       mark libbrotlicommon
[armh] MI2a:    target libgssapi_krb5.so.2
[armh] MI2a:     mark libkrb5
[armh] MI2a:      target libcom_err.so.2
[armh] MI2a:       mark libcom_err
[armh] MI2a:      target libkeyutils.so.1
[armh] MI2a:       mark libkeyutils
[armh] MI2a:      target libssl.so.1.1
[armh] MI2a:       mark libssl1.1
[armh] MI2a:      target libverto.so.1
[armh] MI2a:       mark libverto
[armh] MI2a:    target libidn2.so.0
[armh] MI2a:     mark libidn2
[armh] MI2a:    target liblber-2.4.so.2
[armh] MI2a:     mark libldap
[armh] MI2a:      target libsasl2.so.3
[armh] MI2a:       mark libsasl2-3
[armh] MI2a:    target libnghttp2.so.14
[armh] MI2a:     mark libnghttp2
[armh] MI2a:    target libpsl.so.5
[armh] MI2a:     mark libpsl
[armh] MI2a:      target publicsuffix-list-dafsa
[armh] MI2a:       mark publicsuffix-list-dafsa
[armh] MI2a:  target libexpat.so.1
[armh] MI2a:   mark libexpat
[armh] MI2a:  target libjsoncpp.so.19
[armh] MI2a:   mark libjsoncpp19
[armh] MI2a:  target librhash.so.0
[armh] MI2a:   mark librhash
[armh] MI2a:  target libuv.so.1
[armh] MI2a:   mark libuv
[armh] MI2a:  target cmake-modules
[armh] MI2a:   mark cmake-modules
[armh] MI2a:    target dump
[armh] MI2a:     mark dump
[armh] MI2a:      target libe2p.so.2
[armh] MI2a:       mark libe2fs
[armh] MI2a:      target rmt
[armh] MI2a:       mark rmt
[armh] MI2a:  target rpm-macros-cmake
[armh] MI2a:   mark rpm-macros-cmake
[armh] MI2a: mark gcc-c++
[armh] MI2a:  target gcc8-c++
[armh] MI2a:   mark gcc8-c++
[armh] MI2a:    target libstdc++8-devel
[armh] MI2a:     mark libstdc++8-devel
[armh] MI2a:      target gcc-c++-common
[armh] MI2a:       mark gcc-c++-common
[armh] Selected version cmake#3.16.3-alt1:p9+245760.100.3.1@1591945348 for cmake>=3.14
[armh] E: Version >='1.12.1' for 'libupnp-devel' was not found
[armh] hsh-install: Failed to calculate package file list.
[armh] hsh-install: Failed to generate package file list.
2021-Feb-12 22:10:52 :: [armh] gerbera.git 1.6.4-alt1: remote: cannot build src.rpm, but we don't care
2021-Feb-12 22:10:52 :: [armh] #100 gerbera.git 1.6.4-alt1: build SKIPPED
2021-Feb-12 22:10:39 :: [x86_64] build FAILED
2021-Feb-12 22:10:40 :: [i586] build FAILED
2021-Feb-12 22:10:40 :: [aarch64] build FAILED
2021-Feb-12 22:10:43 :: [ppc64le] build FAILED
2021-Feb-12 22:10:52 :: task #266243 for p9 FAILED


^ permalink raw reply	[flat|nested] 3+ messages in thread

* [#266243] [test-only] p9 FAILED (try 2) libupnp.git=libupnp-1.14.0-alt1 gerbera.git=1.6.4-alt1 ...
  2021-02-12 22:10 [#266243] [test-only] p9 FAILED gerbera.git=1.6.4-alt1 Girar awaiter (zerg)
@ 2021-02-15  5:46 ` Girar awaiter (zerg)
  2021-02-15  5:52 ` [#266243] [test-only] p9 FAILED (try 3) spdlog.git=1.8.0-alt1 libupnp.git=libupnp-1.14.0-alt1 Girar awaiter (zerg)
  1 sibling, 0 replies; 3+ messages in thread
From: Girar awaiter (zerg) @ 2021-02-15  5:46 UTC (permalink / raw)
  To: Sergey V. Turchin; +Cc: sisyphus-incominger, girar-builder-p9

http://git.altlinux.org/tasks/266243/logs/events.2.1.log

subtask  name     aarch64  armh    i586  ppc64le  x86_64
   #200  libupnp       49  1:10      53     1:07      47
   #300  gerbera   failed     ?  failed        ?  failed

2021-Feb-15 05:44:54 :: test-only task #266243 for p9 resumed by zerg:
2021-Feb-15 05:44:54 :: message: replace_for_mediatomb
#100 removed
#200 build libupnp-1.14.0-alt1 from /gears/l/libupnp.git fetched at 2021-Feb-15 05:43:59
#300 build 1.6.4-alt1 from /gears/g/gerbera.git fetched at 2021-Feb-15 05:44:14
#400 build 0.20.23-alt3 from /gears/m/mpd.git fetched at 2021-Feb-15 05:44:39
#500 build 3.0.11.1-alt2 from /gears/v/vlc.git fetched at 2021-Feb-15 05:44:47
2021-Feb-15 05:44:55 :: created build repo
2021-Feb-15 05:44:55 :: [x86_64] #200 libupnp.git libupnp-1.14.0-alt1: build start
2021-Feb-15 05:44:55 :: [ppc64le] #200 libupnp.git libupnp-1.14.0-alt1: build start
2021-Feb-15 05:44:55 :: [armh] #200 libupnp.git libupnp-1.14.0-alt1: build start
2021-Feb-15 05:44:55 :: [i586] #200 libupnp.git libupnp-1.14.0-alt1: build start
2021-Feb-15 05:44:55 :: [aarch64] #200 libupnp.git libupnp-1.14.0-alt1: build start
2021-Feb-15 05:45:42 :: [x86_64] #200 libupnp.git libupnp-1.14.0-alt1: build OK
2021-Feb-15 05:45:42 :: [x86_64] #300 gerbera.git 1.6.4-alt1: build start
2021-Feb-15 05:45:44 :: [aarch64] #200 libupnp.git libupnp-1.14.0-alt1: build OK
2021-Feb-15 05:45:44 :: [aarch64] #300 gerbera.git 1.6.4-alt1: build start
2021-Feb-15 05:45:48 :: [i586] #200 libupnp.git libupnp-1.14.0-alt1: build OK
2021-Feb-15 05:45:48 :: [i586] #300 gerbera.git 1.6.4-alt1: build start
[x86_64] warning: Macro %cmake not found
[x86_64] warning: Macro %cmake_build not found
[x86_64] warning: Macro %cmakeinstall_std not found
[x86_64] Reading Package Lists...
[x86_64] Building Dependency Tree...
[x86_64] MI2a: mark cmake
[x86_64] MI2a:  target libarchive.so.13()(64bit)
[x86_64] MI2a:   mark libarchive13
[x86_64] MI2a:    target libcrypto.so.1.1()(64bit)
[x86_64] MI2a:     mark libcrypto1.1
[x86_64] MI2a:      target ca-certificates
[x86_64] MI2a:       mark ca-certificates
[x86_64] MI2a:        target ca-trust
[x86_64] MI2a:         mark ca-trust
[x86_64] MI2a:          target p11-kit-trust
[x86_64] MI2a:           mark p11-kit-trust
[x86_64] MI2a:            target /etc/alternatives/packages.d
[x86_64] MI2a:             mark alternatives
[x86_64] MI2a:              target rpm-macros-alternatives
[x86_64] MI2a:               mark rpm-macros-alternatives
[x86_64] MI2a:            target libtasn1.so.6()(64bit)
[x86_64] MI2a:             mark libtasn1
[x86_64] MI2a:            target libp11-kit
[x86_64] MI2a:             mark libp11-kit
[x86_64] MI2a:  target libcurl.so.4()(64bit)
[x86_64] MI2a:   mark libcurl
[x86_64] MI2a:    target libbrotlidec.so.1()(64bit)
[x86_64] MI2a:     mark libbrotlidec
[x86_64] MI2a:      target libbrotlicommon
[x86_64] MI2a:       mark libbrotlicommon
[x86_64] MI2a:    target libgssapi_krb5.so.2()(64bit)
[x86_64] MI2a:     mark libkrb5
[x86_64] MI2a:      target libcom_err.so.2()(64bit)
[x86_64] MI2a:       mark libcom_err
[x86_64] MI2a:      target libkeyutils.so.1()(64bit)
[x86_64] MI2a:       mark libkeyutils
[x86_64] MI2a:      target libssl.so.1.1()(64bit)
[x86_64] MI2a:       mark libssl1.1
[x86_64] MI2a:      target libverto.so.1()(64bit)
[x86_64] MI2a:       mark libverto
[x86_64] MI2a:    target libidn2.so.0()(64bit)
[x86_64] MI2a:     mark libidn2
[x86_64] MI2a:    target liblber-2.4.so.2()(64bit)
[x86_64] MI2a:     mark libldap
[x86_64] MI2a:      target libsasl2.so.3()(64bit)
[x86_64] MI2a:       mark libsasl2-3
[x86_64] MI2a:    target libnghttp2.so.14()(64bit)
[x86_64] MI2a:     mark libnghttp2
[x86_64] MI2a:    target libpsl.so.5()(64bit)
[x86_64] MI2a:     mark libpsl
[x86_64] MI2a:      target publicsuffix-list-dafsa
[x86_64] MI2a:       mark publicsuffix-list-dafsa
[x86_64] MI2a:  target libexpat.so.1()(64bit)
[x86_64] MI2a:   mark libexpat
[x86_64] MI2a:  target libjsoncpp.so.19()(64bit)
[x86_64] MI2a:   mark libjsoncpp19
[x86_64] MI2a:  target librhash.so.0()(64bit)
[x86_64] MI2a:   mark librhash
[x86_64] MI2a:  target libuv.so.1()(64bit)
[x86_64] MI2a:   mark libuv
[x86_64] MI2a:  target cmake-modules
[x86_64] MI2a:   mark cmake-modules
[x86_64] MI2a:    target dump
[x86_64] MI2a:     mark dump
[x86_64] MI2a:      target libe2p.so.2()(64bit)
[x86_64] MI2a:       mark libe2fs
[x86_64] MI2a:      target rmt
[x86_64] MI2a:       mark rmt
[x86_64] MI2a:  target rpm-macros-cmake
[x86_64] MI2a:   mark rpm-macros-cmake
[x86_64] MI2a: mark gcc-c++
[x86_64] MI2a:  target gcc8-c++
[x86_64] MI2a:   mark gcc8-c++
[x86_64] MI2a:    target libstdc++8-devel
[x86_64] MI2a:     mark libstdc++8-devel
[x86_64] MI2a:      target gcc-c++-common
[x86_64] MI2a:       mark gcc-c++-common
[x86_64] MI2a: mark libupnp-devel
[x86_64] MI2a:  target libupnp17
[x86_64] MI2a:   mark libupnp17
[x86_64] MI2a:    target libixml11
[x86_64] MI2a:     mark libixml11
[x86_64] MI2a: mark libfmt-devel
[x86_64] MI2a:  target libfmt
[x86_64] MI2a:   mark libfmt
[x86_64] Selected version cmake#3.16.3-alt1:p9+245760.100.3.1@1582902649 for cmake>=3.14
[x86_64] Selected version libupnp-devel#1.14.0-alt1:p9+266243.200.2.1@1613367939 for libupnp-devel>=1.12.1
[x86_64] E: Version >='1.4' for 'libspdlog-devel' was not found
[x86_64] hsh-install: Failed to calculate package file list.
[x86_64] hsh-install: Failed to generate package file list.
2021-Feb-15 05:45:56 :: [x86_64] gerbera.git 1.6.4-alt1: remote: cannot build src.rpm
2021-Feb-15 05:45:56 :: [x86_64] #300 gerbera.git 1.6.4-alt1: build FAILED
2021-Feb-15 05:45:56 :: [x86_64] requesting cancellation of task processing
[aarch64] warning: Macro %cmake not found
[aarch64] warning: Macro %cmake_build not found
[aarch64] warning: Macro %cmakeinstall_std not found
[aarch64] Reading Package Lists...
[aarch64] Building Dependency Tree...
[aarch64] MI2a: mark cmake
[aarch64] MI2a:  target libarchive.so.13()(64bit)
[aarch64] MI2a:   mark libarchive13
[aarch64] MI2a:    target libcrypto.so.1.1()(64bit)
[aarch64] MI2a:     mark libcrypto1.1
[aarch64] MI2a:      target ca-certificates
[aarch64] MI2a:       mark ca-certificates
[aarch64] MI2a:        target ca-trust
[aarch64] MI2a:         mark ca-trust
[aarch64] MI2a:          target p11-kit-trust
[aarch64] MI2a:           mark p11-kit-trust
[aarch64] MI2a:            target /etc/alternatives/packages.d
[aarch64] MI2a:             mark alternatives
[aarch64] MI2a:              target rpm-macros-alternatives
[aarch64] MI2a:               mark rpm-macros-alternatives
[aarch64] MI2a:            target libtasn1.so.6()(64bit)
[aarch64] MI2a:             mark libtasn1
[aarch64] MI2a:            target libp11-kit
[aarch64] MI2a:             mark libp11-kit
[aarch64] MI2a:  target libcurl.so.4()(64bit)
[aarch64] MI2a:   mark libcurl
[aarch64] MI2a:    target libbrotlidec.so.1()(64bit)
[aarch64] MI2a:     mark libbrotlidec
[aarch64] MI2a:      target libbrotlicommon
[aarch64] MI2a:       mark libbrotlicommon
[aarch64] MI2a:    target libgssapi_krb5.so.2()(64bit)
[aarch64] MI2a:     mark libkrb5
[aarch64] MI2a:      target libcom_err.so.2()(64bit)
[aarch64] MI2a:       mark libcom_err
[aarch64] MI2a:      target libkeyutils.so.1()(64bit)
[aarch64] MI2a:       mark libkeyutils
[aarch64] MI2a:      target libssl.so.1.1()(64bit)
[aarch64] MI2a:       mark libssl1.1
[aarch64] MI2a:      target libverto.so.1()(64bit)
[aarch64] MI2a:       mark libverto
[aarch64] MI2a:    target libidn2.so.0()(64bit)
[aarch64] MI2a:     mark libidn2
[aarch64] MI2a:    target liblber-2.4.so.2()(64bit)
[aarch64] MI2a:     mark libldap
[aarch64] MI2a:      target libsasl2.so.3()(64bit)
[aarch64] MI2a:       mark libsasl2-3
[aarch64] MI2a:    target libnghttp2.so.14()(64bit)
[aarch64] MI2a:     mark libnghttp2
[aarch64] MI2a:    target libpsl.so.5()(64bit)
[aarch64] MI2a:     mark libpsl
[aarch64] MI2a:      target publicsuffix-list-dafsa
[aarch64] MI2a:       mark publicsuffix-list-dafsa
[aarch64] MI2a:  target libexpat.so.1()(64bit)
[aarch64] MI2a:   mark libexpat
[aarch64] MI2a:  target libjsoncpp.so.19()(64bit)
[aarch64] MI2a:   mark libjsoncpp19
[aarch64] MI2a:  target librhash.so.0()(64bit)
[aarch64] MI2a:   mark librhash
[aarch64] MI2a:  target libuv.so.1()(64bit)
[aarch64] MI2a:   mark libuv
[aarch64] MI2a:  target cmake-modules
[aarch64] MI2a:   mark cmake-modules
[aarch64] MI2a:    target dump
[aarch64] MI2a:     mark dump
[aarch64] MI2a:      target libe2p.so.2()(64bit)
[aarch64] MI2a:       mark libe2fs
[aarch64] MI2a:      target rmt
[aarch64] MI2a:       mark rmt
[aarch64] MI2a:  target rpm-macros-cmake
[aarch64] MI2a:   mark rpm-macros-cmake
[aarch64] MI2a: mark gcc-c++
[aarch64] MI2a:  target gcc8-c++
[aarch64] MI2a:   mark gcc8-c++
[aarch64] MI2a:    target libstdc++8-devel
[aarch64] MI2a:     mark libstdc++8-devel
[aarch64] MI2a:      target gcc-c++-common
[aarch64] MI2a:       mark gcc-c++-common
[aarch64] MI2a: mark libupnp-devel
[aarch64] MI2a:  target libupnp17
[aarch64] MI2a:   mark libupnp17
[aarch64] MI2a:    target libixml11
[aarch64] MI2a:     mark libixml11
[aarch64] MI2a: mark libfmt-devel
[aarch64] MI2a:  target libfmt
[aarch64] MI2a:   mark libfmt
[aarch64] Selected version cmake#3.16.3-alt1:p9+245760.100.3.1@1582902679 for cmake>=3.14
[aarch64] Selected version libupnp-devel#1.14.0-alt1:p9+266243.200.2.1@1613367941 for libupnp-devel>=1.12.1
[aarch64] E: Version >='1.4' for 'libspdlog-devel' was not found
[aarch64] hsh-install: Failed to calculate package file list.
[aarch64] hsh-install: Failed to generate package file list.
2021-Feb-15 05:45:59 :: [aarch64] gerbera.git 1.6.4-alt1: remote: cannot build src.rpm
2021-Feb-15 05:45:59 :: [aarch64] #300 gerbera.git 1.6.4-alt1: build FAILED
[i586] warning: Macro %cmake not found
[i586] warning: Macro %cmake_build not found
[i586] warning: Macro %cmakeinstall_std not found
[i586] Reading Package Lists...
[i586] Building Dependency Tree...
[i586] MI2a: mark cmake
[i586] MI2a:  target libarchive.so.13
[i586] MI2a:   mark libarchive13
[i586] MI2a:    target libcrypto.so.1.1
[i586] MI2a:     mark libcrypto1.1
[i586] MI2a:      target ca-certificates
[i586] MI2a:       mark ca-certificates
[i586] MI2a:        target ca-trust
[i586] MI2a:         mark ca-trust
[i586] MI2a:          target p11-kit-trust
[i586] MI2a:           mark p11-kit-trust
[i586] MI2a:            target /etc/alternatives/packages.d
[i586] MI2a:             mark alternatives
[i586] MI2a:              target rpm-macros-alternatives
[i586] MI2a:               mark rpm-macros-alternatives
[i586] MI2a:            target libtasn1.so.6
[i586] MI2a:             mark libtasn1
[i586] MI2a:            target libp11-kit
[i586] MI2a:             mark libp11-kit
[i586] MI2a:  target libcurl.so.4
[i586] MI2a:   mark libcurl
[i586] MI2a:    target libbrotlidec.so.1
[i586] MI2a:     mark libbrotlidec
[i586] MI2a:      target libbrotlicommon
[i586] MI2a:       mark libbrotlicommon
[i586] MI2a:    target libgssapi_krb5.so.2
[i586] MI2a:     mark libkrb5
[i586] MI2a:      target libcom_err.so.2
[i586] MI2a:       mark libcom_err
[i586] MI2a:      target libkeyutils.so.1
[i586] MI2a:       mark libkeyutils
[i586] MI2a:      target libssl.so.1.1
[i586] MI2a:       mark libssl1.1
[i586] MI2a:      target libverto.so.1
[i586] MI2a:       mark libverto
[i586] MI2a:    target libidn2.so.0
[i586] MI2a:     mark libidn2
[i586] MI2a:    target liblber-2.4.so.2
[i586] MI2a:     mark libldap
[i586] MI2a:      target libsasl2.so.3
[i586] MI2a:       mark libsasl2-3
[i586] MI2a:    target libnghttp2.so.14
[i586] MI2a:     mark libnghttp2
[i586] MI2a:    target libpsl.so.5
[i586] MI2a:     mark libpsl
[i586] MI2a:      target publicsuffix-list-dafsa
[i586] MI2a:       mark publicsuffix-list-dafsa
[i586] MI2a:  target libexpat.so.1
[i586] MI2a:   mark libexpat
[i586] MI2a:  target libjsoncpp.so.19
[i586] MI2a:   mark libjsoncpp19
[i586] MI2a:  target librhash.so.0
[i586] MI2a:   mark librhash
[i586] MI2a:  target libuv.so.1
[i586] MI2a:   mark libuv
[i586] MI2a:  target cmake-modules
[i586] MI2a:   mark cmake-modules
[i586] MI2a:    target dump
[i586] MI2a:     mark dump
[i586] MI2a:      target libe2p.so.2
[i586] MI2a:       mark libe2fs
[i586] MI2a:      target rmt
[i586] MI2a:       mark rmt
[i586] MI2a:  target rpm-macros-cmake
[i586] MI2a:   mark rpm-macros-cmake
[i586] MI2a: mark gcc-c++
[i586] MI2a:  target gcc8-c++
[i586] MI2a:   mark gcc8-c++
[i586] MI2a:    target libstdc++8-devel
[i586] MI2a:     mark libstdc++8-devel
[i586] MI2a:      target gcc-c++-common
[i586] MI2a:       mark gcc-c++-common
[i586] MI2a: mark libupnp-devel
[i586] MI2a:  target libupnp17
[i586] MI2a:   mark libupnp17
[i586] MI2a:    target libixml11
[i586] MI2a:     mark libixml11
[i586] MI2a: mark libfmt-devel
[i586] MI2a:  target libfmt
[i586] MI2a:   mark libfmt
[i586] Selected version cmake#3.16.3-alt1:p9+245760.100.3.1@1582902678 for cmake>=3.14
[i586] Selected version libupnp-devel#1.14.0-alt1:p9+266243.200.2.1@1613367945 for libupnp-devel>=1.12.1
[i586] E: Version >='1.4' for 'libspdlog-devel' was not found
[i586] hsh-install: Failed to calculate package file list.
[i586] hsh-install: Failed to generate package file list.
2021-Feb-15 05:46:01 :: [i586] gerbera.git 1.6.4-alt1: remote: cannot build src.rpm
2021-Feb-15 05:46:01 :: [i586] #300 gerbera.git 1.6.4-alt1: build FAILED
2021-Feb-15 05:46:02 :: [ppc64le] #200 libupnp.git libupnp-1.14.0-alt1: build OK
2021-Feb-15 05:46:02 :: [ppc64le] task processing CANCELLED
2021-Feb-15 05:46:05 :: [armh] #200 libupnp.git libupnp-1.14.0-alt1: build OK
2021-Feb-15 05:46:05 :: [armh] task processing CANCELLED
2021-Feb-15 05:45:56 :: [x86_64] build FAILED
2021-Feb-15 05:45:59 :: [aarch64] build FAILED
2021-Feb-15 05:46:01 :: [i586] build FAILED
2021-Feb-15 05:46:02 :: [ppc64le] build FAILED
2021-Feb-15 05:46:05 :: [armh] build FAILED
2021-Feb-15 05:46:05 :: task #266243 for p9 FAILED


^ permalink raw reply	[flat|nested] 3+ messages in thread

* [#266243] [test-only] p9 FAILED (try 3) spdlog.git=1.8.0-alt1 libupnp.git=libupnp-1.14.0-alt1 ...
  2021-02-12 22:10 [#266243] [test-only] p9 FAILED gerbera.git=1.6.4-alt1 Girar awaiter (zerg)
  2021-02-15  5:46 ` [#266243] [test-only] p9 FAILED (try 2) libupnp.git=libupnp-1.14.0-alt1 gerbera.git=1.6.4-alt1 Girar awaiter (zerg)
@ 2021-02-15  5:52 ` Girar awaiter (zerg)
  1 sibling, 0 replies; 3+ messages in thread
From: Girar awaiter (zerg) @ 2021-02-15  5:52 UTC (permalink / raw)
  To: Sergey V. Turchin; +Cc: sisyphus-incominger, girar-builder-p9

http://git.altlinux.org/tasks/266243/logs/events.3.1.log

subtask  name    aarch64    armh    i586  ppc64le  x86_64
   #140  spdlog   failed  failed  failed   failed  failed

2021-Feb-15 05:50:38 :: test-only task #266243 for p9 resumed by zerg:
2021-Feb-15 05:50:38 :: message: replace_for_mediatomb
#100 removed
#140 build 1.8.0-alt1 from /gears/s/spdlog.git fetched at 2021-Feb-15 05:50:18
#200 build libupnp-1.14.0-alt1 from /gears/l/libupnp.git fetched at 2021-Feb-15 05:43:59
#300 build 1.6.4-alt1 from /gears/g/gerbera.git fetched at 2021-Feb-15 05:44:14
#400 build 0.20.23-alt3 from /gears/m/mpd.git fetched at 2021-Feb-15 05:44:39
#500 build 3.0.11.1-alt2 from /gears/v/vlc.git fetched at 2021-Feb-15 05:44:47
2021-Feb-15 05:50:38 :: created build repo
2021-Feb-15 05:50:39 :: [x86_64] #140 spdlog.git 1.8.0-alt1: build start
2021-Feb-15 05:50:39 :: [ppc64le] #140 spdlog.git 1.8.0-alt1: build start
2021-Feb-15 05:50:39 :: [aarch64] #140 spdlog.git 1.8.0-alt1: build start
2021-Feb-15 05:50:39 :: [i586] #140 spdlog.git 1.8.0-alt1: build start
2021-Feb-15 05:50:39 :: [armh] #140 spdlog.git 1.8.0-alt1: build start
[x86_64] -- Checking for module 'libsystemd'
[x86_64] --   No package 'libsystemd' found
[x86_64] -- Generating install
[x86_64] --
[x86_64]                  from /usr/src/RPM/BUILD/spdlog-1.8.0/example/example.cpp:224:
[x86_64] /usr/include/fmt/ostream.h:103:8: error: partial specialization of 'struct fmt::v5::convert_to_int<T, Char, void>' after instantiation of 'struct fmt::v5::convert_to_int<double, char, void>' [-fpermissive]
[x86_64]  struct convert_to_int<T, Char, void> {
2021-Feb-15 05:51:43 :: [x86_64] spdlog.git 1.8.0-alt1: remote: build failed
2021-Feb-15 05:51:43 :: [x86_64] #140 spdlog.git 1.8.0-alt1: build FAILED
2021-Feb-15 05:51:43 :: [x86_64] requesting cancellation of task processing
[aarch64] -- Checking for module 'libsystemd'
[aarch64] --   No package 'libsystemd' found
[aarch64] -- Generating install
[aarch64] --
[aarch64]                  from /usr/src/RPM/BUILD/spdlog-1.8.0/example/example.cpp:224:
[aarch64] /usr/include/fmt/ostream.h:103:8: error: partial specialization of 'struct fmt::v5::convert_to_int<T, Char, void>' after instantiation of 'struct fmt::v5::convert_to_int<double, char, void>' [-fpermissive]
[aarch64]  struct convert_to_int<T, Char, void> {
2021-Feb-15 05:51:47 :: [aarch64] spdlog.git 1.8.0-alt1: remote: build failed
2021-Feb-15 05:51:47 :: [aarch64] #140 spdlog.git 1.8.0-alt1: build FAILED
[ppc64le] make[2]: Entering directory '/usr/src/RPM/BUILD/spdlog-1.8.0/BUILD'
[ppc64le] [ 61%] Building CXX object tests/CMakeFiles/spdlog-utests.dir/main.cpp.o
[ppc64le] make[2]: Leaving directory '/usr/src/RPM/BUILD/spdlog-1.8.0/BUILD'
[ppc64le] make[2]: Entering directory '/usr/src/RPM/BUILD/spdlog-1.8.0/BUILD'
[ppc64le] [ 96%] Linking CXX executable spdlog-utests
[ppc64le] make[2]: Leaving directory '/usr/src/RPM/BUILD/spdlog-1.8.0/BUILD'
[ppc64le] make[1]: Entering directory '/usr/src/RPM/BUILD/spdlog-1.8.0/BUILD'
[ppc64le] [ 96%] Built target spdlog-utests
[ppc64le] make[1]: Leaving directory '/usr/src/RPM/BUILD/spdlog-1.8.0/BUILD'
[ppc64le] make: *** [Makefile:163: all] Error 2
2021-Feb-15 05:51:53 :: [ppc64le] spdlog.git 1.8.0-alt1: remote: build failed
2021-Feb-15 05:51:53 :: [ppc64le] #140 spdlog.git 1.8.0-alt1: build FAILED
[i586] -- Checking for module 'libsystemd'
[i586] --   No package 'libsystemd' found
[i586] -- Generating install
[i586] --
[i586]                  from /usr/src/RPM/BUILD/spdlog-1.8.0/example/example.cpp:224:
[i586] /usr/include/fmt/ostream.h:103:8: error: partial specialization of 'struct fmt::v5::convert_to_int<T, Char, void>' after instantiation of 'struct fmt::v5::convert_to_int<double, char, void>' [-fpermissive]
[i586]  struct convert_to_int<T, Char, void> {
2021-Feb-15 05:51:58 :: [i586] spdlog.git 1.8.0-alt1: remote: build failed
2021-Feb-15 05:51:58 :: [i586] #140 spdlog.git 1.8.0-alt1: build FAILED
[armh] -- Checking for module 'libsystemd'
[armh] --   No package 'libsystemd' found
[armh] -- Generating install
[armh] --
[armh]                  from /usr/src/RPM/BUILD/spdlog-1.8.0/example/example.cpp:224:
[armh] /usr/include/fmt/ostream.h:103:8: error: partial specialization of 'struct fmt::v5::convert_to_int<T, Char, void>' after instantiation of 'struct fmt::v5::convert_to_int<double, char, void>' [-fpermissive]
[armh]  struct convert_to_int<T, Char, void> {
2021-Feb-15 05:52:37 :: [armh] spdlog.git 1.8.0-alt1: remote: build failed
2021-Feb-15 05:52:37 :: [armh] #140 spdlog.git 1.8.0-alt1: build FAILED
2021-Feb-15 05:51:43 :: [x86_64] build FAILED
2021-Feb-15 05:51:47 :: [aarch64] build FAILED
2021-Feb-15 05:51:53 :: [ppc64le] build FAILED
2021-Feb-15 05:51:58 :: [i586] build FAILED
2021-Feb-15 05:52:37 :: [armh] build FAILED
2021-Feb-15 05:52:37 :: task #266243 for p9 FAILED


^ permalink raw reply	[flat|nested] 3+ messages in thread

end of thread, other threads:[~2021-02-15  5:52 UTC | newest]

Thread overview: 3+ messages (download: mbox.gz / follow: Atom feed)
-- links below jump to the message on this page --
2021-02-12 22:10 [#266243] [test-only] p9 FAILED gerbera.git=1.6.4-alt1 Girar awaiter (zerg)
2021-02-15  5:46 ` [#266243] [test-only] p9 FAILED (try 2) libupnp.git=libupnp-1.14.0-alt1 gerbera.git=1.6.4-alt1 Girar awaiter (zerg)
2021-02-15  5:52 ` [#266243] [test-only] p9 FAILED (try 3) spdlog.git=1.8.0-alt1 libupnp.git=libupnp-1.14.0-alt1 Girar awaiter (zerg)

ALT Linux Girar Builder robot reports

This inbox may be cloned and mirrored by anyone:

	git clone --mirror http://lore.altlinux.org/sisyphus-incominger/0 sisyphus-incominger/git/0.git

	# If you have public-inbox 1.1+ installed, you may
	# initialize and index your mirror using the following commands:
	public-inbox-init -V2 sisyphus-incominger sisyphus-incominger/ http://lore.altlinux.org/sisyphus-incominger \
		sisyphus-incominger@lists.altlinux.org sisyphus-incominger@lists.altlinux.ru sisyphus-incominger@lists.altlinux.com
	public-inbox-index sisyphus-incominger

Example config snippet for mirrors.
Newsgroup available over NNTP:
	nntp://lore.altlinux.org/org.altlinux.lists.sisyphus-incominger


AGPL code for this site: git clone https://public-inbox.org/public-inbox.git