* [#145426] FAILED srpm=chromium-43.0.2357.124-alt1.src.rpm
@ 2015-06-14 12:54 Girar Builder awaiter robot
0 siblings, 0 replies; only message in thread
From: Girar Builder awaiter robot @ 2015-06-14 12:54 UTC (permalink / raw)
To: Andrey Cherepanov; +Cc: sisyphus-incominger
http://git.altlinux.org/tasks/145426/logs/events.1.1.log
2015-Jun-14 12:50:07 :: test-only task #145426 for sisyphus started by cas:
#100 build chromium-43.0.2357.124-alt1.src.rpm
2015-Jun-14 12:50:08 :: [i586] #100 chromium-43.0.2357.124-alt1.src.rpm: build start
2015-Jun-14 12:50:08 :: [x86_64] #100 chromium-43.0.2357.124-alt1.src.rpm: build start
+ sed -i 's|'\''-m32'\'',||g' src/build/common.gypi
+ sed -i 's|'\''-fno-exceptions'\'',|'\''-pipe'\'', '\''-Wall'\'', '\''-g'\'', '\''-O2'\'', '\''-DUSE_SYSTEM_LIBEVENT'\'', '\''-fPIC'\'', '\''-fno-ipa-cp'\'', '\''-fno-strict-aliasing'\'', '\'''\''|g' src/build/common.gypi
+ sed -i 's|'\''-Werror'\''|'\''-Wno-error'\''|g' src/build/common.gypi
+ _google_api_key=AIzaSyAIIWz7zaCwYcUSe3ZaRPviXjMjkBP4-xY
+ _google_default_client_id=1018394967181.apps.googleusercontent.com
+ _google_default_client_secret=h_PrTP1ymJu83YTLyz-E25nP
+ cd src
+ ./build/gyp_chromium -f ninja build/all.gyp -Dcomponent=shared_library -Dbuild_ffmpegsumo=1 -Ddisable_nacl=1 -Ddisable_pnacl=1 -Ddisable_sse2=1 -Denable_plugin_installation=0 -Ddisable_newlib_untar=1 -Dclang=0 -Dgoogle_api_key=AIzaSyAIIWz7zaCwYcUSe3ZaRPviXjMjkBP4-xY -Dgoogle_default_client_id=1018394967181.apps.googleusercontent.com -Dgoogle_default_client_secret=h_PrTP1ymJu83YTLyz-E25nP -Dffmpeg_branding=Chrome -Djavascript_engine=v8 -Dlinux_fpic=1 -Dlinux_dump_symbols=1 -Dlinux_link_gsettings=1 -Dlinux_link_libpci=1 -Dlinux_link_libspeechd=1 -Dlibspeechd_h_prefix=speech-dispatcher/ -Dlinux_link_pulseaudio=1 -Dlinux_strip_binary=1 -Dlinux_sandbox_chrome_path=/usr/lib64/chromium/chromium -Dlinux_sandbox_path=/usr/lib64/chromium/chrome-sandbox -Dclang_use_chrome_plugins=0 -Dhost_clang=0 -Dlinux_use_bundled_binutils=0 -Dlinux_use_bundled_gold=0 -Dlinux_use_gold_flags=0 -Dlogging_like_official_build=1 -Dproprietary_codecs=1 -Dremove_webcore_debug_symbols=1 -Dusb_ids_path=/usr/share/misc/usb.ids -Dwerror= -Ddisable_fatal_linker_warnings=1 -Dtarget_arch=x64 -Denable_webrtc=0 -Denable_widevine=0 -Duse_pulseaudio=1 -Duse_system_bzip2=1 -Duse_system_ffmpeg=0 -Duse_system_flac=1 -Duse_system_icu=1 -Duse_system_jsoncpp=1 -Duse_system_libbz2=1 -Duse_system_libexif=1 -Duse_system_libevent=1 -Duse_system_libjpeg=0 -Duse_system_libmtp=0 -Duse_system_libopus=1 -Duse_system_libpng=0 -Duse_system_libwebp=0 -Duse_system_libyuv=1 -Duse_system_libxml=1 -Duse_system_libxslt=1 -Duse_system_minizip=1 -Duse_system_nspr=0 -Duse_system_protobuf=0 -Duse_system_re2=1 -Duse_system_snappy=1 -Duse_system_speex=1 -Duse_system_sqlite=0 -Duse_system_v8=0 -Duse_system_vpx=0 -Duse_system_xdg_utils=0 -Duse_system_yasm=1 -Duse_system_zlib=0
Updating projects from gyp files...
gyp: Duplicate target definitions for third_party/icu/icu.gyp:icudata#target
2015-Jun-14 12:53:56 :: [x86_64] chromium-43.0.2357.124-alt1.src.rpm: remote: build failed
2015-Jun-14 12:53:56 :: [x86_64] #100 chromium-43.0.2357.124-alt1.src.rpm: build FAILED
+ sed -i 's|'\''-m32'\'',||g' src/build/common.gypi
+ sed -i 's|'\''-fno-exceptions'\'',|'\''-pipe'\'', '\''-Wall'\'', '\''-g'\'', '\''-O2'\'', '\''-march=i586'\'', '\''-mtune=generic'\'', '\''-DUSE_SYSTEM_LIBEVENT'\'', '\''-fPIC'\'', '\''-fno-ipa-cp'\'', '\''-fno-strict-aliasing'\'', '\'''\''|g' src/build/common.gypi
+ sed -i 's|'\''-Werror'\''|'\''-Wno-error'\''|g' src/build/common.gypi
+ _google_api_key=AIzaSyAIIWz7zaCwYcUSe3ZaRPviXjMjkBP4-xY
+ _google_default_client_id=1018394967181.apps.googleusercontent.com
+ _google_default_client_secret=h_PrTP1ymJu83YTLyz-E25nP
+ cd src
+ ./build/gyp_chromium -f ninja build/all.gyp -Dcomponent=shared_library -Dbuild_ffmpegsumo=1 -Ddisable_nacl=1 -Ddisable_pnacl=1 -Ddisable_sse2=1 -Denable_plugin_installation=0 -Ddisable_newlib_untar=1 -Dclang=0 -Dgoogle_api_key=AIzaSyAIIWz7zaCwYcUSe3ZaRPviXjMjkBP4-xY -Dgoogle_default_client_id=1018394967181.apps.googleusercontent.com -Dgoogle_default_client_secret=h_PrTP1ymJu83YTLyz-E25nP -Dffmpeg_branding=Chrome -Djavascript_engine=v8 -Dlinux_fpic=1 -Dlinux_dump_symbols=1 -Dlinux_link_gsettings=1 -Dlinux_link_libpci=1 -Dlinux_link_libspeechd=1 -Dlibspeechd_h_prefix=speech-dispatcher/ -Dlinux_link_pulseaudio=1 -Dlinux_strip_binary=1 -Dlinux_sandbox_chrome_path=/usr/lib/chromium/chromium -Dlinux_sandbox_path=/usr/lib/chromium/chrome-sandbox -Dclang_use_chrome_plugins=0 -Dhost_clang=0 -Dlinux_use_bundled_binutils=0 -Dlinux_use_bundled_gold=0 -Dlinux_use_gold_flags=0 -Dlogging_like_official_build=1 -Dproprietary_codecs=1 -Dremove_webcore_debug_symbols=1 -Dusb_ids_path=/usr/share/misc/usb.ids -Dwerror= -Ddisable_fatal_linker_warnings=1 -Denable_webrtc=0 -Denable_widevine=0 -Duse_pulseaudio=1 -Duse_system_bzip2=1 -Duse_system_ffmpeg=0 -Duse_system_flac=1 -Duse_system_icu=1 -Duse_system_jsoncpp=1 -Duse_system_libbz2=1 -Duse_system_libexif=1 -Duse_system_libevent=1 -Duse_system_libjpeg=0 -Duse_system_libmtp=0 -Duse_system_libopus=1 -Duse_system_libpng=0 -Duse_system_libwebp=0 -Duse_system_libyuv=1 -Duse_system_libxml=1 -Duse_system_libxslt=1 -Duse_system_minizip=1 -Duse_system_nspr=0 -Duse_system_protobuf=0 -Duse_system_re2=1 -Duse_system_snappy=1 -Duse_system_speex=1 -Duse_system_sqlite=0 -Duse_system_v8=0 -Duse_system_vpx=0 -Duse_system_xdg_utils=0 -Duse_system_yasm=1 -Duse_system_zlib=0
Updating projects from gyp files...
gyp: Duplicate target definitions for third_party/icu/icu.gyp:icudata#target
2015-Jun-14 12:54:15 :: [i586] chromium-43.0.2357.124-alt1.src.rpm: remote: build failed
2015-Jun-14 12:54:15 :: [i586] #100 chromium-43.0.2357.124-alt1.src.rpm: build FAILED
2015-Jun-14 12:53:56 :: [x86_64] build FAILED
2015-Jun-14 12:54:15 :: [i586] build FAILED
2015-Jun-14 12:54:15 :: task #145426 for sisyphus FAILED
^ permalink raw reply [flat|nested] only message in thread
only message in thread, other threads:[~2015-06-14 12:54 UTC | newest]
Thread overview: (only message) (download: mbox.gz / follow: Atom feed)
-- links below jump to the message on this page --
2015-06-14 12:54 [#145426] FAILED srpm=chromium-43.0.2357.124-alt1.src.rpm Girar Builder awaiter robot
ALT Linux Girar Builder robot reports
This inbox may be cloned and mirrored by anyone:
git clone --mirror http://lore.altlinux.org/sisyphus-incominger/0 sisyphus-incominger/git/0.git
# If you have public-inbox 1.1+ installed, you may
# initialize and index your mirror using the following commands:
public-inbox-init -V2 sisyphus-incominger sisyphus-incominger/ http://lore.altlinux.org/sisyphus-incominger \
sisyphus-incominger@lists.altlinux.org sisyphus-incominger@lists.altlinux.ru sisyphus-incominger@lists.altlinux.com
public-inbox-index sisyphus-incominger
Example config snippet for mirrors.
Newsgroup available over NNTP:
nntp://lore.altlinux.org/org.altlinux.lists.sisyphus-incominger
AGPL code for this site: git clone https://public-inbox.org/public-inbox.git