ALT Linux Sisyphus cybertalk
 help / color / mirror / Atom feed
From: ALT beekeeper <hiver@altlinux.org>
To: sisyphus-cybertalk@lists.altlinux.org
Subject: [cyber] I: p10-20261018 x86_64 beehive_status: +13 -19 (96)
Date: Sun, 18 Oct 2026 21:22:04 +0000
Message-ID: <atU4fO2Rlf1r806C@beehive.mskdc.altlinux.org> (raw)

	13 NEW error logs

atlas-3.9.35-alt1.qa1
	make[2]: Leaving directory '/usr/src/RPM/BUILD/ATLAS/BUILD/bin'
	ERROR 845 DURING CACHE EDGE DETECTION!!.
	make[2]: Entering directory '/usr/src/RPM/BUILD/ATLAS/BUILD/bin'
	--
	gcc -V 2>&1  >> bin/INSTALL_LOG/ERROR.LOG
	x86_64-alt-linux-gcc: error: unrecognized command-line option '-V'
	x86_64-alt-linux-gcc: fatal error: no input files
	compilation terminated.
	--
	directory.  Be sure to include this file in any help request.
	cat: ../../CONFIG/error.txt: No such file or directory
	=1 ku=20,

dropbear-2022.83-alt2
	0inputs+0outputs (0major+36907minor)pagefaults 0swaps
	Error: no exit code is found, failure.

dvdauthor-0.7.2-alt4
	71 |	    __bos (__s), __fmt, __va_arg_pack ());
	make[2]: Leaving directory '/usr/src/RPM/BUILD/dvdauthor-0.7.2/src'
	make[2]: Entering directory '/usr/src/RPM/BUILD/dvdauthor-0.7.2/src'
	x86_64-alt-linux-gcc -DHAVE_CONFIG_H -I.  -DSYSCONFDIR="\"/etc\"" -I/usr/include/libxml2
	-I/usr/include/GraphicsMagick -I/usr/include/freetype2 -I/usr/include/libpng16
	-I/usr/include/harfbuzz -I/usr/include/glib-2.0 -I/usr/lib64/glib-2.0/include
	-I/usr/include/fribidi -I/usr/include/freetype2 -I/usr/include/libpng16
	-I/usr/include/harfbuzz -I/usr/include/glib-2.0 -I/usr/lib64/glib-2.0/include  -Wall
	-pipe -frecord-gcc-switches -Wall -g -O2 -Wl,-z,noexecstack -c -o dvdvob.o dvdvob.c
	dvdvob.c: In function 'transpose_ts':
	dvdvob.c:366:59: warning: suggest parentheses around '&&' within '||' [-Wparentheses]
	366 |			  buf[17 + sysoffs] >= MPID_AUDIO_FIRST && buf[17 + sysoffs]
	<= MPID_VIDEO_LAST
	make[2]: Leaving directory '/usr/src/RPM/BUILD/dvdauthor-0.7.2/src'
	make[1]: *** [Makefile:426: all] Error 2
	make: *** [Makefile:417: all-recursive] Error 1

fwupd-1.9.20-alt1.p10.1
	0inputs+0outputs (0major+36808minor)pagefaults 0swaps
	Error: no exit code is found, failure.

glibc-6:2.32-alt5.p10.7
	UNSUPPORTED: nptl/test-rwlockattr-printers
	FAIL: nptl/tst-cancel28
	UNSUPPORTED: nptl/tst-pthread-getattr
	--
	UNSUPPORTED: sunrpc/tst-svc_register
	FAIL: time/tst-cpuclock1
	Summary of test results:
	--
	+ rc=2
	+ grep '^FAIL:' build-x86_64-linux/tests.sum
	+ cut '-d ' -f2-
	--
	==> build-x86_64-linux/nptl/tst-cancel28.test-result <==
	FAIL: nptl/tst-cancel28
	original exit status 1
	--
	==> build-x86_64-linux/time/tst-cpuclock1.test-result <==
	FAIL: time/tst-cpuclock1
	original exit status 1

ima-evm-utils-1.3.2-alt1
	0inputs+0outputs (0major+36344minor)pagefaults 0swaps
	Error: no exit code is found, failure.

kernel-image-std-def-2:5.10.271-alt1
	0inputs+0outputs (0major+35872minor)pagefaults 0swaps
	Error: no exit code is found, failure.
	error: Bad exit status from /usr/src/tmp/rpm-tmp.64796 (%check)

kernel-image-un-def-1:6.1.186-alt1
	0inputs+0outputs (0major+37283minor)pagefaults 0swaps
	Error: no exit code is found, failure.

openblas-0.3.23-alt1.2
	ger.c: In function 'sger_':
	ger.c:167:49: error: 'GEMM_MULTITHREAD_THRESHOLD' undeclared (first use in this function)
	167 |	if (incx == 1 && incy == 1 && 1L*m*n <= 2048 *GEMM_MULTITHREAD_THRESHOLD) {
	--
	gemv.c: In function 'sgemv_':
	gemv.c:229:29: error: 'GEMM_MULTITHREAD_THRESHOLD' undeclared (first use in this function)
	229 |	if ( 1L * m * n < 2304L * GEMM_MULTITHREAD_THRESHOLD )
	--
	gemv.c: In function 'cblas_sgemv':
	gemv.c:229:29: error: 'GEMM_MULTITHREAD_THRESHOLD' undeclared (first use in this function)
	229 |	if ( 1L * m * n < 2304L * GEMM_MULTITHREAD_THRESHOLD )
	--
	ger.c: In function 'cblas_sger':
	ger.c:167:49: error: 'GEMM_MULTITHREAD_THRESHOLD' undeclared (first use in this function)
	167 |	if (incx == 1 && incy == 1 && 1L*m*n <= 2048 *GEMM_MULTITHREAD_THRESHOLD) {

python3-module-nbclient-0.5.0-alt1
	nbclient/tests/test_client.py::test_run_all_notebooks[Interrupt.ipynb-opts6] PASSED [  9%]
	nbclient/tests/test_client.py::test_run_all_notebooks[JupyterWidgets.ipynb-opts7] FAILED
	[ 10%]
	nbclient/tests/test_client.py::test_run_all_notebooks[Skip Exceptions with Cell
	Tags.ipynb-opts8] PASSED [ 12%]
	--
	nbclient/tests/test_client.py::TestExecute::test_cleanup_kernel_client
	hasher-privd: parent: handle_io: idle time limit (3600 seconds) exceeded

python3-module-simple_timer-0.2-alt2
	...F
	FAIL: test_04_stoped_timer_timedelta (__main__.SimpleTimerTest)
	Traceback (most recent call last):
	--
	Ran 4 tests in 0.000s
	FAILED (failures=1)
	test_01_ongoing_timer_duration

tclx-1:8.4.4-alt1
	(but everything is probably ok)
	==== nice-1.5 nice tests FAILED
	==== Contents of test case:
	--
	23 23
	==== nice-1.5 FAILED
	pipe.test
	--
	profile.test
	==== profile-10.1 profile CPU time tests FAILED
	==== Contents of test case:
	--
	---- errorCode: NONE
	==== profile-10.1 FAILED
	==== profile-10.2 profile CPU time tests FAILED
	==== Contents of test case:
	--
	---- errorCode: NONE
	==== profile-10.2 FAILED
	==== profile-12.1 profile namespace tests FAILED
	==== Contents of test case:
	--
	---- errorCode: NONE
	==== profile-12.1 FAILED
	==== profile-12.2 profile namespace tests FAILED
	==== Contents of test case:
	--
	---- errorCode: NONE
	==== profile-12.2 FAILED
	==== profile-12.3 profile namespace tests FAILED

tuned-2.22.1-alt1
	0inputs+0outputs (0major+36318minor)pagefaults 0swaps
	Error: no exit code is found, failure.

	19 error logs REMOVED from the list
SPICE-0.15.0-alt1
e2fsprogs-1.47.1.0.10.ad56-alt1.p10.1
fsverity-utils-1.4-alt1
gettext-0.21-alt1
gnome-builder-3.40.2-alt1.1
ipmiutil-3.1.3-alt2
kernel-image-std-def-2:5.10.268-alt1
kernel-modules-dm-secdel-std-def-2:1.0.9-alt1.330508.1
kernel-modules-ipt-so-std-def-1.0-alt9.330508.1
libdb5.3-5.3.28-alt4
libredland-1.0.17-alt3
ncmpc-0.45-alt1
partclone-0.3.17-alt1
perl-Server-Starter-0.35-alt1.1
pocl-6.0-alt0.1.p10.2
python3-module-pyside6-6.4.2-alt2.p10.1
trace-cmd-3.1.6-alt2
tripso-1.2-alt1
wsil4j-1.0-alt2_21jpp8

Total 96 error logs.


                 reply	other threads:[~2026-10-18 21:22 UTC|newest]

Thread overview: [no followups] expand[flat|nested]  mbox.gz  Atom feed

Reply instructions:

You may reply publicly to this message via plain-text email
using any one of the following methods:

* Save the following mbox file, import it into your mail client,
  and reply-to-all from there: mbox

  Avoid top-posting and favor interleaved quoting:
  https://en.wikipedia.org/wiki/Posting_style#Interleaved_style

* Reply using the --to, --cc, and --in-reply-to
  switches of git-send-email(1):

  git send-email \
    --in-reply-to=atU4fO2Rlf1r806C@beehive.mskdc.altlinux.org \
    --to=hiver@altlinux.org \
    --cc=devel@lists.altlinux.org \
    --cc=sisyphus-cybertalk@lists.altlinux.org \
    /path/to/YOUR_REPLY

  https://kernel.org/pub/software/scm/git/docs/git-send-email.html

* If your mail client supports setting the In-Reply-To header
  via mailto: links, try the mailto: link

ALT Linux Sisyphus cybertalk

This inbox may be cloned and mirrored by anyone:

	git clone --mirror http://lore.altlinux.org/sisyphus-cybertalk/0 sisyphus-cybertalk/git/0.git

	# If you have public-inbox 1.1+ installed, you may
	# initialize and index your mirror using the following commands:
	public-inbox-init -V2 sisyphus-cybertalk sisyphus-cybertalk/ http://lore.altlinux.org/sisyphus-cybertalk \
		sisyphus-cybertalk@lists.altlinux.org sisyphus-cybertalk@lists.altlinux.ru sisyphus-cybertalk@lists.altlinux.com
	public-inbox-index sisyphus-cybertalk

Example config snippet for mirrors.
Newsgroup available over NNTP:
	nntp://lore.altlinux.org/org.altlinux.lists.sisyphus-cybertalk


AGPL code for this site: git clone https://public-inbox.org/public-inbox.git