From: ALT beekeeper <hiver@altlinux.org>
To: sisyphus-cybertalk@lists.altlinux.org
Subject: [cyber] I: Sisyphus-20261010 i586 beehive_status: +41 -80 (266)
Date: Sat, 10 Oct 2026 12:30:59 +0000
Message-ID: <asowA0kdFA++eH53@beehive.mskdc.altlinux.org> (raw)
[-- Warning: decoded text below may be mangled, UTF-8 assumed --]
[-- Attachment #1: Type: text/plain; charset=unknown-8bit, Size: 42459 bytes --]
41 NEW error logs
0ad-1:0.28.0-alt3
LDFLAGS : unset
Error: /usr/src/RPM/BUILD/0ad-0.28.0/build/premake/premake5.lua:577: attempt to call
a nil value (global 'flags')
ERROR: Premake failed
error: Bad exit status from /usr/src/tmp/rpmb-tmp.BzCqfr (%build)
apt-repo-tools-0.11-alt1
Full log written to
/usr/src/RPM/BUILD/apt-repo-tools-0.11/i586-alt-linux/meson-logs/testlog.txt
FAILED: [code=1] meson-internal__test
/usr/bin/meson test --no-rebuild --print-errorlogs
borg-1.4.5-alt1
build/lib.linux-i686-cpython-314/borg/testsuite/archive.py::test_get_item_uid_gid PASSED
[ 2%]
build/lib.linux-i686-cpython-314/borg/testsuite/archiver.py::test_return_codes[python]
FAILED [ 2%]
=================================== FAILURES ===================================
--
=========================== short test summary info ============================
FAILED
build/lib.linux-i686-cpython-314/borg/testsuite/archiver.py::test_return_codes[python]
!!!!!!!!!!!!!!!!!!!!!!!!!! stopping after 1 failures !!!!!!!!!!!!!!!!!!!!!!!!!!!
cozystack-linstor-csi-1.11.2-alt1
packagefile k8s.io/client-go/tools/cache=/usr/src/tmp/go-build3639033744/b699/_pkg_.a
packagefile sync=/usr/src/tmp/go-build3639033744/b038/_pkg_.a
packagefile time=/usr/src/tmp/go-build3639033744/b047/_pkg_.a
EOF
/usr/lib/golang/pkg/tool/linux_386/compile -o $WORK/b712/_pkg_.a -trimpath
"$WORK/b712=>" -p k8s.io/client-go/dynamic/dynamicinformer -lang=go1.26
-complete -buildid LDzQCNAHhrgMifwIdT5I/LDzQCNAHhrgMifwIdT5I -goversion
go1.27.2-X:nodwarf5 -c=32 -nolocalimports -importcfg $WORK/b712/importcfg -pack
/usr/src/RPM/BUILD/cozystack-linstor-csi-1.11.2/vendor/k8s.io/client-go/dynamic/dynamicinformer/informer.go
/usr/src/RPM/BUILD/cozystack-linstor-csi-1.11.2/vendor/k8s.io/client-go/dynamic/dynamicinformer/interface.go
go tool buildid -w $WORK/b712/_pkg_.a # internal
cp $WORK/b712/_pkg_.a
/usr/src/.cache/go-build/d4/d47ffed5b765bb67609c6950c4ba0acb3fae57dcc1a2d0c239787d9fa4da9dcd-d
# internal
error: Bad exit status from /usr/src/tmp/rpmb-tmp.2XX0ZS (%build)
RPM build errors:
Bad exit status from /usr/src/tmp/rpmb-tmp.2XX0ZS (%build)
ctre-3.11.0-alt3
Problem opening /proc/meminfo
-- Configuring done (0.3s)
CMake Error in tests/CMakeLists.txt:
The "CXX_MODULE_STD" property on target "ctre-test-__utf8" requires
toolchain support, but it was not provided. Reason:
Unsupported generator: Unix Makefiles
CMake Generate step failed. Build files cannot be regenerated correctly.
error: Bad exit status from /usr/src/tmp/rpmb-tmp.zOKnBm (%build)
RPM build errors:
Bad exit status from /usr/src/tmp/rpmb-tmp.zOKnBm (%build)
eartag-1.0.3-alt1
stderr:
Fatal Python error: Segmentation fault
Thread 0xf3397b40 [asyncio_0] (most recent call first):
flamerobin-0.9.9-alt1
from /usr/src/RPM/BUILD/flamerobin-0.9.9/src/gui/AdvancedSearchFrame.cpp:45:
/usr/src/RPM/BUILD/flamerobin-0.9.9/src/metadata/collection.h:102:27: warning: template-id
not allowed for constructor in C++20 [-Wtemplate-id-cdtor]
102 | MetadataCollection<T>(NodeType type, DatabasePtr database,
/usr/src/RPM/BUILD/flamerobin-0.9.9/src/metadata/collection.h:102:27: note: remove the
'< >'
gmake[2]: Leaving directory '/usr/src/RPM/BUILD/flamerobin-0.9.9/i586-alt-linux'
gmake[1]: *** [CMakeFiles/Makefile2:122: CMakeFiles/flamerobin.dir/all] Error 2
gmake: *** [Makefile:136: all] Error 2
error: Bad exit status from /usr/src/tmp/rpmb-tmp.UNAHAK (%build)
RPM build errors:
Bad exit status from /usr/src/tmp/rpmb-tmp.UNAHAK (%build)
gatus-5.36.0-alt2
packagefile sync=/usr/src/tmp/go-build2884446606/b044/_pkg_.a
packagefile sync/atomic=/usr/src/tmp/go-build2884446606/b046/_pkg_.a
packagefile time=/usr/src/tmp/go-build2884446606/b056/_pkg_.a
EOF
/usr/lib/golang/pkg/tool/linux_386/compile -o $WORK/b723/_pkg_.a -trimpath
"$WORK/b723=>" -p modernc.org/sqlite -lang=go1.25 -complete -buildid
MlIfWqHbfYjeCg1rMqH1/MlIfWqHbfYjeCg1rMqH1 -goversion go1.27.2-X:nodwarf5 -c=32
-nolocalimports -importcfg $WORK/b723/importcfg -pack ./vendor/modernc.org/sqlite/backup.go
./vendor/modernc.org/sqlite/conn.go ./vendor/modernc.org/sqlite/convert.go
./vendor/modernc.org/sqlite/doc.go ./vendor/modernc.org/sqlite/driver.go
./vendor/modernc.org/sqlite/error.go ./vendor/modernc.org/sqlite/fcntl.go
./vendor/modernc.org/sqlite/mutex.go ./vendor/modernc.org/sqlite/nodmesg.go
./vendor/modernc.org/sqlite/pre_update_hook.go ./vendor/modernc.org/sqlite/result.go
./vendor/modernc.org/sqlite/rows.go ./vendor/modernc.org/sqlite/rulimit.go
./vendor/modernc.org/sqlite/sqlite.go ./vendor/modernc.org/sqlite/stmt.go
./vendor/modernc.org/sqlite/tx.go ./vendor/modernc.org/sqlite/vtab.go
go tool buildid -w $WORK/b723/_pkg_.a # internal
cp $WORK/b723/_pkg_.a
/usr/src/.cache/go-build/67/670e40e338dda97d4769e44afd2106ef63542148c0590fb05ea370aad463b4aa-d
# internal
error: Bad exit status from /usr/src/tmp/rpmb-tmp.eWz4kY (%build)
RPM build errors:
Bad exit status from /usr/src/tmp/rpmb-tmp.eWz4kY (%build)
gnome-commander-2.0.3-alt1
+ xvfb-run /usr/bin/meson test --no-rebuild --print-errorlogs -C i586-alt-linux
_XSERVTransmkdir: ERROR: euid != 0,directory /tmp/.X11-unix will not be created.
1/3 gnome-commander:validate-desktopfile OK 0.01s
go-tpc-1.0.12-alt1
make: Entering directory '/usr/src/RPM/BUILD/go-tpc-1.0.12'
make: git: No such file or directory
GOEXPERIMENT=jsonv2 CGO_ENABLED=0 GOARCH=amd64 GO111MODULE=on go build -ldflags '-X
"main.version=" -X "main.commit=" -X "main.date=2026-10-10 08:58:46"' -o ./bin/go-tpc
cmd/go-tpc/*
grpcurl-1.9.4-alt1
+ go test -compiler gc
--- FAIL: TestHandler (0.00s)
panic: jsontext: invalid nil io.Reader [recovered, repanicked]
hiddify-core-4.1.0-alt1
+ CGO_ENABLED=1
+ export 'CODE_VERSION=-X
github.com/hiddify/hiddify-core/v2/hcommon/constants.Version=v4.1.0 -X
github.com/sagernet/sing-box/constant.Version=1.13.1'
+ CODE_VERSION='-X github.com/hiddify/hiddify-core/v2/hcommon/constants.Version=v4.1.0
-X github.com/sagernet/sing-box/constant.Version=1.13.1'
+ go build -mod=vendor
-tags=with_v2ray_api,with_gvisor,with_quic,with_dhcp,with_wireguard,with_utls,with_acme,with_clash_api,with_tailscale,with_ccm,with_ocm,tfogo_checklinkname0
-buildmode=c-shared '-ldflags=-X
github.com/hiddify/hiddify-core/v2/hcommon/constants.Version=v4.1.0
-X github.com/sagernet/sing-box/constant.Version=1.13.1 -extldflags
-Wl,-soname,libhiddify-core.so.0' -o=libhiddify-core.so.0 ./platform/desktop
# github.com/go-json-experiment/json
vendor/github.com/go-json-experiment/json/alias.go:618:21: undefined: json.SkipFunc
vendor/github.com/go-json-experiment/json/alias.go:957:14: undefined:
json.DiscardUnknownMembers
error: Bad exit status from /usr/src/tmp/rpmb-tmp.Fqu4q6 (%build)
RPM build errors:
Bad exit status from /usr/src/tmp/rpmb-tmp.Fqu4q6 (%build)
knopflerfish-6.1.5-alt1
filesystem is already the newest version.
E: Couldn't find package objectweb-asm3
hsh-install: Failed to calculate package file list.
libwebkitgtk4-2.50.6-alt1
-- Found LCMS2: /usr/lib/liblcms2.so (found version "2.19")
-- Found LibBacktrace: /usr/include
-- Found Libseccomp: /usr/lib/libseccomp.so (found version "2.6.1")
--
-- Checking for module 'gstreamer-full-1.0>=1.17.0'
-- No package 'gstreamer-full-1.0' found
-- Checking for module 'gstreamer-allocators-1.0 >= 1.18.4'
linstor-affinity-controller-1.4.1-alt1
packagefile os=/usr/src/tmp/go-build504218188/b070/_pkg_.a
packagefile strings=/usr/src/tmp/go-build504218188/b059/_pkg_.a
packagefile time=/usr/src/tmp/go-build504218188/b041/_pkg_.a
EOF
/usr/lib/golang/pkg/tool/linux_386/compile -o $WORK/b863/_pkg_.a -trimpath
"/usr/src/RPM/BUILD/linstor-affinity-controller-1.4.1/.build/src/github.com/piraeusdatastore/linstor-affinity-controller/pkg/leaderelection=>github.com/piraeusdatastore/linstor-affinity-controller/pkg/leaderelection;$WORK/b863=>"
-p github.com/piraeusdatastore/linstor-affinity-controller/pkg/leaderelection
-lang=go1.26 -complete -buildid wsJTf06l5iEmAcMNB940/wsJTf06l5iEmAcMNB940 -goversion
go1.27.2-X:nodwarf5 -c=16 -nolocalimports -importcfg $WORK/b863/importcfg -pack
/usr/src/RPM/BUILD/linstor-affinity-controller-1.4.1/.build/src/github.com/piraeusdatastore/linstor-affinity-controller/pkg/leaderelection/leaderelection.go
go tool buildid -w $WORK/b863/_pkg_.a # internal
cp $WORK/b863/_pkg_.a
/usr/src/.cache/go-build/74/74c4beca93d669375cd5cc3950d583885763bdf322b381ffeb99d8e386ed7e55-d
# internal
error: Bad exit status from /usr/src/tmp/rpmb-tmp.lBoxB1 (%build)
RPM build errors:
Bad exit status from /usr/src/tmp/rpmb-tmp.lBoxB1 (%build)
lomiri-app-launch-0.2.0-alt1
from
/usr/src/RPM/BUILD/lomiri-app-launch-0.2.0/i586-alt-linux/liblomiri-app-launch/lomiri-app-launch-trace.c:7:
/usr/include/urcu/compiler.h:62:4: error: #error "URCU was configured to use atomic
builtins, but this toolchain does not support them."
62 | # error "URCU was configured to use atomic builtins, but this toolchain does not
support them."
--
/usr/include/urcu/rculist.h: In function 'cds_list_del_rcu':
/usr/include/urcu/rculist.h:60:9: error: implicit declaration of function
'_cmm_static_assert__atomic_lf' [-Wimplicit-function-declaration]
60 | uatomic_store(&elem->prev->next, elem->next);
/usr/include/urcu/ref.h: In function 'urcu_ref_get_safe':
/usr/include/urcu/ref.h:40:15: error: implicit declaration
of function 'cmm_seq_cst_fence_after_atomic'; did you mean
'cmm_seq_cst_fence_after_atomic_rmw'? [-Wimplicit-function-declaration]
40 | old = uatomic_load(&ref->refcount);
--
from /usr/src/RPM/BUILD/lomiri-app-launch-0.2.0/liblomiri-app-launch/second-exec-core.c:24:
/usr/include/urcu/compiler.h:62:4: error: #error "URCU was configured to use atomic
builtins, but this toolchain does not support them."
62 | # error "URCU was configured to use atomic builtins, but this toolchain does not
support them."
--
from /usr/src/RPM/BUILD/lomiri-app-launch-0.2.0/liblomiri-app-launch/second-exec-core.c:24:
/usr/include/urcu/compiler.h:62:4: error: #error "URCU was configured to use atomic
builtins, but this toolchain does not support them."
62 | # error "URCU was configured to use atomic builtins, but this toolchain does not
support them."
lomiri-thumbnailer-3.1.3-alt1
-- Detecting CXX compile features - done
CMake Error at CMakeLists.txt:100 (if):
if given arguments:
"(" "STREQUAL" "xenial" "OR" "STREQUAL" "yakkety" "OR" "STREQUAL" "zesty" ")" "AND"
"(" "i686" "STREQUAL" "aarch64" "OR" "i686" "STREQUAL" "ppc" "OR" "i686" "STREQUAL"
"ppc64le" ")"
Unknown arguments specified
-- Configuring incomplete, errors occurred!
error: Bad exit status from /usr/src/tmp/rpmb-tmp.DLNgHT (%build)
RPM build errors:
File /usr/src/RPM/SOURCES/lomiri-thumbnailer-3.1.3-alt1.patch is smaller than 8 bytes
Bad exit status from /usr/src/tmp/rpmb-tmp.DLNgHT (%build)
opentofu-1.12.3-alt1
packagefile k8s.io/client-go/rest=/usr/src/tmp/go-build3389468964/b1438/_pkg_.a
packagefile k8s.io/client-go/util/flowcontrol=/usr/src/tmp/go-build3389468964/b1460/_pkg_.a
packagefile net/http=/usr/src/tmp/go-build3389468964/b245/_pkg_.a
EOF
/usr/lib/golang/pkg/tool/linux_386/compile -o $WORK/b1462/_pkg_.a
-trimpath "$WORK/b1462=>" -p k8s.io/client-go/kubernetes -lang=go1.25
-complete -buildid GKnG4ck_a981gdFPfSa9/GKnG4ck_a981gdFPfSa9 -goversion
go1.27.2-X:nodwarf5 -c=32 -nolocalimports -importcfg $WORK/b1462/importcfg -pack
/usr/src/RPM/BUILD/opentofu-1.12.3/vendor/k8s.io/client-go/kubernetes/clientset.go
/usr/src/RPM/BUILD/opentofu-1.12.3/vendor/k8s.io/client-go/kubernetes/doc.go
/usr/src/RPM/BUILD/opentofu-1.12.3/vendor/k8s.io/client-go/kubernetes/import.go
go tool buildid -w $WORK/b1462/_pkg_.a # internal
cp $WORK/b1462/_pkg_.a
/usr/src/.cache/go-build/9e/9eeb3b481b4dea4ee8ee10f578bd72adc8439f7b8b8061f9c72aefc8adb52289-d
# internal
error: Bad exit status from /usr/src/tmp/rpmb-tmp.TU9E9U (%build)
RPM build errors:
Bad exit status from /usr/src/tmp/rpmb-tmp.TU9E9U (%build)
podman-tui-1.11.3-alt1
^[[38;5;243m------------------------------^[[0m
^[[38;5;9m• [FAILED] [0.002 seconds]^[[0m
^[[0mvolume import ^[[38;5;9m^[[1m[It] import button selected^[[0m
^[[38;5;243m/usr/src/RPM/BUILD/podman-tui-1.11.3/ui/volumes/voldialogs/import_test.go:70^[[0m
^[[38;5;9m[FAILED] Expected
<string>: import init
--
^[[38;5;9m^[[1mFAIL!^[[0m -- ^[[38;5;10m^[[1m17 Passed^[[0m | ^[[38;5;9m^[[1m1 Failed^[[0m |
^[[38;5;11m^[[1m0 Pending^[[0m | ^[[38;5;14m^[[1m2 Skipped^[[0m
--- FAIL: TestVoldialogs (0.07s)
FAIL
python3-module-cheroot-11.1.2-alt2
ERROR cheroot/test/test_server.py::test_threadpool_threadrange_set[1--1-inf]
ERROR cheroot/test/test_server.py::test_high_number_of_file_descriptors[2048]
ERROR cheroot/test/test_server.py::test_threadpool_invalid_threadrange[-1-0-min=-1 must
be > 0]
ERROR cheroot/test/test_server.py::test_peercreds_unix_sock_with_lookup[file]
ERROR cheroot/test/test_server.py::test_threadpool_invalid_threadrange[-1-1-min=-1 must
be > 0]
ERROR cheroot/test/test_server.py::test_threadpool_invalid_threadrange[0-1-min=0 must
be > 0]
ERROR cheroot/test/test_server.py::test_threadpool_threadrange_set[1-1-1] - c...
ERROR cheroot/test/test_server.py::test_threadpool_invalid_threadrange[-1-2-min=-1 must
be > 0]
ERROR cheroot/test/test_server.py::test_server_interrupt[KeyboardInterrupt]
ERROR cheroot/test/test_server.py::test_high_number_of_file_descriptors[1024]
ERROR cheroot/test/test_server.py::test_threadpool_threadrange_set[2--2-inf]
python3-module-cherrypy-18.10.0-alt3
ERROR cherrypy/test/test_httputil.py::test_urljoin[/sn/--/sn/] - coverage.exc...
ERROR cherrypy/test/test_httputil.py::test_urljoin[/sn-/pi/-/sn/pi/] - covera...
ERROR cherrypy/test/test_httputil.py::test_urljoin[/sn-/pi-/sn/pi] - coverage...
ERROR cherrypy/test/test_httputil.py::test_urljoin[/sn-/-/sn/] - coverage.exc...
ERROR cherrypy/test/test_httputil.py::test_urljoin[/sn--/sn] - coverage.excep...
ERROR cherrypy/test/test_httputil.py::test_urljoin[/-/pi/-/pi/] - coverage.ex...
ERROR cherrypy/test/test_httputil.py::test_urljoin[/-/pi-/pi] - coverage.exce...
ERROR cherrypy/test/test_httputil.py::test_urljoin[/-/-/] - coverage.exceptio...
ERROR cherrypy/test/test_httputil.py::test_urljoin[/--/] - coverage.exception...
ERROR cherrypy/test/test_httputil.py::test_urljoin[-/pi/-/pi/] - coverage.exc...
ERROR cherrypy/test/test_httputil.py::test_urljoin[-/pi-/pi] - coverage.excep...
python3-module-chess-1.11.2-alt1
return await command.result
chess.engine.EngineTerminatedError: engine process died unexpectedly (exit code: -11)
ERROR: test_sf_multipv (__main__.EngineTestCase.test_sf_multipv)
Traceback (most recent call last):
--
return await command.result
chess.engine.EngineTerminatedError: engine process died unexpectedly (exit code: -11)
ERROR: test_sf_options (__main__.EngineTestCase.test_sf_options)
Traceback (most recent call last):
--
return await command.result
chess.engine.EngineTerminatedError: engine process died unexpectedly (exit code: -11)
ERROR: test_sf_quit (__main__.EngineTestCase.test_sf_quit)
Traceback (most recent call last):
--
return await command.result
chess.engine.EngineTerminatedError: engine process died unexpectedly (exit code: -11)
Ran 288 tests in 1.190s
FAILED (errors=4, skipped=17)
py3: exit 1 (1.40 seconds) /usr/src/RPM/BUILD/python3-module-chess-1.11.2> python
test.py --verbose pid=38388
python3-module-ezdxf-1.4.3-alt1
XFAIL
tests/test_06_math/test_664_concave_clipping_polygon.py::TestPolygonClipping::test_polygon_outside_no_intersection
- edge case not covered
FAILED
tests/test_03_dxf_layouts/test_309_query_parser.py::TestEntityQueryParserWithAttributes::test_one_attribute
FAILED
tests/test_03_dxf_layouts/test_309_query_parser.py::TestEntityQueryParserWithAttributes::test_double_quoted_attributes
FAILED
tests/test_03_dxf_layouts/test_309_query_parser.py::TestEntityQueryParserWithAttributes::test_single_quoted_attributes
FAILED
tests/test_03_dxf_layouts/test_309_query_parser.py::TestEntityQueryParserWithAttributes::test_attribute_name_with_underscore
FAILED
tests/test_03_dxf_layouts/test_309_query_parser.py::TestEntityQueryParserWithAttributes::test_star_with_one_attribute
FAILED
tests/test_03_dxf_layouts/test_309_query_parser.py::TestEntityQueryParserWithAttributes::test_relation_lt
FAILED
tests/test_03_dxf_layouts/test_309_query_parser.py::TestEntityQueryParserWithAttributes::test_relation_le
FAILED
tests/test_03_dxf_layouts/test_309_query_parser.py::TestEntityQueryParserWithAttributes::test_relation_eq
FAILED
tests/test_03_dxf_layouts/test_309_query_parser.py::TestEntityQueryParserWithAttributes::test_relation_ne
FAILED
tests/test_03_dxf_layouts/test_309_query_parser.py::TestEntityQueryParserWithAttributes::test_relation_ge
FAILED
tests/test_03_dxf_layouts/test_309_query_parser.py::TestEntityQueryParserWithAttributes::test_relation_gt
python3-module-hypercorn-0.18.0-alt1
tests/trio/test_sanity.py::test_http2_request PASSED [ 99%]
tests/trio/test_sanity.py::test_http2_websocket FAILED [100%]
=================================== FAILURES ===================================
--
> raise ProtocolError(msg)
E h2.exceptions.ProtocolError: Ordinary CONNECT MUST NOT include
:scheme or :path
/usr/lib/python3/site-packages/h2/utilities.py:403: ProtocolError
--
| raise ProtocolError(msg)
| h2.exceptions.ProtocolError: Ordinary CONNECT MUST NOT include :scheme or :path
=========================== short test summary info ============================
FAILED tests/asyncio/test_sanity.py::test_http2_websocket - h2.exceptions.Pro...
FAILED tests/trio/test_sanity.py::test_http2_websocket - ProtocolError('Ordin...
======================== 2 failed, 194 passed in 6.17s =========================
INFO : Command's result: FAILURE
INFO : Command's error: Command '['python3', '-m', 'pytest', '-vra',
'-o=addopts=-Wignore']' returned non-zero exit status 1.
error: Bad exit status from /usr/src/tmp/rpmb-tmp.WSNduF (%check)
python3-module-inline-snapshot-0.35.4-alt1
black.files.find_project_root = black.files.find_project_root.__wrapped__ # type: ignore
E AttributeError: 'function' object has no attribute '__wrapped__'
INFO : Command's result: FAILURE
INFO : Command's error: Command '['python3', '-m', 'pytest', '-k', 'not pyright
and not test_compare']' returned non-zero exit status 4.
error: Bad exit status from /usr/src/tmp/rpmb-tmp.tCKWjq (%check)
python3-module-mdp-3.6.0.15.g64f14eee-alt7
> assert abs(train_bm.bv - bm.bv).max() < 0.5
E AssertionError: assert np.float64(0.624134569443858) < 0.5
E + where np.float64(0.624134569443858) = <built-in method max of numpy.ndarray
object at 0xda357b30>()
--
=========================== short test summary info ============================
FAILED mdp/test/test_RBM.py::test_RBM_bv_learning - AssertionError: assert np...
======= 1 failed, 730 passed, 26 skipped, 3 warnings in 82.60s (0:01:22) =======
python3-module-multidict-6.7.1-alt1
ERROR
tests/test_multidict.py::TestCIMultiDict::test_items_case_insensitive_parse_item[c-cls1-not-tuple]
ERROR
tests/test_multidict.py::TestCIMultiDict::test_items_case_insensitive_parse_item[c-cls1-not-2-elems]
ERROR
tests/test_multidict.py::TestCIMultiDict::test_items_case_insensitive_parse_item[c-cls1-not-str]
ERROR tests/test_multidict.py::TestCIMultiDict::test_items_case_insensitive_and[c-cls0-ok]
ERROR
tests/test_multidict.py::TestCIMultiDict::test_items_case_insensitive_and[c-cls0-non-str]
ERROR
tests/test_multidict.py::TestCIMultiDict::test_items_case_insensitive_and[c-cls0-nonequal-value]
ERROR tests/test_multidict.py::TestCIMultiDict::test_items_case_insensitive_and[c-cls1-ok]
ERROR
tests/test_multidict.py::TestCIMultiDict::test_items_case_insensitive_and[c-cls1-non-str]
ERROR
tests/test_multidict.py::TestCIMultiDict::test_items_case_insensitive_and[c-cls1-nonequal-value]
ERROR tests/test_multidict.py::TestCIMultiDict::test_items_case_insensitive_rand[c-cls0-ok]
ERROR
tests/test_multidict.py::TestCIMultiDict::test_items_case_insensitive_rand[c-cls0-non-str]
python3-module-nox-2026.2.9-alt1
XPASS tests/test_logger.py::test_no_color_timestamp[color]
FAILED tests/test_tox_to_nox.py::test_trivial - assert "import nox\n...nstall...
FAILED tests/test_tox_to_nox.py::test_skipinstall - assert "import nox\n....t...
FAILED tests/test_tox_to_nox.py::test_usedevelop - assert "import nox\n...('-...
FAILED tests/test_tox_to_nox.py::test_commands - assert "import nox\n...', 't...
FAILED tests/test_tox_to_nox.py::test_deps - assert "import nox\n...nstall('....
FAILED tests/test_tox_to_nox.py::test_env - assert "import nox\n...nstall('.'...
FAILED tests/test_tox_to_nox.py::test_chdir - assert "import nox\n...dir('doc...
FAILED tests/test_tox_to_nox.py::test_dash_in_envname - assert "import nox\n....
FAILED tests/test_tox_to_nox.py::test_descriptions_into_docstrings - assert "...
FAILED tests/test_tox_to_nox.py::test_commands_with_requirements - assert "im...
==== 10 failed, 613 passed, 36 skipped, 30 deselected, 1 xpassed in 26.80s =====
python3-module-twine-7.0.0-alt1
> assert check.check([sdist])
E AssertionError: assert False
E + where False = <function check at
0xf543e0d8>(['/usr/src/tmp/pytest-of-builder/pytest-0/test_fails_rst_no_content0/test-1.2.3.tar.gz'])
--
=========================== short test summary info ============================
FAILED tests/test_check.py::test_fails_rst_no_content - AssertionError: asser...
======================== 1 failed, 231 passed in 0.53s =========================
INFO : Command's result: FAILURE
INFO : Command's error: Command '['python3', '-m', 'pytest', '-ra']' returned
non-zero exit status 1.
error: Bad exit status from /usr/src/tmp/rpmb-tmp.nBoNvh (%check)
python3-module-uvloop-0.23.0-alt1
test_create_unix_server_ssl_1 (test_unix.Test_UV_UnixSSL.test_create_unix_server_ssl_1)
... ok
FAIL: test_process_preexec_fn_1 (test_process.Test_UV_Process.test_process_preexec_fn_1)
Traceback (most recent call last):
--
self.assertEqual(out, b'apple')
AssertionError: b'' != b'apple'
FAIL: test_process_preexec_fn_2 (test_process.Test_UV_Process.test_process_preexec_fn_2)
Traceback (most recent call last):
--
'exception in preexec_fn did not propagate to the parent')
AssertionError: exception in preexec_fn did not propagate to the parent
Ran 527 tests in 105.186s
FAILED (failures=2, skipped=37)
INFO : Command's result: FAILURE
INFO : Command's error: Command '['python3', '-m', 'unittest', 'discover', '-v',
'tests']' returned non-zero exit status 1.
error: Bad exit status from /usr/src/tmp/rpmb-tmp.On3Zxy (%check)
python3-module-zict-3.0.0-alt1
File "/usr/src/RPM/BUILD/python3-module-zict-3.0.0/zict/tests/utils_test.py", line 193,
in check_different_keys_threadsafe
f1.result()
File "/usr/lib/python3.14/concurrent/futures/_base.py", line 449, in result
self._condition.wait(timeout)
File "/usr/lib/python3.14/threading.py", line 370, in wait
waiter.acquire()
+++++++++++++++++++++++++++++++++++ Timeout ++++++++++++++++++++++++++++++++++++
error: Bad exit status from /usr/src/tmp/rpmb-tmp.SlEzot (%check)
RPM build errors:
Bad exit status from /usr/src/tmp/rpmb-tmp.SlEzot (%check)
qt5-pim-5.15-alt1
make[3]: Leaving directory '/usr/src/RPM/BUILD/qt5-pim-5.15/build/tests/auto/contacts'
make[2]: *** [Makefile:581: sub-contacts-check] Error 2
make[2]: Leaving directory '/usr/src/RPM/BUILD/qt5-pim-5.15/build/tests/auto'
make[1]: *** [Makefile:369: sub-auto-check] Error 2
make[1]: Leaving directory '/usr/src/RPM/BUILD/qt5-pim-5.15/build/tests'
make: *** [Makefile:438: sub-tests-check] Error 2
make: Leaving directory '/usr/src/RPM/BUILD/qt5-pim-5.15/build'
error: Bad exit status from /usr/src/tmp/rpmb-tmp.9rDHp8 (%check)
RPM build errors:
Bad exit status from /usr/src/tmp/rpmb-tmp.9rDHp8 (%check)
qtmir-0.8.0_git20260226.fb30a11-alt1
from
/usr/src/RPM/BUILD/qtmir-0.8.0_git20260226.fb30a11/i586-alt-linux/src/platforms/mirserver/tracepoints.c:7:
/usr/include/urcu/compiler.h:62:4: error: #error "URCU was configured to use atomic
builtins, but this toolchain does not support them."
62 | # error "URCU was configured to use atomic builtins, but this toolchain does not
support them."
--
/usr/include/urcu/rculist.h: In function 'cds_list_del_rcu':
/usr/include/urcu/rculist.h:60:9: error: implicit declaration of function
'_cmm_static_assert__atomic_lf' [-Wimplicit-function-declaration]
60 | uatomic_store(&elem->prev->next, elem->next);
/usr/include/urcu/ref.h: In function 'urcu_ref_get_safe':
/usr/include/urcu/ref.h:40:15: error: implicit declaration
of function 'cmm_seq_cst_fence_after_atomic'; did you mean
'cmm_seq_cst_fence_after_atomic_rmw'? [-Wimplicit-function-declaration]
40 | old = uatomic_load(&ref->refcount);
sing-box-1.13.3-alt1
packagefile strings=/usr/src/tmp/go-build4254773481/b061/_pkg_.a
packagefile sync=/usr/src/tmp/go-build4254773481/b037/_pkg_.a
packagefile time=/usr/src/tmp/go-build4254773481/b045/_pkg_.a
EOF
/usr/lib/golang/pkg/tool/linux_386/compile -o $WORK/b916/_pkg_.a -trimpath
"$WORK/b916=>" -p github.com/sagernet/sing-box/service/ocm -lang=go1.24
-complete -buildid oevY497EKIoC5nO2xLam/oevY497EKIoC5nO2xLam -goversion
go1.27.2-X:nodwarf5 -c=32 -nolocalimports -importcfg $WORK/b916/importcfg
-pack /usr/src/RPM/BUILD/sing-box-1.13.3/service/ocm/credential.go
/usr/src/RPM/BUILD/sing-box-1.13.3/service/ocm/credential_other.go
/usr/src/RPM/BUILD/sing-box-1.13.3/service/ocm/service.go
/usr/src/RPM/BUILD/sing-box-1.13.3/service/ocm/service_usage.go
/usr/src/RPM/BUILD/sing-box-1.13.3/service/ocm/service_user.go
/usr/src/RPM/BUILD/sing-box-1.13.3/service/ocm/service_websocket.go
go tool buildid -w $WORK/b916/_pkg_.a # internal
cp $WORK/b916/_pkg_.a
/usr/src/.cache/go-build/ca/ca51c70444b462cb74008540ef055fb0956361226005b8808744da24d963a3ff-d
# internal
error: Bad exit status from /usr/src/tmp/rpmb-tmp.WgKycC (%build)
RPM build errors:
Bad exit status from /usr/src/tmp/rpmb-tmp.WgKycC (%build)
sops-3.13.1-alt1
packagefile strconv=/usr/src/tmp/go-build1041217986/b055/_pkg_.a
packagefile strings=/usr/src/tmp/go-build1041217986/b045/_pkg_.a
packagefile sync=/usr/src/tmp/go-build1041217986/b038/_pkg_.a
EOF
/usr/lib/golang/pkg/tool/linux_386/compile -o $WORK/b990/_pkg_.a -trimpath
"$WORK/b990=>" -p github.com/aws/aws-sdk-go-v2/feature/s3/manager
-lang=go1.24 -complete -buildid 3mfv0S0kzK1hAi1hbRbT/3mfv0S0kzK1hAi1hbRbT
-goversion go1.27.2-X:nodwarf5 -c=16 -nolocalimports -importcfg $WORK/b990/importcfg -pack
/usr/src/RPM/BUILD/sops-3.13.1/.build/src/github.com/getsops/sops/v3/vendor/github.com/aws/aws-sdk-go-v2/feature/s3/manager/api.go
/usr/src/RPM/BUILD/sops-3.13.1/.build/src/github.com/getsops/sops/v3/vendor/github.com/aws/aws-sdk-go-v2/feature/s3/manager/arn.go
/usr/src/RPM/BUILD/sops-3.13.1/.build/src/github.com/getsops/sops/v3/vendor/github.com/aws/aws-sdk-go-v2/feature/s3/manager/bucket_region.go
/usr/src/RPM/BUILD/sops-3.13.1/.build/src/github.com/getsops/sops/v3/vendor/github.com/aws/aws-sdk-go-v2/feature/s3/manager/buffered_read_seeker.go
/usr/src/RPM/BUILD/sops-3.13.1/.build/src/github.com/getsops/sops/v3/vendor/github.com/aws/aws-sdk-go-v2/feature/s3/manager/default_read_seeker_write_to.go
/usr/src/RPM/BUILD/sops-3.13.1/.build/src/github.com/getsops/sops/v3/vendor/github.com/aws/aws-sdk-go-v2/feature/s3/manager/default_writer_read_from.go
/usr/src/RPM/BUILD/sops-3.13.1/.build/src/github.com/getsops/sops/v3/vendor/github.com/aws/aws-sdk-go-v2/feature/s3/manager/doc.go
/usr/src/RPM/BUILD/sops-3.13.1/.build/src/github.com/getsops/sops/v3/vendor/github.com/aws/aws-sdk-go-v2/feature/s3/manager/download.go
/usr/src/RPM/BUILD/sops-3.13.1/.build/src/github.com/getsops/sops/v3/vendor/github.com/aws/aws-sdk-go-v2/feature/s3/manager/go_module_metadata.go
/usr/src/RPM/BUILD/sops-3.13.1/.build/src/github.com/getsops/sops/v3/vendor/github.com/aws/aws-sdk-go-v2/feature/s3/manager/pool.go
/usr/src/RPM/BUILD/sops-3.13.1/.build/src/github.com/getsops/sops/v3/vendor/github.com/aws/aws-sdk-go-v2/feature/s3/manager/read_seeker_write_to.go
/usr/src/RPM/BUILD/sops-3.13.1/.build/src/github.com/getsops/sops/v3/vendor/github.com/aws/aws-sdk-go-v2/feature/s3/manager/types.go
/usr/src/RPM/BUILD/sops-3.13.1/.build/src/github.com/getsops/sops/v3/vendor/github.com/aws/aws-sdk-go-v2/feature/s3/manager/upload.go
/usr/src/RPM/BUILD/sops-3.13.1/.build/src/github.com/getsops/sops/v3/vendor/github.com/aws/aws-sdk-go-v2/feature/s3/manager/writer_read_from.go
go tool buildid -w $WORK/b990/_pkg_.a # internal
cp $WORK/b990/_pkg_.a
/usr/src/.cache/go-build/de/de3c8cf9a8fd50c852132ebf98e6749a58e37442d0bbe79e388c30a34bd81258-d
# internal
error: Bad exit status from /usr/src/tmp/rpmb-tmp.kgGT3m (%build)
RPM build errors:
Bad exit status from /usr/src/tmp/rpmb-tmp.kgGT3m (%build)
squeekboard-1.43.1-alt1
108 | let _ = Rc::into_raw(used_rc); // prevent dropping the original reference
error: invalid definition of the runtime `close` symbol used by the standard library
--> /usr/src/RPM/BUILD/squeekboard-1.43.1/src/vkeyboard.rs:49:9
--
warning: `rs` (lib) generated 22 warnings
error: could not compile `rs` (lib) due to 1 previous error; 22 warnings emitted
Traceback (most recent call last):
--
output=stdout, stderr=stderr)
subprocess.CalledProcessError: Command '['sh',
'/usr/src/RPM/BUILD/squeekboard-1.43.1/cargo.sh', 'build', '--lib', '--features',
'zbus_v1_5,clap_v4']' returned non-zero exit status 101.
[90/93] Linking static target src/liblibsqueekboard.a
FAILED: [code=1] src/librs.a
/usr/bin/python3 /usr/src/RPM/BUILD/squeekboard-1.43.1/cargo_build.py src/librs.a --lib
--features zbus_v1_5,clap_v4
syft-1.51.1-alt1
ok github.com/anchore/syft/syft/format/internal 0.004s
--- FAIL: Test_allSpecVersionsMapped (0.09s)
versions_test.go:27:
Error Trace:
/usr/src/RPM/BUILD/syft-1.51.1/.build/src/github.com/anchore/syft/syft/format/internal/cyclonedxutil/versions_test.go:27
Error: Should be empty, but was [-: reading
/usr/src/.cache/go-build/c1/c10f6030020eb617159777485ecd82d5af3eee2bd2fbbde1a076eeebc1e1a65d-d:
internal error in importing "github.com/CycloneDX/cyclonedx-go" (cannot decode
"github.com/CycloneDX/cyclonedx-go", export data version 5 is greater than maximum
supported version 4); please report an issue]
Test: Test_allSpecVersionsMapped
trivy-0.71.2-alt1
packagefile time=/usr/src/tmp/go-build1080877327/b040/_pkg_.a
EOF
/usr/lib/golang/pkg/tool/linux_386/compile -o $WORK/b3210/_pkg_.a -trimpath
"$WORK/b3210=>" -p modernc.org/sqlite -lang=go1.25 -complete -buildid
0ZBrpkcvSQcPf_QSPTN_/0ZBrpkcvSQcPf_QSPTN_ -goversion go1.27.2-X:nodwarf5
-c=32 -nolocalimports -importcfg $WORK/b3210/importcfg -pack
/usr/src/RPM/BUILD/trivy-0.71.2/vendor/modernc.org/sqlite/backup.go
/usr/src/RPM/BUILD/trivy-0.71.2/vendor/modernc.org/sqlite/conn.go
/usr/src/RPM/BUILD/trivy-0.71.2/vendor/modernc.org/sqlite/convert.go
/usr/src/RPM/BUILD/trivy-0.71.2/vendor/modernc.org/sqlite/doc.go
/usr/src/RPM/BUILD/trivy-0.71.2/vendor/modernc.org/sqlite/driver.go
/usr/src/RPM/BUILD/trivy-0.71.2/vendor/modernc.org/sqlite/error.go
/usr/src/RPM/BUILD/trivy-0.71.2/vendor/modernc.org/sqlite/fcntl.go
/usr/src/RPM/BUILD/trivy-0.71.2/vendor/modernc.org/sqlite/mutex.go
/usr/src/RPM/BUILD/trivy-0.71.2/vendor/modernc.org/sqlite/nodmesg.go
/usr/src/RPM/BUILD/trivy-0.71.2/vendor/modernc.org/sqlite/pre_update_hook.go
/usr/src/RPM/BUILD/trivy-0.71.2/vendor/modernc.org/sqlite/result.go
/usr/src/RPM/BUILD/trivy-0.71.2/vendor/modernc.org/sqlite/rows.go
/usr/src/RPM/BUILD/trivy-0.71.2/vendor/modernc.org/sqlite/rulimit.go
/usr/src/RPM/BUILD/trivy-0.71.2/vendor/modernc.org/sqlite/sqlite.go
/usr/src/RPM/BUILD/trivy-0.71.2/vendor/modernc.org/sqlite/stmt.go
/usr/src/RPM/BUILD/trivy-0.71.2/vendor/modernc.org/sqlite/tx.go
/usr/src/RPM/BUILD/trivy-0.71.2/vendor/modernc.org/sqlite/vtab.go
go tool buildid -w $WORK/b3210/_pkg_.a # internal
cp $WORK/b3210/_pkg_.a
/usr/src/.cache/go-build/37/37c93867fc322868f6dc9d17a200c9daa471cd14a77d48c96b37e3709a0779d5-d
# internal
go tool buildid -w $WORK/b2821/_pkg_.a # internal
cp $WORK/b2821/_pkg_.a
/usr/src/.cache/go-build/8f/8f39f901d5b4c80641ba54c0212ed0a0a5b256f8f4cac520bf161b5a99b380d6-d
# internal
error: Bad exit status from /usr/src/tmp/rpmb-tmp.FqvhNE (%build)
RPM build errors:
Bad exit status from /usr/src/tmp/rpmb-tmp.FqvhNE (%build)
trivy-operator-0.30.1-alt1
EOF
cd
/usr/src/RPM/BUILD/trivy-operator-0.30.1/.build/src/github.com/aquasecurity/trivy-operator/cmd/trivy-operator
/usr/lib/golang/pkg/tool/linux_386/compile -o $WORK/b3276/_pkg_.a
-trimpath "$WORK/b3276=>" -p github.com/sassoftware/go-rpmutils
-lang=go1.21 -complete -buildid Qqmv8CbGUuI-FMVECvEM/Qqmv8CbGUuI-FMVECvEM
-goversion go1.27.2-X:nodwarf5 -c=32 -nolocalimports -importcfg $WORK/b3276/importcfg -pack
/usr/src/RPM/BUILD/trivy-operator-0.30.1/.build/src/github.com/aquasecurity/trivy-operator/vendor/github.com/sassoftware/go-rpmutils/errors.go
/usr/src/RPM/BUILD/trivy-operator-0.30.1/.build/src/github.com/aquasecurity/trivy-operator/vendor/github.com/sassoftware/go-rpmutils/fileinfo.go
/usr/src/RPM/BUILD/trivy-operator-0.30.1/.build/src/github.com/aquasecurity/trivy-operator/vendor/github.com/sassoftware/go-rpmutils/filesigs.go
/usr/src/RPM/BUILD/trivy-operator-0.30.1/.build/src/github.com/aquasecurity/trivy-operator/vendor/github.com/sassoftware/go-rpmutils/header.go
/usr/src/RPM/BUILD/trivy-operator-0.30.1/.build/src/github.com/aquasecurity/trivy-operator/vendor/github.com/sassoftware/go-rpmutils/nevra.go
/usr/src/RPM/BUILD/trivy-operator-0.30.1/.build/src/github.com/aquasecurity/trivy-operator/vendor/github.com/sassoftware/go-rpmutils/payload.go
/usr/src/RPM/BUILD/trivy-operator-0.30.1/.build/src/github.com/aquasecurity/trivy-operator/vendor/github.com/sassoftware/go-rpmutils/rpmutils.go
/usr/src/RPM/BUILD/trivy-operator-0.30.1/.build/src/github.com/aquasecurity/trivy-operator/vendor/github.com/sassoftware/go-rpmutils/signatures.go
/usr/src/RPM/BUILD/trivy-operator-0.30.1/.build/src/github.com/aquasecurity/trivy-operator/vendor/github.com/sassoftware/go-rpmutils/tags.go
/usr/src/RPM/BUILD/trivy-operator-0.30.1/.build/src/github.com/aquasecurity/trivy-operator/vendor/github.com/sassoftware/go-rpmutils/uncompress.go
/usr/src/RPM/BUILD/trivy-operator-0.30.1/.build/src/github.com/aquasecurity/trivy-operator/vendor/github.com/sassoftware/go-rpmutils/uncompress_cgo.go
/usr/src/RPM/BUILD/trivy-operator-0.30.1/.build/src/github.com/aquasecurity/trivy-operator/vendor/github.com/sassoftware/go-rpmutils/vercmp.go
/usr/src/RPM/BUILD/trivy-operator-0.30.1/.build/src/github.com/aquasecurity/trivy-operator/vendor/github.com/sassoftware/go-rpmutils/verify.go
/usr/src/RPM/BUILD/trivy-operator-0.30.1/.build/src/github.com/aquasecurity/trivy-operator/vendor/github.com/sassoftware/go-rpmutils/verify_digests.go
/usr/src/RPM/BUILD/trivy-operator-0.30.1/.build/src/github.com/aquasecurity/trivy-operator/vendor/github.com/sassoftware/go-rpmutils/verify_nov3.go
/usr/src/RPM/BUILD/trivy-operator-0.30.1/.build/src/github.com/aquasecurity/trivy-operator/vendor/github.com/sassoftware/go-rpmutils/verify_v4.go
/usr/src/RPM/BUILD/trivy-operator-0.30.1/.build/src/github.com/aquasecurity/trivy-operator/vendor/github.com/sassoftware/go-rpmutils/writeheader.go
go tool buildid -w $WORK/b3276/_pkg_.a # internal
cp $WORK/b3276/_pkg_.a
/usr/src/.cache/go-build/89/897ac595ebdff585a3d79b1c8a4503913c9b76696fa612509b539e407243dfce-d
# internal
go tool buildid -w $WORK/b3040/_pkg_.a # internal
cp $WORK/b3040/_pkg_.a
/usr/src/.cache/go-build/9e/9eec8df4f060a1f7da674dec9dc144e832a0816644e2e8bdbf597d554f7484b7-d
# internal
error: Bad exit status from /usr/src/tmp/rpmb-tmp.WlmNna (%build)
RPM build errors:
Bad exit status from /usr/src/tmp/rpmb-tmp.WlmNna (%build)
wabt-1.0.41-alt1
Call Stack (most recent call first):
/usr/share/cmake/Modules/FindPackageHandleStandardArgs.cmake:654 (_FPHSA_FAILURE_MESSAGE)
/usr/share/cmake/Modules/FindPython/Support.cmake:4429 (find_package_handle_standard_args)
/usr/share/cmake/Modules/FindPython3.cmake:699 (include)
CMakeLists.txt:676 (find_package)
-- Configuring incomplete, errors occurred!
error: Bad exit status from /usr/src/tmp/rpmb-tmp.G6ZWt0 (%build)
RPM build errors:
Macro %ix64 not found
Bad exit status from /usr/src/tmp/rpmb-tmp.G6ZWt0 (%build)
xfce4-notes-plugin-1.12.0-alt1
[65/84] valac --depfile lib/notes.depfile -C --debug --enable-deprecated
--define=MESON_BUILD --pkg libxfconf-0 --pkg libxfce4util-1.0 --pkg libxfce4ui-2
--pkg libxfce4panel-2.0 --pkg gtksourceview-4 --pkg gtk+-3.0 --pkg glib-2.0 --pkg
gio-2.0 --target-glib 2.50.0 --color=always --directory lib/libnotes.a.p --basedir
../lib --library notes --header lib/libnotes.h --vapi ../libnotes.vapi --pkg config
--vapidir /usr/src/RPM/BUILD/xfce4-notes-plugin-1.12.0/lib ../lib/application.vala
../lib/file-utils.vala ../lib/hypertextview.vala ../lib/icon-button.vala ../lib/note.vala
../lib/theme-gtkcss.vala ../lib/theme.vala ../lib/window-monitor.vala ../lib/window.vala
FAILED: [code=1] lib/libnotes.a.p/application.c lib/libnotes.a.p/file-utils.c
lib/libnotes.a.p/hypertextview.c lib/libnotes.a.p/icon-button.c lib/libnotes.a.p/note.c
lib/libnotes.a.p/theme-gtkcss.c lib/libnotes.a.p/theme.c lib/libnotes.a.p/window-monitor.c
lib/libnotes.a.p/window.c lib/libnotes.h lib/libnotes.vapi
valac --depfile lib/notes.depfile -C --debug --enable-deprecated --define=MESON_BUILD
--pkg libxfconf-0 --pkg libxfce4util-1.0 --pkg libxfce4ui-2 --pkg libxfce4panel-2.0
--pkg gtksourceview-4 --pkg gtk+-3.0 --pkg glib-2.0 --pkg gio-2.0 --target-glib
2.50.0 --color=always --directory lib/libnotes.a.p --basedir ../lib --library
notes --header lib/libnotes.h --vapi ../libnotes.vapi --pkg config --vapidir
/usr/src/RPM/BUILD/xfce4-notes-plugin-1.12.0/lib ../lib/application.vala
../lib/file-utils.vala ../lib/hypertextview.vala ../lib/icon-button.vala ../lib/note.vala
../lib/theme-gtkcss.vala ../lib/theme.vala ../lib/window-monitor.vala ../lib/window.vala
../lib/theme-gtkcss.vala:38.49-38.72: error: The name `CONFIG' does not exist in the
context of `Xfce.ResourceType' (libxfce4util-1.0)
38 | css_path_user = Xfce.resource_save_location
(Xfce.ResourceType.CONFIG, "xfce4/notes/gtk.css", true);
--
143 | public enum ResourceType {
../lib/application.vala:179.45-179.68: error: The name `CONFIG' does not exist in the
context of `Xfce.ResourceType' (libxfce4util-1.0)
179 | var css = Xfce.resource_save_location
(Xfce.ResourceType.CONFIG, "xfce4/xfce4-notes.css", false);
--
143 | public enum ResourceType {
../lib/application.vala:182.59-182.82: error: The name `CONFIG' does not exist in the
context of `Xfce.ResourceType' (libxfce4util-1.0)
182 | var old_save_location = Xfce.resource_save_location
(Xfce.ResourceType.CONFIG, "xfce4/xfce4-notes.rc", false);
--
143 | public enum ResourceType {
../lib/application.vala:185.56-185.79: error: The name `CONFIG' does not exist in the
context of `Xfce.ResourceType' (libxfce4util-1.0)
185 | var save_location =
Xfce.resource_save_location (Xfce.ResourceType.CONFIG, "xfce4/notes/xfce4-notes.rc", true);
80 error logs REMOVED from the list
Vanilla-Conquer-06032023-alt1.1
aMule-2.3.3-alt7
altlinux-freedesktop-menu-0.70-alt2
barrier-2.3.4-alt1
blktrace-1.3.0-alt3
cppcheck-2.18.1-alt1_0_12337740f
deepin-appearance-1.1.85-alt1
dpkg-1.23.5-alt1
farstream0.2-0.2.9.1-alt0.4
flexmark-java-0.64.6-alt3
flow-tools-ng-0.68.5-alt6
gambit-4.9.7-alt5
gdcm-3.2.5-alt2
gem-redfish-client-0.6.0-alt1
gem-solargraph-0.50.0-alt1.1
glusterfs11-11.1-alt2
gnubiff-2.2.17-alt1
google-api-ruby-client-20251103-alt1.3
gsplus-0.14-alt2
guava20-20.0-alt1_11jpp11
heirloom-070715-alt3
jboss-jstl-1.2-api-1.1.2-alt1_9jpp11
jujutsu-0.36.0-alt1
junit3-1:3.8.2-alt12_10jpp6
kronos-2.7.0-alt1
libcryptui-3.12.2-alt3.1
libdynamite-0.1.1-alt2
libfprint2-1.94.100-alt1
libmozjs128-128.14.0-alt1
libopencv-1:4.14.0-alt1
libretro-consoles-20260127-alt2
libretro-engines-20251012-alt1
libsecret-0.21.8.2-alt1
libunicapgtk-0.9.8-alt2.qa1
logtop-0.7-alt1.1
nas-1.9.5-alt1.1
nautilus-image-converter-0.4.0-alt2
nheko-0.12.1-alt4
nvram-wakeup-0.99b-alt1.qa1
objectweb-asm3-3.3.1-alt2_23jpp11
openipmi-2.0.37-alt1
openmsx-21.0-alt1
openuds-server-4.0.0-alt8
partio-1.20.0-alt1
perl-Server-Starter-0.35-alt1.1
pipestatus-0.7.0-alt2
pom1-1.0.0-alt2
postgresql18-18.6-alt1
premake5-5.0.0.beta2-alt2
publican-4.3.2-alt5_22
punesemu-0.111-alt1
pv-1.10.5-alt1
python3-module-aiohttp-3.14.3-alt1
python3-module-aiounittest-1.5.0-alt1
python3-module-async-property-0.2.2-alt1
python3-module-cmd2-3.2.0-alt1
python3-module-django-modern-rest-0.15.0-alt1
python3-module-django-mptt-0.18-alt1
python3-module-drf-spectacular-0.30.0-alt1
python3-module-exam-0.10.6-alt5
python3-module-flask-sqlalchemy-3.1.1-alt3
python3-module-mkdocstrings-1.0.6-alt1
python3-module-nest-asyncio-1.5.4-alt1
python3-module-oslo.messaging-1:17.1.0-alt1
python3-module-oslo.rootwrap-7.7.0-alt1
python3-module-pymdown-extensions-10.21.2-alt1
python3-module-pytest-xprocess-1.0.2-alt1.1
python3-module-rich-argparse-1.7.2-alt1
python3-module-slack-sdk-3.35.0-alt1
python3-module-social-core-5.1.0-alt1
python3-module-sphinx-1:9.1.0-alt1
python3-module-sqlfluff-4.3.0-alt1
python3-module-typing_extensions-4.16.0-alt1
rtfparserkit-1.16.0-alt1
runawk-1.6.1-alt3
seahorse-nautilus-3.11.92-alt4.1
selenium-4.38.0-alt1
xnp21kai-rev.22-alt1.git4b109ea
xpad-5.8.0-alt1
xraylib-4.1.5-alt1
Total 266 error logs.
reply other threads:[~2026-10-10 12:30 UTC|newest]
Thread overview: [no followups] expand[flat|nested] mbox.gz Atom feed
Reply instructions:
You may reply publicly to this message via plain-text email
using any one of the following methods:
* Save the following mbox file, import it into your mail client,
and reply-to-all from there: mbox
Avoid top-posting and favor interleaved quoting:
https://en.wikipedia.org/wiki/Posting_style#Interleaved_style
* Reply using the --to, --cc, and --in-reply-to
switches of git-send-email(1):
git send-email \
--in-reply-to=asowA0kdFA++eH53@beehive.mskdc.altlinux.org \
--to=hiver@altlinux.org \
--cc=devel@lists.altlinux.org \
--cc=sisyphus-cybertalk@lists.altlinux.org \
/path/to/YOUR_REPLY
https://kernel.org/pub/software/scm/git/docs/git-send-email.html
* If your mail client supports setting the In-Reply-To header
via mailto: links, try the mailto: link
ALT Linux Sisyphus cybertalk
This inbox may be cloned and mirrored by anyone:
git clone --mirror http://lore.altlinux.org/sisyphus-cybertalk/0 sisyphus-cybertalk/git/0.git
# If you have public-inbox 1.1+ installed, you may
# initialize and index your mirror using the following commands:
public-inbox-init -V2 sisyphus-cybertalk sisyphus-cybertalk/ http://lore.altlinux.org/sisyphus-cybertalk \
sisyphus-cybertalk@lists.altlinux.org sisyphus-cybertalk@lists.altlinux.ru sisyphus-cybertalk@lists.altlinux.com
public-inbox-index sisyphus-cybertalk
Example config snippet for mirrors.
Newsgroup available over NNTP:
nntp://lore.altlinux.org/org.altlinux.lists.sisyphus-cybertalk
AGPL code for this site: git clone https://public-inbox.org/public-inbox.git