* [cyber] I: Sisyphus-20261003 i586 beehive_status: +39 -40 (305)
@ 2026-10-03 12:02 ALT beekeeper
0 siblings, 0 replies; only message in thread
From: ALT beekeeper @ 2026-10-03 12:02 UTC (permalink / raw)
To: sisyphus-cybertalk
[-- Warning: decoded text below may be mangled, UTF-8 assumed --]
[-- Attachment #1: Type: text/plain; charset=unknown-8bit, Size: 65161 bytes --]
39 NEW error logs
altlinux-freedesktop-menu-0.70-alt2
+ for i in desktop-directories/*.directory
++ basename desktop-directories/altlinux-xfce.directory
+ j=altlinux-xfce.directory
+ grep altlinux-xfce.directory ignore.list
+ rm ignore.list
+ '[' 0 -gt 0 ']'
+ exit 1
error: Bad exit status from /usr/src/tmp/rpmb-tmp.uMDEfe (%check)
RPM build errors:
Bad exit status from /usr/src/tmp/rpmb-tmp.uMDEfe (%check)
apparmor-4.1.7-alt1.1
libapparmor_wrap.c: In function ‘_wrap_aa_splitcon’:
libapparmor_wrap.c:6577:14: error: expected expression before ‘%’ token
6577 | arg1 = %new_copy_array(con_ptr, con_len+1, char);
--
7898 | for (cast = head; (cast - head) <= head->value; cast++) {
error: Command '['i586-alt-linux-gcc', '-fno-strict-overflow', '-Wsign-compare',
'-DDYNAMIC_ANNOTATIONS_ENABLED=1', '-DNDEBUG', '-g', '-O3', '-Wall', '-pipe',
'-frecord-gcc-switches', '-Wall', '-g', '-O3', '-flto=auto', '-ffat-lto-objects',
'-march=i586', '-mtune=generic', '-pipe', '-frecord-gcc-switches', '-Wall',
'-g', '-O3', '-flto=auto', '-ffat-lto-objects', '-march=i586', '-mtune=generic',
'-I/usr/include/python3.14', '-I/usr/include/python3.14', '-pipe', '-frecord-gcc-switches',
'-Wall', '-g', '-O2', '-march=i586', '-mtune=generic', '-Wall', '-Wsign-compare',
'-Wmissing-field-initializers', '-Wformat', '-Wformat-security', '-Wunused-parameter',
'-Wimplicit-fallthrough', '-fPIC', '-I../../include', '-I/usr/include/python3.14', '-c',
'libapparmor_wrap.c', '-o', 'build/temp.linux-i686-cpython-314/libapparmor_wrap.o']'
returned non-zero exit status 1.
make[3]: *** [Makefile:667: all-local] Error 1
barrier-2.3.4-alt1
C++ exception with description "test event queue timeout" thrown in the test body.
[ FAILED ] NetworkTests.sendToServer_mockFile (10189 ms)
[----------] 4 tests from NetworkTests (21394 ms total)
--
[ PASSED ] 18 tests.
[ FAILED ] 2 tests, listed below:
[ FAILED ] NetworkTests.sendToClient_mockFile
[ FAILED ] NetworkTests.sendToServer_mockFile
2 FAILED TESTS
YOU HAVE 1 DISABLED TEST
blktrace-1.3.0-alt3
CPU 4
CPU 5 -- 1 bad
CPU 6
CPU 7
Wrote output to zzz.verify.out
5.45user 2.49system 0:05.69elapsed 139%CPU (0avgtext+0avgdata 394632maxresident)k
0inputs+0outputs (0major+10713minor)pagefaults 0swaps
error: Bad exit status from /usr/src/tmp/rpmb-tmp.g6NO3S (%check)
RPM build errors:
Bad exit status from /usr/src/tmp/rpmb-tmp.g6NO3S (%check)
dtc-1.8.1-alt2
[44/48] Compiling C object pylibfdt/_libfdt.cpython-314.so.p/meson-generated_.._libfdt.c.o
FAILED: [code=1] pylibfdt/_libfdt.cpython-314.so.p/meson-generated_.._libfdt.c.o
cc -Ipylibfdt/_libfdt.cpython-314.so.p -Ipylibfdt -I../pylibfdt -Ilibfdt
-I../libfdt -I/usr/include/python3.14 -fvisibility=hidden -fdiagnostics-color=always
-D_FILE_OFFSET_BITS=64 -Wall -Winvalid-pch -Werror -O2 -g -Wpointer-arith -Wcast-qual
-Wnested-externs -Wstrict-prototypes -Wmissing-prototypes -Wredundant-decls -Wshadow
-Wsuggest-attribute=format -Wwrite-strings -Wdiscarded-qualifiers -DFDT_ASSUME_MASK=0
-DNO_YAML -DNO_VALGRIND -pipe -frecord-gcc-switches -Wall -g -O2 -march=i586 -mtune=generic
-fPIC -DPY_SSIZE_T_CLEAN -Wno-cast-qual -Wno-missing-prototypes -Wno-redundant-decls
-MD -MQ pylibfdt/_libfdt.cpython-314.so.p/meson-generated_.._libfdt.c.o
-MF pylibfdt/_libfdt.cpython-314.so.p/meson-generated_.._libfdt.c.o.d -o
pylibfdt/_libfdt.cpython-314.so.p/meson-generated_.._libfdt.c.o -c pylibfdt/libfdt.c
pylibfdt/libfdt.c: In function ‘_wrap_fdt_next_node’:
pylibfdt/libfdt.c:5555:20: error: implicit declaration of function ‘PyInt_AsLong’;
did you mean ‘PyLong_AsLong’? [-Wimplicit-function-declaration]
5555 | depth3 = (int) PyInt_AsLong(swig_obj[2]);
| PyLong_AsLong
pylibfdt/libfdt.c:5555:20: error: nested extern declaration of ‘PyInt_AsLong’
[-Werror=nested-externs]
pylibfdt/libfdt.c: In function ‘_wrap_fdt_get_property_by_offset’:
pylibfdt/libfdt.c:6606:19: error: implicit declaration
of function ‘PyString_FromString’; did you mean
‘PyLong_FromString’? [-Wimplicit-function-declaration]
6606 | resultobj = PyString_FromString(
| PyLong_FromString
pylibfdt/libfdt.c:6606:19: error: nested extern declaration of ‘PyString_FromString’
[-Werror=nested-externs]
pylibfdt/libfdt.c:6606:17: error: assignment to ‘PyObject *’ {aka ‘struct _object
*’} from ‘int’ makes pointer from integer without a cast [-Wint-conversion]
6606 | resultobj = PyString_FromString(
pylibfdt/libfdt.c: In function ‘_wrap_fdt_get_property_by_offset_w’:
pylibfdt/libfdt.c:6660:17: error: assignment to ‘PyObject *’ {aka ‘struct _object
*’} from ‘int’ makes pointer from integer without a cast [-Wint-conversion]
6660 | resultobj = PyString_FromString(
pylibfdt/libfdt.c: In function ‘_wrap_fdt_get_property’:
pylibfdt/libfdt.c:6723:17: error: assignment to ‘PyObject *’ {aka ‘struct _object
*’} from ‘int’ makes pointer from integer without a cast [-Wint-conversion]
6723 | resultobj = PyString_FromString(
pylibfdt/libfdt.c: In function ‘_wrap_fdt_get_property_w’:
pylibfdt/libfdt.c:6788:17: error: assignment to ‘PyObject *’ {aka ‘struct _object
*’} from ‘int’ makes pointer from integer without a cast [-Wint-conversion]
6788 | resultobj = PyString_FromString(
cc1: all warnings being treated as errors
[45/48] Compiling C object dtc.p/livetree.c.o
gdcm-3.2.5-alt2
/usr/src/RPM/BUILD/gdcm-3.2.5/i586-alt-linux/Wrapping/Python/CMakeFiles/gdcmswig.dir/gdcmswigPYTHON_wrap.cxx:
In function 'PyObject* _wrap_DataElement_SetByteStringValue(PyObject*, PyObject*)':
/usr/src/RPM/BUILD/gdcm-3.2.5/i586-alt-linux/Wrapping/Python/CMakeFiles/gdcmswig.dir/gdcmswigPYTHON_wrap.cxx:23153:12:
error: 'PyString_AsString' was not declared in this scope
23153 | arg2 = PyString_AsString(swig_obj[1]);
/usr/src/RPM/BUILD/gdcm-3.2.5/i586-alt-linux/Wrapping/Python/CMakeFiles/gdcmswig.dir/gdcmswigPYTHON_wrap.cxx:23157:25:
error: 'PyString_Size' was not declared in this scope; did you mean 'PyMapping_Size'?
23157 | Py_ssize_t length = PyString_Size(swig_obj[1]);
--
/usr/src/RPM/BUILD/gdcm-3.2.5/i586-alt-linux/Wrapping/Python/CMakeFiles/gdcmswig.dir/gdcmswigPYTHON_wrap.cxx:
In function 'PyObject* _wrap_Bitmap_GetDimensions(PyObject*, PyObject*)':
/usr/src/RPM/BUILD/gdcm-3.2.5/i586-alt-linux/Wrapping/Python/CMakeFiles/gdcmswig.dir/gdcmswigPYTHON_wrap.cxx:32218:21:
error: 'PyInt_FromLong' was not declared in this scope; did you mean 'PyLong_FromLong'?
32218 | PyObject *o = PyInt_FromLong((long) result[i]);
--
/usr/src/RPM/BUILD/gdcm-3.2.5/i586-alt-linux/Wrapping/Python/CMakeFiles/gdcmswig.dir/gdcmswigPYTHON_wrap.cxx:
In function 'PyObject* _wrap_CSAElement_SetByteStringValue(PyObject*, PyObject*)':
/usr/src/RPM/BUILD/gdcm-3.2.5/i586-alt-linux/Wrapping/Python/CMakeFiles/gdcmswig.dir/gdcmswigPYTHON_wrap.cxx:37926:12:
error: 'PyString_AsString' was not declared in this scope
37926 | arg2 = PyString_AsString(swig_obj[1]);
/usr/src/RPM/BUILD/gdcm-3.2.5/i586-alt-linux/Wrapping/Python/CMakeFiles/gdcmswig.dir/gdcmswigPYTHON_wrap.cxx:37930:25:
error: 'PyString_Size' was not declared in this scope; did you mean 'PyMapping_Size'?
37930 | Py_ssize_t length = PyString_Size(swig_obj[1]);
--
/usr/src/RPM/BUILD/gdcm-3.2.5/i586-alt-linux/Wrapping/Python/CMakeFiles/gdcmswig.dir/gdcmswigPYTHON_wrap.cxx:
In function 'PyObject* _wrap_ImageCodec_GetDimensions(PyObject*, PyObject*)':
/usr/src/RPM/BUILD/gdcm-3.2.5/i586-alt-linux/Wrapping/Python/CMakeFiles/gdcmswig.dir/gdcmswigPYTHON_wrap.cxx:75497:21:
error: 'PyInt_FromLong' was not declared in this scope; did you mean 'PyLong_FromLong'?
75497 | PyObject *o = PyInt_FromLong((long) result[i]);
gem-digest-crc-0.6.5-alt1
Wrote: /usr/src/in/nosrpm/gem-digest-crc-0.6.5-alt1.nosrc.rpm (w1.gzdio)
error: failed build dependencies:
gem(github-markup) >= 5 conflicts with gem-digest-crc-0.6.5-alt1
google-api-ruby-client-20251103-alt1.3
Wrote: /usr/src/in/nosrpm/google-api-ruby-client-20251103-alt1.3.nosrc.rpm (w1.gzdio)
error: failed build dependencies:
gem(redis) >= 5.0.8 conflicts with google-api-ruby-client-20251103-alt1.3
gpgmepy-2.0.0-alt1
python3-gpg/gpgme_wrap.c: In function ‘_wrap_gpgme_data_seek’:
python3-gpg/gpgme_wrap.c:4085:14: error: implicit declaration of function
‘PyInt_Check’; did you mean ‘PySet_Check’? [-Wimplicit-function-declaration]
4085 | else if (PyInt_Check(swig_obj[1]))
| PySet_Check
python3-gpg/gpgme_wrap.c:4086:12: error: implicit declaration of function
‘PyInt_AsLong’; did you mean ‘PyLong_AsLong’? [-Wimplicit-function-declaration]
4086 | arg2 = PyInt_AsLong(swig_obj[1]);
--
python3-gpg/gpgme_wrap.c: In function ‘_wrap_gpgme_op_receive_keys_start’:
python3-gpg/gpgme_wrap.c:33926:18: error: implicit declaration of function
‘PyString_Check’; did you mean ‘PyMapping_Check’? [-Wimplicit-function-declaration]
33926 | else if (PyString_Check(o))
| PyMapping_Check
python3-gpg/gpgme_wrap.c:33927:19: error: implicit declaration of function
‘PyString_AsString’ [-Wimplicit-function-declaration]
33927 | arg2[i] = PyString_AsString(o);
python3-gpg/gpgme_wrap.c:33927:17: error: assignment to ‘char *’ from ‘int’
makes pointer from integer without a cast [-Wint-conversion]
33927 | arg2[i] = PyString_AsString(o);
python3-gpg/gpgme_wrap.c: In function ‘_wrap_gpgme_op_receive_keys’:
python3-gpg/gpgme_wrap.c:34013:17: error: assignment to ‘char *’ from ‘int’
makes pointer from integer without a cast [-Wint-conversion]
34013 | arg2[i] = PyString_AsString(o);
python3-gpg/gpgme_wrap.c: In function ‘_wrap_gpgme_op_export_ext_start’:
python3-gpg/gpgme_wrap.c:34679:17: error: assignment to ‘char *’ from ‘int’
makes pointer from integer without a cast [-Wint-conversion]
34679 | arg2[i] = PyString_AsString(o);
python3-gpg/gpgme_wrap.c: In function ‘_wrap_gpgme_op_export_ext’:
python3-gpg/gpgme_wrap.c:34995:17: error: assignment to ‘char *’ from ‘int’
makes pointer from integer without a cast [-Wint-conversion]
34995 | arg2[i] = PyString_AsString(o);
python3-gpg/gpgme_wrap.c: In function ‘_wrap_gpgme_op_keylist_ext_start’:
python3-gpg/gpgme_wrap.c:40448:17: error: assignment to ‘char *’ from ‘int’
makes pointer from integer without a cast [-Wint-conversion]
40448 | arg2[i] = PyString_AsString(o);
python3-gpg/gpgme_wrap.c: In function ‘_wrap_gpgme_op_spawn_start’:
python3-gpg/gpgme_wrap.c:41083:17: error: assignment to ‘char *’ from ‘int’
makes pointer from integer without a cast [-Wint-conversion]
41083 | arg3[i] = PyString_AsString(o);
hugin-2025.0.1-alt1
cd /usr/src/RPM/BUILD/hugin-2025.0.1/i586-alt-linux/src/tools && /usr/bin/cmake -E
cmake_link_script CMakeFiles/verdandi.dir/link.txt --verbose=1
/usr/bin/c++ -pipe -frecord-gcc-switches -Wall -g -O2 -flto=auto -march=i586
-mtune=generic -D_LARGEFILE_SOURCE -D_FILE_OFFSET_BITS=64 -O2 -g -DNDEBUG -fopenmp
-Wl,--dependency-file=CMakeFiles/verdandi.dir/link.d CMakeFiles/verdandi.dir/verdandi.cpp.o
-o verdandi -Wl,-rpath,/usr/src/RPM/BUILD/hugin-2025.0.1/i586-alt-linux/src/hugin_base:
../hugin_base/libhuginbase.so.0.0 /usr/lib/libpano13.so ../foreign/levmar/libhuginlevmar.a
/usr/lib/libfftw3.so /usr/lib/libvigraimpex.so /usr/lib/libOpenEXR.so
/usr/lib/libImath-3_2.so /usr/lib/libIex.so /usr/lib/libIlmThread.so /usr/lib/libz.so
/usr/lib/libtiff.so /usr/lib/libz.so /usr/lib/libexiv2.so /usr/lib/liblcms2.so
/usr/lib/libvigraimpex.so /usr/lib/libOpenEXR.so /usr/lib/libImath-3_2.so
/usr/lib/libIex.so /usr/lib/libIlmThread.so /usr/lib/libz.so /usr/lib/libtiff.so
/usr/lib/libz.so /usr/lib/libexiv2.so /usr/lib/libX11.so /usr/lib/libpano13.so
/usr/lib/libOpenGL.so /usr/lib/libGLX.so /usr/lib/libGLU.so /usr/lib/libepoxy.so
/usr/lib/libsqlite3.so /usr/lib/libOpenEXR.so /usr/lib/libImath-3_2.so /usr/lib/libIex.so
/usr/lib/libIlmThread.so /usr/lib/libOpenEXR.so /usr/lib/libImath-3_2.so /usr/lib/libIex.so
/usr/lib/libIlmThread.so /usr/lib/libz.so /usr/lib/libvigraimpex.so /usr/lib/libexiv2.so
/usr/lib/libtiff.so /usr/lib/liblcms2.so
gmake[2]: Leaving directory '/usr/src/RPM/BUILD/hugin-2025.0.1/i586-alt-linux'
gmake[1]: Entering directory '/usr/src/RPM/BUILD/hugin-2025.0.1/i586-alt-linux'
[ 59%] Built target verdandi
gmake[1]: Leaving directory '/usr/src/RPM/BUILD/hugin-2025.0.1/i586-alt-linux'
gmake: *** [Makefile:156: all] Error 2
error: Bad exit status from /usr/src/tmp/rpmb-tmp.QD7KqY (%build)
RPM build errors:
Bad exit status from /usr/src/tmp/rpmb-tmp.QD7KqY (%build)
libftdi1-1.5-alt3.2
/usr/src/RPM/BUILD/libftdi1-1.5/python/CMakeFiles/_ftdi1.dir/ftdi1PYTHON_wrap.c: In
function '_wrap_read_data':
/usr/src/RPM/BUILD/libftdi1-1.5/python/CMakeFiles/_ftdi1.dir/ftdi1PYTHON_wrap.c:3985:10:
error: implicit declaration of function 'PyInt_AsLong'; did you mean
'PyLong_AsLong'? [-Wimplicit-function-declaration]
3985 | arg3 = PyInt_AsLong(swig_obj[1]);arg2 = (unsigned char*)malloc(arg3*sizeof(char));
libsecret-0.21.8.2-alt1
# Start of dh tests
Summary of Failures:
25/25 libegg - libsecret:test-dh-length TIMEOUT 30.21s killed by
signal 15 SIGTERM
Ok: 24
Fail: 0
Timeout: 1
Full log written to
/usr/src/RPM/BUILD/libsecret-0.21.8.2/i586-alt-linux/meson-logs/testlog.txt
error: Bad exit status from /usr/src/tmp/rpmb-tmp.EXUF6s (%check)
RPM build errors:
Bad exit status from /usr/src/tmp/rpmb-tmp.EXUF6s (%check)
libselinux-1:3.9-alt1
selinuxswig_python_wrap.c: In function ‘_wrap_get_ordered_context_list’:
selinuxswig_python_wrap.c:6646:34: error: implicit declaration
of function ‘PyString_FromString’; did you mean
‘PyLong_FromString’? [-Wimplicit-function-declaration]
6646 | PyList_SetItem(plist, i, PyString_FromString((*arg3)[i]));
| PyLong_FromString
selinuxswig_python_wrap.c:6646:34: error: passing argument 3 of ‘PyList_SetItem’
makes pointer from integer without a cast [-Wint-conversion]
6646 | PyList_SetItem(plist, i, PyString_FromString((*arg3)[i]));
--
selinuxswig_python_wrap.c: In function ‘_wrap_get_ordered_context_list_with_level’:
selinuxswig_python_wrap.c:6724:34: error: passing argument 3 of ‘PyList_SetItem’
makes pointer from integer without a cast [-Wint-conversion]
6724 | PyList_SetItem(plist, i, PyString_FromString((*arg4)[i]));
--
selinuxswig_python_wrap.c: In function ‘_wrap_security_compute_user’:
selinuxswig_python_wrap.c:11498:34: error: passing argument 3 of ‘PyList_SetItem’
makes pointer from integer without a cast [-Wint-conversion]
11498 | PyList_SetItem(plist, i, PyString_FromString((*arg3)[i]));
--
selinuxswig_python_wrap.c: In function ‘_wrap_security_compute_user_raw’:
selinuxswig_python_wrap.c:11569:34: error: passing argument 3 of ‘PyList_SetItem’
makes pointer from integer without a cast [-Wint-conversion]
11569 | PyList_SetItem(plist, i, PyString_FromString((*arg3)[i]));
--
selinuxswig_python_wrap.c: In function ‘_wrap_security_get_boolean_names’:
selinuxswig_python_wrap.c:12473:31: error: passing argument 3 of ‘PyList_SetItem’
makes pointer from integer without a cast [-Wint-conversion]
12473 | PyList_SetItem(list, i, PyString_FromString((*arg1)[i]));
--
15675 | for (cast = head; (cast - head) <= head->value; cast++) {
error: Command '['i586-alt-linux-gcc', '-fno-strict-overflow', '-Wsign-compare',
'-DDYNAMIC_ANNOTATIONS_ENABLED=1', '-DNDEBUG', '-g', '-O3', '-Wall', '-pipe',
'-frecord-gcc-switches', '-Wall', '-g', '-O3', '-flto=auto', '-ffat-lto-objects',
'-march=i586', '-mtune=generic', '-pipe', '-frecord-gcc-switches', '-Wall', '-g',
'-O3', '-flto=auto', '-ffat-lto-objects', '-march=i586', '-mtune=generic', '-pipe',
'-frecord-gcc-switches', '-Wall', '-g', '-O2', '-flto=auto', '-ffat-lto-objects',
'-march=i586', '-mtune=generic', '-D_FILE_OFFSET_BITS=64', '-D_LARGEFILE_SOURCE',
'-D_FILE_OFFSET_BITS=64', '-I../include', '-D_GNU_SOURCE', '-DNO_ANDROID_BACKEND',
'-DUSE_PCRE2', '-DPCRE2_CODE_UNIT_WIDTH=8', '-DHAVE_STRLCPY', '-DHAVE_REALLOCARRAY',
'-Wno-error', '-Wno-unused-variable', '-Wno-unused-but-set-variable',
'-Wno-unused-parameter', '-Wno-shadow', '-Wno-uninitialized', '-Wno-missing-prototypes',
'-Wno-missing-declarations', '-Wno-deprecated-declarations', '-fPIC',
'-I../include', '-I/usr/include/python3.14', '-c', 'selinuxswig_python_wrap.c', '-o',
'build/temp.linux-i686-cpython-314/selinuxswig_python_wrap.o']' returned non-zero exit
status 1.
Traceback (most recent call last):
--
raise RuntimeError(err_msg) from None
RuntimeError: build_wheel failed
make[1]: *** [Makefile:156: pywrap] Error 1
libsigrok-0.6.0-alt0.20251120.1
sigrok/core/classes_wrap.cpp: In function ‘Glib::VariantBase
python_to_variant_by_key(PyObject*, const sigrok::ConfigKey*)’:
sigrok/core/classes_wrap.cpp:7652:32: error: ‘PyInt_Check’ was not declared in this
scope; did you mean ‘PySet_Check’?
7652 | if (type == SR_T_UINT64 && PyInt_Check(input))
| PySet_Check
sigrok/core/classes_wrap.cpp:7653:47: error: ‘PyInt_AsLong’ was not declared in
this scope; did you mean ‘PyLong_AsLong’?
7653 | return Glib::Variant<guint64>::create(PyInt_AsLong(input));
| PyLong_AsLong
sigrok/core/classes_wrap.cpp:7662:36: error: ‘PyInt_Check’ was not declared in this
scope; did you mean ‘PySet_Check’?
7662 | else if (type == SR_T_INT32 && PyInt_Check(input))
| PySet_Check
sigrok/core/classes_wrap.cpp:7663:46: error: ‘PyInt_AsLong’ was not declared in
this scope; did you mean ‘PyLong_AsLong’?
7663 | return Glib::Variant<gint32>::create(PyInt_AsLong(input));
| PyLong_AsLong
sigrok/core/classes_wrap.cpp:7665:47: error: ‘PyInt_AsLong’ was not declared in
this scope; did you mean ‘PyLong_AsLong’?
7665 | return Glib::Variant<guint32>::create(PyInt_AsLong(input));
| PyLong_AsLong
sigrok/core/classes_wrap.cpp:7670:52: error: ‘PyInt_AsLong’ was not declared in
this scope; did you mean ‘PyLong_AsLong’?
7670 | const std::vector<guint64> v = {(guint64)PyInt_AsLong(numObj),
(guint64)PyInt_AsLong(denomObj)};
| PyLong_AsLong
sigrok/core/classes_wrap.cpp:7670:105: error: could not convert ‘{<expression error>,
<expression error>}’ from ‘<brace-enclosed initializer list>’ to ‘const
std::vector<long long unsigned int>’
7670 | const std::vector<guint64> v = {(guint64)PyInt_AsLong(numObj),
(guint64)PyInt_AsLong(denomObj)};
|
<brace-enclosed initializer list>
sigrok/core/classes_wrap.cpp:7680:30: error: ‘PyInt_AsLong’ was not declared in
this scope; did you mean ‘PyLong_AsLong’?
7680 | (guint32)PyInt_AsLong(numObj),
--
sigrok/core/classes_wrap.cpp: In function ‘Glib::VariantBase
python_to_variant_by_option(PyObject*, std::shared_ptr<sigrok::Option>)’:
sigrok/core/classes_wrap.cpp:7695:42: error: ‘PyInt_Check’ was not declared in this
scope; did you mean ‘PySet_Check’?
7695 | if (type == G_VARIANT_TYPE_UINT64 && PyInt_Check(input))
| PySet_Check
sigrok/core/classes_wrap.cpp:7696:47: error: ‘PyInt_AsLong’ was not declared in
this scope; did you mean ‘PyLong_AsLong’?
7696 | return Glib::Variant<guint64>::create(PyInt_AsLong(input));
logtop-0.7-alt1.1
logtop_wrap.c: In function ‘_wrap_logtop_get’:
logtop_wrap.c:3649:36: error: implicit declaration of function ‘PyInt_FromLong’;
did you mean ‘PyLong_FromLong’? [-Wimplicit-function-declaration]
3649 | PyTuple_SetItem(log_line, 0, PyInt_FromLong(result->lines[i]->count));
| PyLong_FromLong
logtop_wrap.c:3649:36: error: passing argument 3 of ‘PyTuple_SetItem’ makes pointer
from integer without a cast [-Wint-conversion]
3649 | PyTuple_SetItem(log_line, 0, PyInt_FromLong(result->lines[i]->count));
--
33 | PyAPI_FUNC(int) PyTuple_SetItem(PyObject *, Py_ssize_t, PyObject *);
logtop_wrap.c:3651:36: error: implicit declaration of function ‘PyString_FromString’;
did you mean ‘PyLong_FromString’? [-Wimplicit-function-declaration]
3651 | PyTuple_SetItem(log_line, 2, PyString_FromString(result->lines[i]->string));
| PyLong_FromString
logtop_wrap.c:3651:36: error: passing argument 3 of ‘PyTuple_SetItem’ makes pointer
from integer without a cast [-Wint-conversion]
3651 | PyTuple_SetItem(log_line, 2, PyString_FromString(result->lines[i]->string));
--
33 | PyAPI_FUNC(int) PyTuple_SetItem(PyObject *, Py_ssize_t, PyObject *);
logtop_wrap.c:3658:9: error: assignment to ‘PyObject *’ {aka ‘struct _object *’}
from ‘int’ makes pointer from integer without a cast [-Wint-conversion]
3658 | tmp = PyInt_FromLong(result->count);
--
4157 | for (cast = head; (cast - head) <= head->value; cast++) {
error: Command '['i586-alt-linux-gcc', '-fno-strict-overflow', '-Wsign-compare',
'-DDYNAMIC_ANNOTATIONS_ENABLED=1', '-DNDEBUG', '-g', '-O3', '-Wall', '-pipe',
'-frecord-gcc-switches', '-Wall', '-g', '-O3', '-flto=auto', '-ffat-lto-objects',
'-march=i586', '-mtune=generic', '-pipe', '-frecord-gcc-switches', '-Wall', '-g',
'-O3', '-flto=auto', '-ffat-lto-objects', '-march=i586', '-mtune=generic',
'-fPIC', '-I/usr/include/python3.14', '-c', 'logtop_wrap.c', '-o',
'build/temp.linux-i686-cpython-314/logtop_wrap.o']' returned non-zero exit status 1.
make: *** [Makefile:57: python3-module] Error 1
mupdf-1.28.2-alt1
(+41.1s): -b: 3: __main__.py:2238:build: platform/python/mupdfcpp_swig.i.cpp: In
member function ‘virtual void SwigDirector_PdfProcessor2::op_SC_color(fz_context*,
int, float*)’:
(+41.1s): -b: 3: __main__.py:2238:build: platform/python/mupdfcpp_swig.i.cpp:31972:66:
error: ‘PyString_FromString’ was not declared in this scope; did you mean
‘PyLong_FromString’?
(+41.1s): -b: 3: __main__.py:2238:build: 31972 | PyObject* format_tb =
PyDict_GetItem(traceback_dict, PyString_FromString("format_tb"));
--
(+41.1s): -b: 3: __main__.py:2238:build: platform/python/mupdfcpp_swig.i.cpp: In
member function ‘virtual void SwigDirector_PdfProcessor2::op_sc_color(fz_context*,
int, float*)’:
(+41.1s): -b: 3: __main__.py:2238:build: platform/python/mupdfcpp_swig.i.cpp:32144:66:
error: ‘PyString_FromString’ was not declared in this scope; did you mean
‘PyLong_FromString’?
(+41.1s): -b: 3: __main__.py:2238:build: 32144 | PyObject* format_tb =
PyDict_GetItem(traceback_dict, PyString_FromString("format_tb"));
--
(+41.2s): -b: 3: __main__.py:2238:build: platform/python/mupdfcpp_swig.i.cpp: In member
function ‘virtual void SwigDirector_PdfProcessor2::op_G(fz_context*, float)’:
(+41.2s): -b: 3: __main__.py:2238:build: platform/python/mupdfcpp_swig.i.cpp:32314:66:
error: ‘PyString_FromString’ was not declared in this scope; did you mean
‘PyLong_FromString’?
(+41.2s): -b: 3: __main__.py:2238:build: 32314 | PyObject* format_tb =
PyDict_GetItem(traceback_dict, PyString_FromString("format_tb"));
--
(+41.2s): -b: 3: __main__.py:2238:build: platform/python/mupdfcpp_swig.i.cpp: In member
function ‘virtual void SwigDirector_PdfProcessor2::op_g(fz_context*, float)’:
(+41.2s): -b: 3: __main__.py:2238:build: platform/python/mupdfcpp_swig.i.cpp:32484:66:
error: ‘PyString_FromString’ was not declared in this scope; did you mean
‘PyLong_FromString’?
(+41.2s): -b: 3: __main__.py:2238:build: 32484 | PyObject* format_tb =
PyDict_GetItem(traceback_dict, PyString_FromString("format_tb"));
--
(+41.3s): -b: 3: __main__.py:2238:build: platform/python/mupdfcpp_swig.i.cpp: In member
function ‘virtual void SwigDirector_PdfProcessor2::op_RG(fz_context*, float, float,
float)’:
(+41.3s): -b: 3: __main__.py:2238:build: platform/python/mupdfcpp_swig.i.cpp:32658:66:
error: ‘PyString_FromString’ was not declared in this scope; did you mean
‘PyLong_FromString’?
(+41.3s): -b: 3: __main__.py:2238:build: 32658 | PyObject* format_tb =
PyDict_GetItem(traceback_dict, PyString_FromString("format_tb"));
--
(+41.4s): -b: 3: __main__.py:2238:build: platform/python/mupdfcpp_swig.i.cpp: In member
function ‘virtual void SwigDirector_PdfProcessor2::op_rg(fz_context*, float, float,
float)’:
(+41.4s): -b: 3: __main__.py:2238:build: platform/python/mupdfcpp_swig.i.cpp:32832:66:
error: ‘PyString_FromString’ was not declared in this scope; did you mean
‘PyLong_FromString’?
(+41.4s): -b: 3: __main__.py:2238:build: 32832 | PyObject* format_tb =
PyDict_GetItem(traceback_dict, PyString_FromString("format_tb"));
--
(+41.4s): -b: 3: __main__.py:2238:build: platform/python/mupdfcpp_swig.i.cpp: In member
function ‘virtual void SwigDirector_PdfProcessor2::op_K(fz_context*, float, float,
float, float)’:
(+41.4s): -b: 3: __main__.py:2238:build: platform/python/mupdfcpp_swig.i.cpp:33008:66:
error: ‘PyString_FromString’ was not declared in this scope; did you mean
‘PyLong_FromString’?
(+41.4s): -b: 3: __main__.py:2238:build: 33008 | PyObject* format_tb =
PyDict_GetItem(traceback_dict, PyString_FromString("format_tb"));
--
(+41.5s): -b: 3: __main__.py:2238:build: platform/python/mupdfcpp_swig.i.cpp: In member
function ‘virtual void SwigDirector_PdfProcessor2::op_k(fz_context*, float, float,
float, float)’:
(+41.5s): -b: 3: __main__.py:2238:build: platform/python/mupdfcpp_swig.i.cpp:33184:66:
error: ‘PyString_FromString’ was not declared in this scope; did you mean
‘PyLong_FromString’?
(+41.5s): -b: 3: __main__.py:2238:build: 33184 | PyObject* format_tb =
PyDict_GetItem(traceback_dict, PyString_FromString("format_tb"));
--
(+41.5s): -b: 3: __main__.py:2238:build: platform/python/mupdfcpp_swig.i.cpp: In member
function ‘virtual void SwigDirector_PdfProcessor2::op_BI(fz_context*, fz_image*,
const char*)’:
(+41.5s): -b: 3: __main__.py:2238:build: platform/python/mupdfcpp_swig.i.cpp:33356:66:
error: ‘PyString_FromString’ was not declared in this scope; did you mean
‘PyLong_FromString’?
(+41.5s): -b: 3: __main__.py:2238:build: 33356 | PyObject* format_tb =
PyDict_GetItem(traceback_dict, PyString_FromString("format_tb"));
--
(+41.6s): -b: 3: __main__.py:2238:build: platform/python/mupdfcpp_swig.i.cpp: In member
function ‘virtual void SwigDirector_PdfProcessor2::op_sh(fz_context*, const char*,
fz_shade*)’:
(+41.6s): -b: 3: __main__.py:2238:build: platform/python/mupdfcpp_swig.i.cpp:33528:66:
error: ‘PyString_FromString’ was not declared in this scope; did you mean
‘PyLong_FromString’?
(+41.6s): -b: 3: __main__.py:2238:build: 33528 | PyObject* format_tb =
PyDict_GetItem(traceback_dict, PyString_FromString("format_tb"));
mypaint-2.0.1-alt2.3
lib/tiledsurface.hpp: In function ‘PyObject* get_module(char*)’:
lib/tiledsurface.hpp:134:23: error: ‘PyString_FromString’ was not declared in this
scope; did you mean ‘PyLong_FromString’?
134 | PyObject *pName = PyString_FromString(name);
| PyLong_FromString
error: Command '['/usr/bin/i586-alt-linux-g++', '-pipe', '-frecord-gcc-switches',
'-Wall', '-g', '-O2', '-flto=auto', '-march=i586', '-mtune=generic', '-fPIC',
'-I/usr/lib/python3/site-packages/numpy/_core/include', '-I/usr/include/libmypaint',
'-I/usr/include/json-c', '-I/usr/include/glib-2.0', '-I/usr/lib/glib-2.0/include',
'-I/usr/include/pygobject-3.0', '-I/usr/include/gtk-3.0', '-I/usr/include/gio-unix-2.0',
'-I/usr/include/pango-1.0', '-I/usr/include/harfbuzz', '-I/usr/include/atk-1.0',
'-I/usr/include/cairo', '-I/usr/include/freetype2', '-I/usr/include/gdk-pixbuf-2.0',
'-I/usr/include/libpng16', '-I/usr/include/python3.14', '-c', 'lib/mypaintlib_wrap.cpp',
'-o', 'build/temp.linux-i686-cpython-314/lib/mypaintlib_wrap.o', '--std=c++11', '-Wall',
'-Wno-sign-compare', '-Wno-write-strings', '-D_POSIX_C_SOURCE=200809L', '-DNO_TESTS',
'-g', '-pthread', '-DMYPAINT_BRUSHES_DIR=\\"/usr/share/mypaint-data/2.0/brushes\\"',
'-fopenmp', '-O3']' returned non-zero exit status 1.
error: Bad exit status from /usr/src/tmp/rpmb-tmp.1hqkns (%build)
openipmi-2.0.37-alt1
OpenIPMI_wrap.c:18392:21: error: initialization of 'PyObject *' {aka 'struct _object *'}
from 'int' makes pointer from integer without a cast [-Wint-conversion]
18392 | PyObject *o = PyString_FromString(*arg5);
OpenIPMI_wrap.c: In function '_wrap_ipmi_fru_node_t_get_enum_val':
OpenIPMI_wrap.c:18531:19: error: initialization of 'PyObject *' {aka 'struct _object *'}
from 'int' makes pointer from integer without a cast [-Wint-conversion]
18531 | PyObject *o = PyInt_FromLong(*arg3);
OpenIPMI_wrap.c:18544:19: error: initialization of 'PyObject *' {aka 'struct _object *'}
from 'int' makes pointer from integer without a cast [-Wint-conversion]
18544 | PyObject *o = PyInt_FromLong(*arg4);
OpenIPMI_wrap.c:18558:21: error: initialization of 'PyObject *' {aka 'struct _object *'}
from 'int' makes pointer from integer without a cast [-Wint-conversion]
18558 | PyObject *o = PyString_FromString(*arg5);
OpenIPMI_wrap.c: In function '_wrap_ipmi_event_t_get_data':
OpenIPMI_wrap.c:20957:21: error: initialization of 'PyObject *' {aka 'struct _object *'}
from 'int' makes pointer from integer without a cast [-Wint-conversion]
20957 | PyObject *o = PyInt_FromLong((&result)->val[i]);
OpenIPMI_wrap.c: In function '_wrap_ipmi_sensor_t_threshold_event_supported':
OpenIPMI_wrap.c:22365:19: error: initialization of 'PyObject *' {aka 'struct _object *'}
from 'int' makes pointer from integer without a cast [-Wint-conversion]
22365 | PyObject *o = PyInt_FromLong(*arg3);
OpenIPMI_wrap.c: In function '_wrap_ipmi_sensor_t_threshold_settable':
OpenIPMI_wrap.c:22434:19: error: initialization of 'PyObject *' {aka 'struct _object *'}
from 'int' makes pointer from integer without a cast [-Wint-conversion]
22434 | PyObject *o = PyInt_FromLong(*arg3);
OpenIPMI_wrap.c: In function '_wrap_ipmi_sensor_t_threshold_readable':
OpenIPMI_wrap.c:22503:19: error: initialization of 'PyObject *' {aka 'struct _object *'}
from 'int' makes pointer from integer without a cast [-Wint-conversion]
22503 | PyObject *o = PyInt_FromLong(*arg3);
OpenIPMI_wrap.c: In function '_wrap_ipmi_sensor_t_threshold_reading_supported':
OpenIPMI_wrap.c:22572:19: error: initialization of 'PyObject *' {aka 'struct _object *'}
from 'int' makes pointer from integer without a cast [-Wint-conversion]
22572 | PyObject *o = PyInt_FromLong(*arg3);
OpenIPMI_wrap.c: In function '_wrap_ipmi_sensor_t_discrete_event_supported':
OpenIPMI_wrap.c:22641:19: error: initialization of 'PyObject *' {aka 'struct _object *'}
from 'int' makes pointer from integer without a cast [-Wint-conversion]
22641 | PyObject *o = PyInt_FromLong(*arg3);
partio-1.20.0-alt1
/usr/src/RPM/BUILD/partio-1.20.0/i586-alt-linux/src/py/CMakeFiles/partio_mod.dir/partioPYTHON_wrap.cxx:
In function 'PyObject* ParticlesData_findPoints(Partio::ParticlesData*, fixedFloatArray,
fixedFloatArray)':
/usr/src/RPM/BUILD/partio-1.20.0/i586-alt-linux/src/py/CMakeFiles/partio_mod.dir/partioPYTHON_wrap.cxx:4192:35:
error: 'PyInt_FromLong' was not declared in this scope; did you mean 'PyLong_FromLong'?
4192 | PyList_SetItem(list,i,PyInt_FromLong(points[i])); // tuple reference
is stolen, so no decref needed
--
/usr/src/RPM/BUILD/partio-1.20.0/i586-alt-linux/src/py/CMakeFiles/partio_mod.dir/partioPYTHON_wrap.cxx:
In function 'PyObject* ParticlesData_get(Partio::ParticlesData*, const
Partio::ParticleAttribute&, Partio::ParticleIndex)':
/usr/src/RPM/BUILD/partio-1.20.0/i586-alt-linux/src/py/CMakeFiles/partio_mod.dir/partioPYTHON_wrap.cxx:4200:67:
error: 'PyInt_FromLong' was not declared in this scope; did you mean 'PyLong_FromLong'?
4200 | for(int k=0;k<attr.count;k++)
PyTuple_SetItem(tuple,k,PyInt_FromLong(p[k]));
--
/usr/src/RPM/BUILD/partio-1.20.0/i586-alt-linux/src/py/CMakeFiles/partio_mod.dir/partioPYTHON_wrap.cxx:
In function 'PyObject* ParticlesData_getFixed(Partio::ParticlesData*, const
Partio::FixedAttribute&)':
/usr/src/RPM/BUILD/partio-1.20.0/i586-alt-linux/src/py/CMakeFiles/partio_mod.dir/partioPYTHON_wrap.cxx:4215:67:
error: 'PyInt_FromLong' was not declared in this scope; did you mean 'PyLong_FromLong'?
4215 | for(int k=0;k<attr.count;k++)
PyTuple_SetItem(tuple,k,PyInt_FromLong(p[k]));
--
/usr/src/RPM/BUILD/partio-1.20.0/i586-alt-linux/src/py/CMakeFiles/partio_mod.dir/partioPYTHON_wrap.cxx:
In function 'PyObject* ParticlesData_indexedStrs(const Partio::ParticlesData*, const
Partio::ParticleAttribute&)':
/usr/src/RPM/BUILD/partio-1.20.0/i586-alt-linux/src/py/CMakeFiles/partio_mod.dir/partioPYTHON_wrap.cxx:4229:68:
error: 'PyString_FromString' was not declared in this scope; did you mean
'PyLong_FromString'?
4229 | for(size_t k=0;k<indexes.size();k++)
PyList_SetItem(list,k,PyString_FromString(indexes[k].c_str()));
--
/usr/src/RPM/BUILD/partio-1.20.0/i586-alt-linux/src/py/CMakeFiles/partio_mod.dir/partioPYTHON_wrap.cxx:
In function 'PyObject* ParticlesData_fixedIndexedStrs(const Partio::ParticlesData*,
const Partio::FixedAttribute&)':
/usr/src/RPM/BUILD/partio-1.20.0/i586-alt-linux/src/py/CMakeFiles/partio_mod.dir/partioPYTHON_wrap.cxx:4235:68:
error: 'PyString_FromString' was not declared in this scope; did you mean
'PyLong_FromString'?
4235 | for(size_t k=0;k<indexes.size();k++)
PyList_SetItem(list,k,PyString_FromString(indexes[k].c_str()));
--
/usr/src/RPM/BUILD/partio-1.20.0/i586-alt-linux/src/py/CMakeFiles/partio_mod.dir/partioPYTHON_wrap.cxx:
In function 'PyObject* ParticlesDataMutable_set(Partio::ParticlesDataMutable*, const
Partio::ParticleAttribute&, uint64_t, PyObject*)':
/usr/src/RPM/BUILD/partio-1.20.0/i586-alt-linux/src/py/CMakeFiles/partio_mod.dir/partioPYTHON_wrap.cxx:4254:24:
error: 'PyInt_Check' was not declared in this scope; did you mean 'PySet_Check'?
4254 | if(PyInt_Check(o)){
| PySet_Check
/usr/src/RPM/BUILD/partio-1.20.0/i586-alt-linux/src/py/CMakeFiles/partio_mod.dir/partioPYTHON_wrap.cxx:4255:30:
error: 'PyInt_AsLong' was not declared in this scope; did you mean 'PyLong_AsLong'?
4255 | p[i]=PyInt_AsLong(o);
| PyLong_AsLong
/usr/src/RPM/BUILD/partio-1.20.0/i586-alt-linux/src/py/CMakeFiles/partio_mod.dir/partioPYTHON_wrap.cxx:4272:30:
error: 'PyInt_Check' was not declared in this scope; did you mean 'PySet_Check'?
4272 | }else if(PyInt_Check(o)){
| PySet_Check
/usr/src/RPM/BUILD/partio-1.20.0/i586-alt-linux/src/py/CMakeFiles/partio_mod.dir/partioPYTHON_wrap.cxx:4273:37:
error: 'PyInt_AsLong' was not declared in this scope; did you mean 'PyLong_AsLong'?
4273 | p[i]=(float)PyInt_AsLong(o);
--
/usr/src/RPM/BUILD/partio-1.20.0/i586-alt-linux/src/py/CMakeFiles/partio_mod.dir/partioPYTHON_wrap.cxx:
In function 'PyObject* ParticlesDataMutable_setFixed(Partio::ParticlesDataMutable*,
const Partio::FixedAttribute&, PyObject*)':
/usr/src/RPM/BUILD/partio-1.20.0/i586-alt-linux/src/py/CMakeFiles/partio_mod.dir/partioPYTHON_wrap.cxx:4305:20:
error: 'PyInt_Check' was not declared in this scope; did you mean 'PySet_Check'?
4305 | if(PyInt_Check(o)){
perl-Server-Starter-0.35-alt1.1
starting new worker 4071977
hasher-privd: parent: handle_io: idle time limit (3600 seconds) exceeded
phosphor-certificate-manager-0.0.1-alt2.gitefe7c29.1
[18/20] Linking target test/test-certs-manager
FAILED: [code=1] test/test-certs-manager
c++ -o test/test-certs-manager test/test-certs-manager.p/certs_manager_test.cpp.o
-Wl,--fatal-warnings -Wl,--as-needed -Wl,--no-undefined -pipe -frecord-gcc-switches
-Wall -g -O2 -flto=auto -march=i586 -mtune=generic -Wl,--start-group
libphosphor-certificate-manager.a /usr/lib/libgtest_main.so /usr/lib/libgtest.so
/usr/lib/libgmock.so /usr/lib/libssl.so /usr/lib/libcrypto.so /usr/lib/libphosphor_dbus.so
/usr/lib/libphosphor_logging.so /usr/lib/libsdbusplus.so /usr/lib/libsystemd.so
/usr/lib/libsdeventplus.so /usr/lib/libstdplus.so /usr/lib/libfmt.so -Wl,--end-group
--
/usr/src/RPM/BUILD/phosphor-certificate-manager-0.0.1/i586-alt-linux/../certificate.cpp:141:(.text+0x65d6):
warning: the use of `tempnam' is dangerous, better use `mkstemp'
collect2: error: ld returned 1 exit status
[19/20] Linking target test/argument_test
[20/20] Linking target phosphor-certificate-manager
FAILED: [code=1] phosphor-certificate-manager
c++ -o phosphor-certificate-manager phosphor-certificate-manager.p/mainapp.cpp.o
-Wl,--fatal-warnings -Wl,--as-needed -Wl,--no-undefined -pipe -frecord-gcc-switches
-Wall -g -O2 -flto=auto -march=i586 -mtune=generic -Wl,--start-group
libphosphor-certificate-manager.a /usr/lib/libssl.so /usr/lib/libcrypto.so
/usr/lib/libphosphor_dbus.so /usr/lib/libphosphor_logging.so /usr/lib/libsdbusplus.so
/usr/lib/libsystemd.so /usr/lib/libsdeventplus.so /usr/lib/libstdplus.so /usr/lib/libfmt.so
-Wl,--end-group
--
/usr/src/RPM/BUILD/phosphor-certificate-manager-0.0.1/i586-alt-linux/../certificate.cpp:141:(.text+0x92f7):
warning: the use of `tempnam' is dangerous, better use `mkstemp'
collect2: error: ld returned 1 exit status
ninja: build stopped: subcommand failed.
postgresql18-18.6-alt1
1..231
# 18 of 231 tests failed.
# The differences that caused some tests to fail can be viewed in the file
"/usr/src/RPM/BUILD/postgresql18-18.6/src/test/regress/regression.diffs".
publican-4.3.2-alt5_22
po/fi.po -> /usr/src/RPM/BUILD/Publican-v4.3.2/blib/locale/fi/LC_MESSAGES/publican.mo
++ pwd
+ dir=/usr/src/RPM/BUILD/Publican-v4.3.2
+ cd Users_Guide
+ XML_CATALOG_FILES=/usr/src/RPM/BUILD/Publican-v4.3.2/catalog
+ /usr/bin/perl -CDAS -I /usr/src/RPM/BUILD/Publican-v4.3.2/blib/lib
/usr/src/RPM/BUILD/Publican-v4.3.2/blib/script/publican build --formats=html-desktop
--publish --langs=en-US --common_config=/usr/src/RPM/BUILD/Publican-v4.3.2/blib/datadir
--common_content=/usr/src/RPM/BUILD/Publican-v4.3.2/blib/datadir/Common_Content --nocolours
/usr/src/tmp/rpmb-tmp.tZmqUI: line 141: 2325741 Segmentation fault
XML_CATALOG_FILES=$dir/catalog /usr/bin/perl -CDAS -I $dir/blib/lib
$dir/blib/script/publican build --formats=html-desktop --publish --langs=en-US
--common_config="$dir/blib/datadir" --common_content="$dir/blib/datadir/Common_Content"
--nocolours
error: Bad exit status from /usr/src/tmp/rpmb-tmp.tZmqUI (%build)
RPM build errors:
Bad exit status from /usr/src/tmp/rpmb-tmp.tZmqUI (%build)
python3-module-cyclonedx-bom-7.3.0-alt1
raise ValueError(err_msg) from None
ValueError: metadata: invalid core metadata: 'cyclonedx-python-lib[validation]
(>=8.0,<9.0 || >=9.0,<10.0 || >=10,<11 || >=11,<12)' is invalid for 'requires-dist'
+ rc=1
python3-module-django-modern-rest-0.15.0-alt1
> assert response.status_code == HTTPStatus.OK, response.content
E AssertionError: b'{"detail":[{"msg":"Not authenticated","type":"security"}]}'
E assert 401 == <HTTPStatus.OK: 200>
--
> assert response.status_code == HTTPStatus.OK, response.content
E AssertionError: b'{"detail":[{"msg":"Not authenticated","type":"security"}]}'
E assert 401 == <HTTPStatus.OK: 200>
--
> assert response.status_code == HTTPStatus.OK, response.content
E AssertionError: b'{"detail":[{"msg":"Not authenticated","type":"security"}]}'
E assert 401 == <HTTPStatus.OK: 200>
--
> assert response.status_code == HTTPStatus.OK, response.content
E AssertionError: b'{"detail":[{"msg":"Not authenticated","type":"security"}]}'
E assert 401 == <HTTPStatus.OK: 200>
--
SKIPPED [2] tests/test_unit/test_security/test_jwt/test_jwt_json_backend.py:229:
msgspec is not installed
FAILED
tests/test_unit/test_security/test_allauth/test_allauth_session_auth.py::test_sync_session_token_custom_header
FAILED
tests/test_unit/test_security/test_allauth/test_allauth_session_auth.py::test_sync_session_token_auth
FAILED
tests/test_unit/test_security/test_allauth/test_allauth_session_auth.py::test_session_token_auth_falls_through
FAILED
tests/test_unit/test_security/test_allauth/test_allauth_session_auth.py::test_async_session_token_auth
============ 4 failed, 1911 passed, 21 skipped in 66.92s (0:01:06) =============
INFO : Command's result: FAILURE
INFO : Command's error: Command '['python3', '-m', 'pytest', '-o',
'addopts=-vra', '-o', 'filterwarnings=ignore::DeprecationWarning',
'--ignore=tests/test_unit/test_metadata/test_unsupported_serializer.py',
'--ignore=tests/test_unit/test_negotiation/test_breaking_contract.py',
'--ignore=tests/test_unit/test_negotiation/test_global_configuration.py',
'--ignore=tests/test_unit/test_openapi/test_schema_snapshots.py',
'--ignore=tests/test_unit/test_plugins/test_pydantic/test_pydantic_fast.py',
'--ignore=tests/test_unit/test_routing/test_not_found_handler.py',
'--ignore=tests/test_unit/test_routing/test_server_error_handler.py',
'--ignore=tests/test_unit/test_streaming/test_sse/test_sse_settings.py',
'--ignore=tests/test_unit/test_throttling/test_throttling_and_parsing.py',
'tests/test_unit/']' returned non-zero exit status 1.
error: Bad exit status from /usr/src/tmp/rpmb-tmp.UUSv85 (%check)
python3-module-flask-sqlalchemy-3.1.1-alt3
"'@registry.mapped_as_dataclass'"
E sqlalchemy.exc.InvalidRequestError: Class <class 'types.FlaskSQLAlchemyBase'>
is already a dataclass; ensure that base classes / decorator styles of establishing
dataclasses are not being mixed. This can happen if a class that inherits from
'MappedAsDataclass', even indirectly, is been mapped with '@registry.mapped_as_dataclass'
/usr/lib/python3/site-packages/sqlalchemy/orm/decl_base.py:486: InvalidRequestError
=========================== short test summary info ============================
FAILED tests/test_engine.py::test_engine_per_bind[model_class2] - sqlalchemy....
FAILED tests/test_engine.py::test_engine_per_bind[model_class4] - sqlalchemy....
FAILED tests/test_engine.py::test_config_engine_options[model_class2] - sqlal...
FAILED tests/test_engine.py::test_config_engine_options[model_class4] - sqlal...
FAILED tests/test_engine.py::test_init_engine_options[model_class2] - sqlalch...
FAILED tests/test_engine.py::test_init_engine_options[model_class4] - sqlalch...
FAILED tests/test_engine.py::test_config_echo[model_class2] - sqlalchemy.exc....
FAILED tests/test_engine.py::test_config_echo[model_class4] - sqlalchemy.exc....
FAILED tests/test_engine.py::test_url_type[model_class2-sqlite://] - sqlalche...
FAILED tests/test_engine.py::test_url_type[model_class2-value1] - sqlalchemy....
python3-module-m2crypto-0.47.0-alt1
src/SWIG/_m2crypto_wrap.c: In function ‘x509_store_verify_callback’:
src/SWIG/_m2crypto_wrap.c:4906:21: error: implicit declaration of function
‘PyInt_AsLong’; did you mean ‘PyLong_AsLong’? [-Wimplicit-function-declaration]
4906 | cret = (int)PyInt_AsLong(ret);
--
src/SWIG/_m2crypto_wrap.c: In function ‘rsa_get_ex_data’:
src/SWIG/_m2crypto_wrap.c:7602:12: error: implicit declaration of function
‘PyInt_FromLong’; did you mean ‘PyLong_FromLong’? [-Wimplicit-function-declaration]
7602 | return PyInt_FromLong(*data);
| PyLong_FromLong
src/SWIG/_m2crypto_wrap.c:7602:12: error: returning ‘int’ from a function with
return type ‘PyObject *’ {aka ‘struct _object *’} makes pointer from integer
without a cast [-Wint-conversion]
7602 | return PyInt_FromLong(*data);
src/SWIG/_m2crypto_wrap.c: In function ‘ec_get_builtin_curves’:
src/SWIG/_m2crypto_wrap.c:9853:26: error: implicit declaration
of function ‘PyString_FromString’; did you mean
‘PyLong_FromString’? [-Wimplicit-function-declaration]
9853 | PyString_FromString(sname));
| PyLong_FromString
src/SWIG/_m2crypto_wrap.c:9853:26: error: passing argument 3 of ‘PyDict_SetItemString’
makes pointer from integer without a cast [-Wint-conversion]
9853 | PyString_FromString(sname));
--
58 | PyAPI_FUNC(int) PyDict_SetItemString(PyObject *dp, const char *key, PyObject *item);
src/SWIG/_m2crypto_wrap.c:9855:26: error: passing argument 3 of ‘PyDict_SetItemString’
makes pointer from integer without a cast [-Wint-conversion]
9855 | PyString_FromString(comment));
--
34675 | for (cast = head; (cast - head) <= head->value; cast++) {
error: Command '['i586-alt-linux-gcc', '-fno-strict-overflow', '-Wsign-compare',
'-DDYNAMIC_ANNOTATIONS_ENABLED=1', '-DNDEBUG', '-g', '-O3', '-Wall', '-pipe',
'-frecord-gcc-switches', '-Wall', '-g', '-O3', '-flto=auto', '-ffat-lto-objects',
'-march=i586', '-mtune=generic', '-pipe', '-frecord-gcc-switches', '-Wall', '-g',
'-O3', '-flto=auto', '-ffat-lto-objects', '-march=i586', '-mtune=generic',
'-pipe', '-frecord-gcc-switches', '-Wall', '-g', '-O2', '-flto=auto',
'-march=i586', '-mtune=generic', '-fPIC', '-I/usr/include/python3.14',
'-I/usr/src/RPM/BUILD/python3-module-m2crypto-0.47.0/src/SWIG',
'-c', 'src/SWIG/_m2crypto_wrap.c', '-o',
'build/temp.linux-i686-cpython-314/src/SWIG/_m2crypto_wrap.o', '-DTHREADING',
'-Wno-deprecated-declarations']' returned non-zero exit status 1.
error: Bad exit status from /usr/src/tmp/rpmb-tmp.yBPW4G (%build)
python3-module-oslo.db-17.4.0-alt1
raise mismatch_error
testtools.matchers._impl.MismatchError: !=:
reference = [call.postgresql('postgresql+pyodbc://', 1),
python3-module-oslo.messaging-1:17.1.0-alt1
- Worker 249 (7 tests) => 0:00:05.219834
- Worker 250 (7 tests) => 0:00:00.922688
- Worker 251 (7 tests) => 0:00:00.645974
- Worker 252 (7 tests) => 0:00:01.046139
- Worker 253 (7 tests) => 0:00:00.020073
- Worker 254 (7 tests) => 0:00:01.370579
- Worker 255 (7 tests) => 0:00:00.290416
error: Bad exit status from /usr/src/tmp/rpmb-tmp.vtEyVa (%check)
RPM build errors:
Bad exit status from /usr/src/tmp/rpmb-tmp.vtEyVa (%check)
python3-module-pivy-2:0.6.11-alt1
pivy/coin_wrap.cpp:247336:38: error: ‘PyInt_FromLong’ was not declared in this scope;
did you mean ‘PyLong_FromLong’?
247336 | PyList_SetItem(resultobj, i, PyInt_FromLong((long)result[i]));
--
pivy/coin_wrap.cpp: In function ‘PyObject* _wrap_SoMFInt32_getValues__SWIG_1(PyObject*,
Py_ssize_t, PyObject**)’:
pivy/coin_wrap.cpp:247373:38: error: ‘PyInt_FromLong’ was not declared in this scope;
did you mean ‘PyLong_FromLong’?
247373 | PyList_SetItem(resultobj, i, PyInt_FromLong((long)result[i]));
--
pivy/coin_wrap.cpp: In function ‘PyObject* _wrap_SoMFShort_getValues__SWIG_0(PyObject*,
Py_ssize_t, PyObject**)’:
pivy/coin_wrap.cpp:251663:38: error: ‘PyInt_FromLong’ was not declared in this scope;
did you mean ‘PyLong_FromLong’?
251663 | PyList_SetItem(resultobj, i, PyInt_FromLong((long)result[i]));
--
pivy/coin_wrap.cpp: In function ‘PyObject* _wrap_SoMFShort_getValues__SWIG_1(PyObject*,
Py_ssize_t, PyObject**)’:
pivy/coin_wrap.cpp:251700:38: error: ‘PyInt_FromLong’ was not declared in this scope;
did you mean ‘PyLong_FromLong’?
251700 | PyList_SetItem(resultobj, i, PyInt_FromLong((long)result[i]));
--
pivy/coin_wrap.cpp: In function ‘PyObject* _wrap_SoMFUInt32_getValues__SWIG_0(PyObject*,
Py_ssize_t, PyObject**)’:
pivy/coin_wrap.cpp:253567:38: error: ‘PyInt_FromLong’ was not declared in this scope;
did you mean ‘PyLong_FromLong’?
253567 | PyList_SetItem(resultobj, i, PyInt_FromLong((long)result[i]));
--
pivy/coin_wrap.cpp: In function ‘PyObject* _wrap_SoMFUInt32_getValues__SWIG_1(PyObject*,
Py_ssize_t, PyObject**)’:
pivy/coin_wrap.cpp:253604:38: error: ‘PyInt_FromLong’ was not declared in this scope;
did you mean ‘PyLong_FromLong’?
253604 | PyList_SetItem(resultobj, i, PyInt_FromLong((long)result[i]));
--
pivy/coin_wrap.cpp: In function ‘PyObject* _wrap_SoMFUShort_getValues__SWIG_0(PyObject*,
Py_ssize_t, PyObject**)’:
pivy/coin_wrap.cpp:254529:38: error: ‘PyInt_FromLong’ was not declared in this scope;
did you mean ‘PyLong_FromLong’?
254529 | PyList_SetItem(resultobj, i, PyInt_FromLong((long)result[i]));
--
pivy/coin_wrap.cpp: In function ‘PyObject* _wrap_SoMFUShort_getValues__SWIG_1(PyObject*,
Py_ssize_t, PyObject**)’:
pivy/coin_wrap.cpp:254566:38: error: ‘PyInt_FromLong’ was not declared in this scope;
did you mean ‘PyLong_FromLong’?
254566 | PyList_SetItem(resultobj, i, PyInt_FromLong((long)result[i]));
--
pivy/coin_wrap.cpp: In function ‘PyObject* _wrap_new_SbImage__SWIG_1(PyObject*,
Py_ssize_t, PyObject**)’:
pivy/coin_wrap.cpp:353888:12: error: ‘PyInt_AsLong’ was not declared in this scope;
did you mean ‘PyLong_AsLong’?
353888 | arg3 = PyInt_AsLong(nc);
--
pivy/coin_wrap.cpp: In function ‘PyObject* _wrap_new_SbImage__SWIG_2(PyObject*,
Py_ssize_t, PyObject**)’:
pivy/coin_wrap.cpp:353933:12: error: ‘PyInt_AsLong’ was not declared in this scope;
did you mean ‘PyLong_AsLong’?
353933 | arg3 = PyInt_AsLong(nc);
python3-module-pyfltk-1.3.8-alt1.2
| PySet_Check
./fltk/fltk_wrap.cpp:93340:27: error: ‘PyInt_AsLong’ was not declared in this scope;
did you mean ‘PyLong_AsLong’?
93340 | arg4[i] = (char)PyInt_AsLong(o);
--
./fltk/fltk_wrap.cpp: In function ‘PyObject* _wrap_Fl_Gl_Window_valid__SWIG_0(PyObject*,
Py_ssize_t, PyObject**)’:
./fltk/fltk_wrap.cpp:95204:17: error: ‘PyInt_FromLong’ was not declared in this
scope; did you mean ‘PyLong_FromLong’?
95204 | resultobj = PyInt_FromLong( (long)result);
--
./fltk/fltk_wrap.cpp: In function ‘PyObject*
_wrap_Fl_Gl_Window_context_valid__SWIG_0(PyObject*, Py_ssize_t, PyObject**)’:
./fltk/fltk_wrap.cpp:95329:17: error: ‘PyInt_FromLong’ was not declared in this
scope; did you mean ‘PyLong_FromLong’?
95329 | resultobj = PyInt_FromLong( (long)result);
--
./fltk/fltk_wrap.cpp: In function ‘PyObject* _wrap_gl_draw_image(PyObject*,
PyObject*)’:
./fltk/fltk_wrap.cpp:97522:15: error: ‘PyInt_Check’ was not declared in this scope;
did you mean ‘PySet_Check’?
97522 | if (PyInt_Check(o))
| PySet_Check
./fltk/fltk_wrap.cpp:97523:27: error: ‘PyInt_AsLong’ was not declared in this scope;
did you mean ‘PyLong_AsLong’?
97523 | arg1[i] = (char)PyInt_AsLong(o);
--
./fltk/fltk_wrap.cpp: In function ‘PyObject* _wrap_new_Fl_JPEG_Image__SWIG_1(PyObject*,
Py_ssize_t, PyObject**)’:
./fltk/fltk_wrap.cpp:104453:15: error: ‘PyInt_Check’ was not declared in this scope;
did you mean ‘PySet_Check’?
104453 | if (PyInt_Check(o))
| PySet_Check
./fltk/fltk_wrap.cpp:104454:28: error: ‘PyInt_AsLong’ was not declared in this scope;
did you mean ‘PyLong_AsLong’?
104454 | arg3[i] = (uchar)PyInt_AsLong(o);
--
./fltk/fltk_wrap.cpp: In function ‘PyObject* _wrap_new_Fl_PNG_Image__SWIG_1(PyObject*,
Py_ssize_t, PyObject**)’:
./fltk/fltk_wrap.cpp:112032:15: error: ‘PyInt_Check’ was not declared in this scope;
did you mean ‘PySet_Check’?
112032 | if (PyInt_Check(o))
| PySet_Check
./fltk/fltk_wrap.cpp:112033:28: error: ‘PyInt_AsLong’ was not declared in this scope;
did you mean ‘PyLong_AsLong’?
112033 | arg3[i] = (uchar)PyInt_AsLong(o);
--
./fltk/fltk_wrap.cpp: In function ‘PyObject* _wrap_Fl_Preferences_groupExists(PyObject*,
PyObject*)’:
./fltk/fltk_wrap.cpp:113650:17: error: ‘PyInt_FromLong’ was not declared in this
scope; did you mean ‘PyLong_FromLong’?
113650 | resultobj = PyInt_FromLong( (long)result);
python3-module-pykcs11-1.5.18-alt1
src/pykcs11_wrap.cpp: In function ‘PyObject* _wrap_CPKCS11Lib_C_EncryptFinal(PyObject*,
PyObject*)’:
src/pykcs11_wrap.cpp:16756:17: error: ‘PyInt_FromLong’ was not declared in this
scope; did you mean ‘PyLong_FromLong’?
16756 | resultobj = PyInt_FromLong((long)result);
--
src/pykcs11_wrap.cpp: In function ‘PyObject* _wrap_CPKCS11Lib_C_DecryptInit(PyObject*,
PyObject*)’:
src/pykcs11_wrap.cpp:16821:17: error: ‘PyInt_FromLong’ was not declared in this
scope; did you mean ‘PyLong_FromLong’?
16821 | resultobj = PyInt_FromLong((long)result);
--
src/pykcs11_wrap.cpp: In function ‘PyObject* _wrap_CPKCS11Lib_C_Decrypt(PyObject*,
PyObject*)’:
src/pykcs11_wrap.cpp:16883:17: error: ‘PyInt_FromLong’ was not declared in this
scope; did you mean ‘PyLong_FromLong’?
16883 | resultobj = PyInt_FromLong((long)result);
--
src/pykcs11_wrap.cpp: In function ‘PyObject* _wrap_CPKCS11Lib_C_DecryptUpdate(PyObject*,
PyObject*)’:
src/pykcs11_wrap.cpp:16945:17: error: ‘PyInt_FromLong’ was not declared in this
scope; did you mean ‘PyLong_FromLong’?
16945 | resultobj = PyInt_FromLong((long)result);
--
src/pykcs11_wrap.cpp: In function ‘PyObject* _wrap_CPKCS11Lib_C_DecryptFinal(PyObject*,
PyObject*)’:
src/pykcs11_wrap.cpp:16997:17: error: ‘PyInt_FromLong’ was not declared in this
scope; did you mean ‘PyLong_FromLong’?
16997 | resultobj = PyInt_FromLong((long)result);
--
src/pykcs11_wrap.cpp: In function ‘PyObject* _wrap_CPKCS11Lib_C_DigestInit(PyObject*,
PyObject*)’:
src/pykcs11_wrap.cpp:17046:17: error: ‘PyInt_FromLong’ was not declared in this
scope; did you mean ‘PyLong_FromLong’?
17046 | resultobj = PyInt_FromLong((long)result);
--
src/pykcs11_wrap.cpp: In function ‘PyObject* _wrap_CPKCS11Lib_C_Digest(PyObject*,
PyObject*)’:
src/pykcs11_wrap.cpp:17108:17: error: ‘PyInt_FromLong’ was not declared in this
scope; did you mean ‘PyLong_FromLong’?
17108 | resultobj = PyInt_FromLong((long)result);
--
src/pykcs11_wrap.cpp: In function ‘PyObject* _wrap_CPKCS11Lib_C_DigestUpdate(PyObject*,
PyObject*)’:
src/pykcs11_wrap.cpp:17159:17: error: ‘PyInt_FromLong’ was not declared in this
scope; did you mean ‘PyLong_FromLong’?
17159 | resultobj = PyInt_FromLong((long)result);
--
src/pykcs11_wrap.cpp: In function ‘PyObject* _wrap_CPKCS11Lib_C_DigestKey(PyObject*,
PyObject*)’:
src/pykcs11_wrap.cpp:17216:17: error: ‘PyInt_FromLong’ was not declared in this
scope; did you mean ‘PyLong_FromLong’?
17216 | resultobj = PyInt_FromLong((long)result);
--
src/pykcs11_wrap.cpp: In function ‘PyObject* _wrap_CPKCS11Lib_C_DigestFinal(PyObject*,
PyObject*)’:
src/pykcs11_wrap.cpp:17268:17: error: ‘PyInt_FromLong’ was not declared in this
scope; did you mean ‘PyLong_FromLong’?
17268 | resultobj = PyInt_FromLong((long)result);
python3-module-pymupdf-1.28.2-alt1
[+0.6s] ../../../../lib/python3/site-packages/pipcl/__init__.py:2106: build_extension():
/usr/src/RPM/BUILD/python3-module-pymupdf-1.28.2/src/build/extra.i.cpp: In function
‘void messagev(const char*, va_list)’:
[+0.6s] ../../../../lib/python3/site-packages/pipcl/__init__.py:2106: build_extension():
/usr/src/RPM/BUILD/python3-module-pymupdf-1.28.2/src/build/extra.i.cpp:3529:25:
error: ‘PyString_FromString’ was not declared in this scope; did you mean
‘PyLong_FromString’?
[+0.6s] ../../../../lib/python3/site-packages/pipcl/__init__.py:2106: build_extension():
3529 | PyObject* text_py = PyString_FromString(text);
--
raise subprocess.CalledProcessError(e, command2, capture_text if capture else None)
subprocess.CalledProcessError: Command 'c++ \
-O2 -DNDEBUG \
--
raise RuntimeError(err_msg) from None
RuntimeError: build_wheel failed
error: Bad exit status from /usr/src/tmp/rpmb-tmp.TvQjPG (%build)
python3-module-pytest-xprocess-1.0.2-alt1.1
tests/test_interruption_clean_up.py::test_interruption_cleanup PASSED [ 15%]
tests/test_interruption_clean_up.py::test_interruption_does_not_cleanup FAILED [ 17%]
tests/test_process_initialization.py::test_servers_start[s1] PASSED [ 19%]
--
pidfd = os.pidfd_open(pid, 0)
OSError: [Errno 22] Invalid argument
=========================== short test summary info ============================
FAILED tests/test_interruption_clean_up.py::test_interruption_does_not_cleanup
======================== 1 failed, 50 passed in 34.51s =========================
--
INFO : Command's result: FAILURE
INFO : Command's error: Command '['pytest', '-vra']' returned non-zero exit status 1.
error: Bad exit status from /usr/src/tmp/rpmb-tmp.nC6Owl (%check)
python3-module-social-core-5.1.0-alt1
raise DecodeError(f"Invalid {name} padding")
jwt.exceptions.DecodeError: Invalid payload padding
The above exception was the direct cause of the following exception:
social_core.exceptions.AuthTokenError: Token error: Invalid payload padding
During handling of the above exception, another exception occurred:
--
> self.authtoken_raised(
"Token error: Signature verification failed", tamper_message=True
social_core/tests/backends/open_id_connect.py:218:
--
with self.assertRaisesRegex(AuthTokenError, expected_message):
E AssertionError: "Token error: Signature verification failed" does not match "Token
error: Invalid payload padding"
________________ VaultOpenIdConnectTest.test_invalid_signature _________________
--
> raise DecodeError(f"Invalid {name} padding")
E jwt.exceptions.DecodeError: Invalid payload padding
/usr/lib/python3/site-packages/jwt/api_jws.py:344: DecodeError
--
raise DecodeError(f"Invalid {name} padding")
jwt.exceptions.DecodeError: Invalid payload padding
The above exception was the direct cause of the following exception:
social_core.exceptions.AuthTokenError: Token error: Invalid payload padding
During handling of the above exception, another exception occurred:
--
> self.authtoken_raised(
"Token error: Signature verification failed", tamper_message=True
social_core/tests/backends/open_id_connect.py:218:
--
with self.assertRaisesRegex(AuthTokenError, expected_message):
E AssertionError: "Token error: Signature verification failed" does not match "Token
error: Invalid payload padding"
=============================== warnings summary ===============================
--
=========================== short test summary info ============================
FAILED
social_core/tests/backends/test_auth0_openidconnect.py::Auth0OpenIdConnectTest::test_invalid_signature
FAILED social_core/tests/backends/test_cas.py::CASOpenIdConnectTest::test_invalid_signature
qpid-proton-0.36.0-alt3
/usr/src/RPM/BUILD/qpid-proton-0.36.0/i586-alt-linux/python/CMakeFiles/_cproton.dir/cprotonPYTHON_wrap.c:
In function 'pn_pytracer':
/usr/src/RPM/BUILD/qpid-proton-0.36.0/i586-alt-linux/python/CMakeFiles/_cproton.dir/cprotonPYTHON_wrap.c:3846:23:
error: implicit declaration of function 'PyString_FromString'; did you mean
'PyLong_FromString'? [-Wimplicit-function-declaration]
3846 | PyObject *pymsg = PyString_FromString(message);
| PyLong_FromString
/usr/src/RPM/BUILD/qpid-proton-0.36.0/i586-alt-linux/python/CMakeFiles/_cproton.dir/cprotonPYTHON_wrap.c:3846:23:
error: initialization of 'PyObject *' {aka 'struct _object *'} from 'int' makes pointer
from integer without a cast [-Wint-conversion]
gmake[2]: *** [python/CMakeFiles/_cproton.dir/build.make:79:
python/CMakeFiles/_cproton.dir/CMakeFiles/_cproton.dir/cprotonPYTHON_wrap.c.o] Error 1
--
cproton_wrap.c: In function ‘pn_pytracer’:
cproton_wrap.c:3846:23: error: implicit declaration of function ‘PyString_FromString’;
did you mean ‘PyLong_FromString’? [-Wimplicit-function-declaration]
3846 | PyObject *pymsg = PyString_FromString(message);
| PyLong_FromString
cproton_wrap.c:3846:23: error: initialization of ‘PyObject *’ {aka ‘struct _object
*’} from ‘int’ makes pointer from integer without a cast [-Wint-conversion]
cproton_wrap.c: In function ‘SWIG_PropagateClientData’:
--
6625 | static int check_state(int x) {
error: Command '['i586-alt-linux-gcc', '-fno-strict-overflow',
'-Wsign-compare', '-DDYNAMIC_ANNOTATIONS_ENABLED=1', '-DNDEBUG', '-g',
'-O3', '-Wall', '-pipe', '-frecord-gcc-switches', '-Wall', '-g', '-O3',
'-flto=auto', '-ffat-lto-objects', '-march=i586', '-mtune=generic',
'-pipe', '-frecord-gcc-switches', '-Wall', '-g', '-O3', '-flto=auto',
'-ffat-lto-objects', '-march=i586', '-mtune=generic', '-fPIC', '-Ibuild/include',
'-I/usr/src/RPM/BUILD/qpid-proton-0.36.0/i586-alt-linux/python/dist/include',
'-I/usr/include/python3.14', '-c', 'cproton_wrap.c', '-o',
'build/temp.linux-i686-cpython-314/cproton_wrap.o', '-DPROTON_DECLARE_STATIC']' returned
non-zero exit status 1.
gmake[2]: *** [python/CMakeFiles/py_pkg_wheel.dir/build.make:70:
python/CMakeFiles/py_pkg_wheel] Error 1
savedesktop-4.1-alt1
Full log written to
/usr/src/RPM/BUILD/savedesktop-4.1/noarch-alt-linux/meson-logs/testlog.txt
FAILED: [code=1] meson-internal__test
/usr/bin/meson test --no-rebuild --print-errorlogs
wineglass-1.2.1-alt2
ninja: Entering directory `i586-alt-linux'
ninja: error: 'i586-alt-linux/conf.vala', needed by
'com.github.aggalex.wineglass.p/i586-alt-linux/i586-alt-linux/conf.c', missing and no
known rule to make it
error: Bad exit status from /usr/src/tmp/rpmb-tmp.2pPbFn (%build)
xraylib-4.1.5-alt1
xraylib_wrap.c:9285:43: error: passing argument 3 of 'PyDict_SetItemString' makes
pointer from integer without a cast [-Wint-conversion]
9285 | PyDict_SetItemString(dict, "n_atom",PyInt_FromLong((int) cs->n_atom));
--
58 | PyAPI_FUNC(int) PyDict_SetItemString(PyObject *dp, const char *key, PyObject *item);
xraylib_wrap.c:9290:49: error: passing argument 3 of 'PyDict_SetItemString' makes
pointer from integer without a cast [-Wint-conversion]
9290 | PyDict_SetItemString(dict_temp, "Zatom",PyInt_FromLong((int)
cs->atom[i].Zatom));
--
xraylib_wrap.c: In function '_wrap_GetCompoundDataNISTByName':
xraylib_wrap.c:11622:41: error: passing argument 3 of 'PyDict_SetItemString' makes
pointer from integer without a cast [-Wint-conversion]
11622 | PyDict_SetItemString(dict, "name",PyString_FromString(cdn->name));
--
58 | PyAPI_FUNC(int) PyDict_SetItemString(PyObject *dp, const char *key, PyObject *item);
xraylib_wrap.c:11623:46: error: passing argument 3 of 'PyDict_SetItemString' makes
pointer from integer without a cast [-Wint-conversion]
11623 | PyDict_SetItemString(dict, "nElements",PyInt_FromLong((int) cdn->nElements));
--
xraylib_wrap.c: In function '_wrap_GetCompoundDataNISTByIndex':
xraylib_wrap.c:11704:41: error: passing argument 3 of 'PyDict_SetItemString' makes
pointer from integer without a cast [-Wint-conversion]
11704 | PyDict_SetItemString(dict, "name",PyString_FromString(cdn->name));
--
58 | PyAPI_FUNC(int) PyDict_SetItemString(PyObject *dp, const char *key, PyObject *item);
xraylib_wrap.c:11705:46: error: passing argument 3 of 'PyDict_SetItemString' makes
pointer from integer without a cast [-Wint-conversion]
11705 | PyDict_SetItemString(dict, "nElements",PyInt_FromLong((int) cdn->nElements));
--
xraylib_wrap.c: In function '_wrap_GetRadioNuclideDataByName':
xraylib_wrap.c:11855:41: error: passing argument 3 of 'PyDict_SetItemString' makes
pointer from integer without a cast [-Wint-conversion]
11855 | PyDict_SetItemString(dict, "name",PyString_FromString(rnd->name));
--
58 | PyAPI_FUNC(int) PyDict_SetItemString(PyObject *dp, const char *key, PyObject *item);
xraylib_wrap.c:11856:38: error: passing argument 3 of 'PyDict_SetItemString' makes
pointer from integer without a cast [-Wint-conversion]
11856 | PyDict_SetItemString(dict, "Z",PyInt_FromLong(rnd->Z));
--
58 | PyAPI_FUNC(int) PyDict_SetItemString(PyObject *dp, const char *key, PyObject *item);
xraylib_wrap.c:11857:38: error: passing argument 3 of 'PyDict_SetItemString' makes
pointer from integer without a cast [-Wint-conversion]
11857 | PyDict_SetItemString(dict, "A",PyInt_FromLong(rnd->A));
--
58 | PyAPI_FUNC(int) PyDict_SetItemString(PyObject *dp, const char *key, PyObject *item);
xraylib_wrap.c:11858:38: error: passing argument 3 of 'PyDict_SetItemString' makes
pointer from integer without a cast [-Wint-conversion]
11858 | PyDict_SetItemString(dict, "N",PyInt_FromLong(rnd->N));
40 error logs REMOVED from the list
0ad-1:0.27.1-alt1
deepin-editor-6.5.58-alt1
eartag-1.0.3-alt1
gcc11-11.4.1-alt1
gem-github-markup-4.0.0-alt1
gem-librarianp-1.1.2-alt1
gem-minitest-bonus-assertions-3.0.2-alt1
gem-nokogiri-1.18.9-alt1
gem-resque-3.0.0-alt1
gem-rspec-retry-0.6.2.11-alt0.1
gem-ruby-growl-4.1-alt1.1
gem-rugged-1.9.0-alt1
gem-sidekiq-7.3.8-alt1
gem-socksify-1.8.1-alt1
gem-tpm-key-attestation-0.14.1-alt1
gem-webauthn-3.4.3-alt1
gem-zeus-0.17.0-alt1
gnucash-5.16-alt1
hasher-priv-2.0.14-alt1
jline2-0:2.14.6-alt2
jnr-enxio-0.19-alt1_8jpp11
jnr-posix-3.0.47-alt2
json-0:20080425-alt7_2jpp6
libgupnp-igd-1.6.0-alt1
libopencv4.13-1:4.13.0-alt2
lombok-1.18.44-alt1
perl-Net-SIP-0.840-alt1
plasma-discover-stplr-0.1.3-alt1
python3-module-astor-0.8.1-alt1.1
python3-module-devpi-server-6.20.3-alt1
python3-module-mypy-2.3.1-alt1
python3-module-paho-2.1.0-alt2
python3-module-pygame-2.6.1-alt4
python3-module-pyrogram-2.0.106-alt1
python3-module-tenacity-8.5.0-alt1
python3-module-vcrpy-8.1.1-alt2
python3-module-zict-3.0.0-alt1
twelvemonkeys-3.13.1-alt1
wine-1:11.7.1-alt1
wine-vanilla-1:11.12-alt1
Total 305 error logs.
^ permalink raw reply [flat|nested] only message in thread
only message in thread, other threads:[~2026-10-03 12:02 UTC | newest]
Thread overview: (only message) (download: mbox.gz / follow: Atom feed)
-- links below jump to the message on this page --
2026-10-03 12:02 [cyber] I: Sisyphus-20261003 i586 beehive_status: +39 -40 (305) ALT beekeeper
ALT Linux Sisyphus cybertalk
This inbox may be cloned and mirrored by anyone:
git clone --mirror http://lore.altlinux.org/sisyphus-cybertalk/0 sisyphus-cybertalk/git/0.git
# If you have public-inbox 1.1+ installed, you may
# initialize and index your mirror using the following commands:
public-inbox-init -V2 sisyphus-cybertalk sisyphus-cybertalk/ http://lore.altlinux.org/sisyphus-cybertalk \
sisyphus-cybertalk@lists.altlinux.org sisyphus-cybertalk@lists.altlinux.ru sisyphus-cybertalk@lists.altlinux.com
public-inbox-index sisyphus-cybertalk
Example config snippet for mirrors.
Newsgroup available over NNTP:
nntp://lore.altlinux.org/org.altlinux.lists.sisyphus-cybertalk
AGPL code for this site: git clone https://public-inbox.org/public-inbox.git