ALT Linux Sisyphus cybertalk
 help / color / mirror / Atom feed
* [cyber] I: Sisyphus-20261003 x86_64 beehive_status: +23 -14 (346)
@ 2026-10-03  7:42 ALT beekeeper
  0 siblings, 0 replies; only message in thread
From: ALT beekeeper @ 2026-10-03  7:42 UTC (permalink / raw)
  To: sisyphus-cybertalk

[-- Warning: decoded text below may be mangled, UTF-8 assumed --]
[-- Attachment #1: Type: text/plain; charset=unknown-8bit, Size: 34470 bytes --]

	23 NEW error logs

binwalk3-3.1.0-alt1
	test src/extractors/common.rs - extractors::common::Chroot::create_file (line 216) ... ok
	test src/binwalk.rs - binwalk::Binwalk::extract (line 537) ... FAILED
	test src/binwalk.rs - binwalk::Binwalk::new (line 80) ... ok
	--
	thread 'main' (124692) panicked at src/binwalk.rs:18:60:
	Unable to read file: Os { code: 2, kind: NotFound, message: "No such file or directory" }
	stack backtrace:
	--
	src/binwalk.rs - binwalk::Binwalk::extract (line 537)
	test result: FAILED. 28 passed; 1 failed; 3 ignored; 0 measured; 0 filtered out;
	finished in 0.21s
	error: doctest failed, to rerun pass `--doc`
	error: Bad exit status from /usr/src/tmp/rpmb-tmp.oHYDGE (%check)

bpftrace-0.27.0-alt1
	^[[94m[	 SKIP	]^[[0m probe.kprobe_offset_module_error (unmet condition: 'lsmod | grep
	'^nf_tables'')\r
	^[[91m[	FAILED	]^[[0m 1 tests, listed below:\r
	^[[91m[	FAILED	]^[[0m probe.attach_to_bpf_program\r
	1267.96user 1034.32system 33:21.05elapsed 115%CPU (0avgtext+0avgdata 14581384maxresident)k

deepin-fcitx5configtool-plugin-6.0.33-alt2
	[155/213] /usr/bin/c++ -DDCC_CONFIGTOOL_EXEC_PATH=\"libexec\"
	-DDSG_DATA_DIR=\"/usr/share/dsg\" -DFCITX_GETTEXT_DOMAIN=\"deepin-fcitx5-configtool\"
	-DQT_CORE_LIB -DQT_GUI_LIB -DQT_MESSAGELOGCONTEXT
	-DQT_NO_DEBUG -DQT_NO_KEYWORDS -DQT_WIDGETS_LIB
	-DTRANSLATION_DOMAIN=\"org.fcitx.fcitx5.kcm\" -D_GNU_SOURCE -D_LARGEFILE64_SOURCE
	-I/usr/src/RPM/BUILD/dde-fcitx5configtool-plugin-6.0.33/BUILD/src/lib/layout
	-I/usr/src/RPM/BUILD/dde-fcitx5configtool-plugin-6.0.33/src/lib/layout
	-I/usr/src/RPM/BUILD/dde-fcitx5configtool-plugin-6.0.33/BUILD/src/lib/layout/layoutlib6_autogen/include
	-I/usr/src/RPM/BUILD/dde-fcitx5configtool-plugin-6.0.33/BUILD/src/lib -isystem
	/usr/include/Fcitx5/Utils -isystem /usr/include/dqt6/QtCore -isystem /usr/include/dqt6
	-isystem /usr/lib64/dqt6/mkspecs/linux-g++ -isystem /usr/include/dqt6/QtGui
	-isystem /usr/include/dqt6/QtWidgets -g -Wall -fno-operator-names -Wall -Wextra
	-Wcast-align -Wchar-subscripts -Wformat-security -Wno-long-long -Wpointer-arith -Wundef
	-Wnon-virtual-dtor -Woverloaded-virtual -Werror=return-type -Werror=init-self -Wvla
	-Wdate-time -Wsuggest-override -Wlogical-op -fdiagnostics-color=always -fexceptions
	-O2 -g -DNDEBUG -std=c++17 -fPIC -fvisibility=hidden -fvisibility-inlines-hidden
	-fstack-protector-strong -D_FORTIFY_SOURCE=2 -z noexecstack -pie -fPIC -z lazy
	-MD -MT src/lib/layout/CMakeFiles/layoutlib6.dir/keyboardlayoutwidget.cpp.o
	-MF src/lib/layout/CMakeFiles/layoutlib6.dir/keyboardlayoutwidget.cpp.o.d
	-o src/lib/layout/CMakeFiles/layoutlib6.dir/keyboardlayoutwidget.cpp.o -c
	/usr/src/RPM/BUILD/dde-fcitx5configtool-plugin-6.0.33/src/lib/layout/keyboardlayoutwidget.cpp
	FAILED: [code=1] src/lib/layout/CMakeFiles/layoutlib6.dir/keyboardlayoutwidget.cpp.o
	/usr/bin/c++ -DDCC_CONFIGTOOL_EXEC_PATH=\"libexec\" -DDSG_DATA_DIR=\"/usr/share/dsg\"
	-DFCITX_GETTEXT_DOMAIN=\"deepin-fcitx5-configtool\" -DQT_CORE_LIB -DQT_GUI_LIB
	-DQT_MESSAGELOGCONTEXT -DQT_NO_DEBUG -DQT_NO_KEYWORDS -DQT_WIDGETS_LIB
	-DTRANSLATION_DOMAIN=\"org.fcitx.fcitx5.kcm\" -D_GNU_SOURCE -D_LARGEFILE64_SOURCE
	-I/usr/src/RPM/BUILD/dde-fcitx5configtool-plugin-6.0.33/BUILD/src/lib/layout
	-I/usr/src/RPM/BUILD/dde-fcitx5configtool-plugin-6.0.33/src/lib/layout
	-I/usr/src/RPM/BUILD/dde-fcitx5configtool-plugin-6.0.33/BUILD/src/lib/layout/layoutlib6_autogen/include
	-I/usr/src/RPM/BUILD/dde-fcitx5configtool-plugin-6.0.33/BUILD/src/lib -isystem
	/usr/include/Fcitx5/Utils -isystem /usr/include/dqt6/QtCore -isystem /usr/include/dqt6
	-isystem /usr/lib64/dqt6/mkspecs/linux-g++ -isystem /usr/include/dqt6/QtGui
	-isystem /usr/include/dqt6/QtWidgets -g -Wall -fno-operator-names -Wall -Wextra
	-Wcast-align -Wchar-subscripts -Wformat-security -Wno-long-long -Wpointer-arith -Wundef
	-Wnon-virtual-dtor -Woverloaded-virtual -Werror=return-type -Werror=init-self -Wvla
	-Wdate-time -Wsuggest-override -Wlogical-op -fdiagnostics-color=always -fexceptions
	-O2 -g -DNDEBUG -std=c++17 -fPIC -fvisibility=hidden -fvisibility-inlines-hidden
	-fstack-protector-strong -D_FORTIFY_SOURCE=2 -z noexecstack -pie -fPIC -z lazy
	-MD -MT src/lib/layout/CMakeFiles/layoutlib6.dir/keyboardlayoutwidget.cpp.o
	-MF src/lib/layout/CMakeFiles/layoutlib6.dir/keyboardlayoutwidget.cpp.o.d
	-o src/lib/layout/CMakeFiles/layoutlib6.dir/keyboardlayoutwidget.cpp.o -c
	/usr/src/RPM/BUILD/dde-fcitx5configtool-plugin-6.0.33/src/lib/layout/keyboardlayoutwidget.cpp
	--
	/usr/include/Fcitx5/Utils/fcitx-utils/key.h: In member function ‘bool
	fcitx::Key::checkKeyList(const Container&) const’:
	/usr/include/Fcitx5/Utils/fcitx-utils/key.h:229:21: error: ‘std::ranges’ has not
	been declared [-Wtemplate-body]
	229 |	      return std::ranges::find_if(c, [this](const Key &toCheck) {
	/usr/include/Fcitx5/Utils/fcitx-utils/key.h:231:27: error: ‘std::ranges’ has not
	been declared [-Wtemplate-body]
	231 |		     }) != std::ranges::end(c);
	--
	[156/213] /usr/bin/c++ -DDCC_CONFIGTOOL_EXEC_PATH=\"libexec\"
	-DDSG_DATA_DIR=\"/usr/share/dsg\" -DDSYSINFO_PREFIX=\"\"
	-DFCITX_GETTEXT_DOMAIN=\"deepin-fcitx5-configtool\" -DPREFIX=\"/usr\"
	-DQT_CORE_LIB -DQT_DBUS_LIB -DQT_GUI_LIB -DQT_MESSAGELOGCONTEXT -DQT_NETWORK_LIB
	-DQT_NO_DEBUG -DQT_NO_KEYWORDS -DQT_PRINTSUPPORT_LIB -DQT_WIDGETS_LIB -DQT_XML_LIB
	-DTRANSLATION_DOMAIN=\"org.fcitx.fcitx5.kcm\" -D_GNU_SOURCE -D_LARGEFILE64_SOURCE
	-I/usr/src/RPM/BUILD/dde-fcitx5configtool-plugin-6.0.33/BUILD/src/lib/configlib
	-I/usr/src/RPM/BUILD/dde-fcitx5configtool-plugin-6.0.33/src/lib/configlib
	-I/usr/src/RPM/BUILD/dde-fcitx5configtool-plugin-6.0.33/BUILD/src/lib/configlib/configlib6_autogen/include
	-I/usr/src/RPM/BUILD/dde-fcitx5configtool-plugin-6.0.33/BUILD/src/lib
	-isystem /usr/include/dqt6/QtCore -isystem /usr/include/dqt6 -isystem
	/usr/lib64/dqt6/mkspecs/linux-g++ -isystem /usr/include/dqt6/QtGui -isystem
	/usr/include/dtk6/DCore -isystem /usr/include/dqt6/QtDBus -isystem /usr/include/dqt6/QtXml
	-isystem /usr/include/dtk6/DLog -isystem /usr/include/dtk6/DWidget -isystem
	/usr/include/dqt6/QtWidgets -isystem /usr/include/dqt6/QtNetwork -isystem
	/usr/include/dqt6/QtPrintSupport -isystem /usr/include/dtk6/DGui -isystem
	/usr/include/Fcitx5Qt6/Fcitx5Qt6DBusAddons -isystem /usr/include/Fcitx5/Core
	-isystem /usr/include/Fcitx5/Config -isystem /usr/include/Fcitx5/Utils
	-g -Wall -fno-operator-names -Wall -Wextra -Wcast-align -Wchar-subscripts
	-Wformat-security -Wno-long-long -Wpointer-arith -Wundef -Wnon-virtual-dtor
	-Woverloaded-virtual -Werror=return-type -Werror=init-self -Wvla -Wdate-time
	-Wsuggest-override -Wlogical-op -fdiagnostics-color=always -fexceptions -O2
	-g -DNDEBUG -std=c++17 -fPIC -fvisibility=hidden -fvisibility-inlines-hidden
	-fstack-protector-strong -D_FORTIFY_SOURCE=2 -z noexecstack -pie -fPIC
	-z lazy -MD -MT src/lib/configlib/CMakeFiles/configlib6.dir/font.cpp.o
	-MF src/lib/configlib/CMakeFiles/configlib6.dir/font.cpp.o.d
	-o src/lib/configlib/CMakeFiles/configlib6.dir/font.cpp.o -c
	/usr/src/RPM/BUILD/dde-fcitx5configtool-plugin-6.0.33/src/lib/configlib/font.cpp
	FAILED: [code=1] src/lib/configlib/CMakeFiles/configlib6.dir/font.cpp.o
	/usr/bin/c++ -DDCC_CONFIGTOOL_EXEC_PATH=\"libexec\"
	-DDSG_DATA_DIR=\"/usr/share/dsg\" -DDSYSINFO_PREFIX=\"\"
	-DFCITX_GETTEXT_DOMAIN=\"deepin-fcitx5-configtool\" -DPREFIX=\"/usr\"
	-DQT_CORE_LIB -DQT_DBUS_LIB -DQT_GUI_LIB -DQT_MESSAGELOGCONTEXT -DQT_NETWORK_LIB
	-DQT_NO_DEBUG -DQT_NO_KEYWORDS -DQT_PRINTSUPPORT_LIB -DQT_WIDGETS_LIB -DQT_XML_LIB
	-DTRANSLATION_DOMAIN=\"org.fcitx.fcitx5.kcm\" -D_GNU_SOURCE -D_LARGEFILE64_SOURCE
	-I/usr/src/RPM/BUILD/dde-fcitx5configtool-plugin-6.0.33/BUILD/src/lib/configlib
	-I/usr/src/RPM/BUILD/dde-fcitx5configtool-plugin-6.0.33/src/lib/configlib
	-I/usr/src/RPM/BUILD/dde-fcitx5configtool-plugin-6.0.33/BUILD/src/lib/configlib/configlib6_autogen/include
	-I/usr/src/RPM/BUILD/dde-fcitx5configtool-plugin-6.0.33/BUILD/src/lib
	-isystem /usr/include/dqt6/QtCore -isystem /usr/include/dqt6 -isystem
	/usr/lib64/dqt6/mkspecs/linux-g++ -isystem /usr/include/dqt6/QtGui -isystem
	/usr/include/dtk6/DCore -isystem /usr/include/dqt6/QtDBus -isystem /usr/include/dqt6/QtXml
	-isystem /usr/include/dtk6/DLog -isystem /usr/include/dtk6/DWidget -isystem
	/usr/include/dqt6/QtWidgets -isystem /usr/include/dqt6/QtNetwork -isystem
	/usr/include/dqt6/QtPrintSupport -isystem /usr/include/dtk6/DGui -isystem
	/usr/include/Fcitx5Qt6/Fcitx5Qt6DBusAddons -isystem /usr/include/Fcitx5/Core
	-isystem /usr/include/Fcitx5/Config -isystem /usr/include/Fcitx5/Utils
	-g -Wall -fno-operator-names -Wall -Wextra -Wcast-align -Wchar-subscripts
	-Wformat-security -Wno-long-long -Wpointer-arith -Wundef -Wnon-virtual-dtor
	-Woverloaded-virtual -Werror=return-type -Werror=init-self -Wvla -Wdate-time
	-Wsuggest-override -Wlogical-op -fdiagnostics-color=always -fexceptions -O2
	-g -DNDEBUG -std=c++17 -fPIC -fvisibility=hidden -fvisibility-inlines-hidden
	-fstack-protector-strong -D_FORTIFY_SOURCE=2 -z noexecstack -pie -fPIC
	-z lazy -MD -MT src/lib/configlib/CMakeFiles/configlib6.dir/font.cpp.o
	-MF src/lib/configlib/CMakeFiles/configlib6.dir/font.cpp.o.d
	-o src/lib/configlib/CMakeFiles/configlib6.dir/font.cpp.o -c
	/usr/src/RPM/BUILD/dde-fcitx5configtool-plugin-6.0.33/src/lib/configlib/font.cpp
	--
	/usr/include/Fcitx5/Utils/fcitx-utils/stringutils.h: In function ‘bool
	fcitx::stringutils::isConcatOf(std::string_view, std::string_view, std::string_view)’:
	/usr/include/Fcitx5/Utils/fcitx-utils/stringutils.h:49:59: error: ‘using std::string_view
	= class std::basic_string_view<char>’ {aka ‘class std::basic_string_view<char>’}
	has no member named ‘starts_with’
	49 |	 return str.size() == sub1.size() + sub2.size() && str.starts_with(sub1) &&
	/usr/include/Fcitx5/Utils/fcitx-utils/stringutils.h:50:16: error: ‘using std::string_view
	= class std::basic_string_view<char>’ {aka ‘class std::basic_string_view<char>’}
	has no member named ‘ends_with’
	50 |		str.ends_with(sub2);
	--
	[160/213] /usr/bin/c++ -DDCC_CONFIGTOOL_EXEC_PATH=\"libexec\"
	-DDSG_DATA_DIR=\"/usr/share/dsg\" -DDSYSINFO_PREFIX=\"\"
	-DFCITX_GETTEXT_DOMAIN=\"deepin-fcitx5-configtool\" -DPREFIX=\"/usr\"
	-DQT_CORE_LIB -DQT_DBUS_LIB -DQT_GUI_LIB -DQT_MESSAGELOGCONTEXT -DQT_NETWORK_LIB
	-DQT_NO_DEBUG -DQT_NO_KEYWORDS -DQT_PRINTSUPPORT_LIB -DQT_WIDGETS_LIB -DQT_XML_LIB
	-DTRANSLATION_DOMAIN=\"org.fcitx.fcitx5.kcm\" -D_GNU_SOURCE -D_LARGEFILE64_SOURCE
	-I/usr/src/RPM/BUILD/dde-fcitx5configtool-plugin-6.0.33/BUILD/src/lib/configlib
	-I/usr/src/RPM/BUILD/dde-fcitx5configtool-plugin-6.0.33/src/lib/configlib
	-I/usr/src/RPM/BUILD/dde-fcitx5configtool-plugin-6.0.33/BUILD/src/lib/configlib/configlib6_autogen/include
	-I/usr/src/RPM/BUILD/dde-fcitx5configtool-plugin-6.0.33/BUILD/src/lib
	-isystem /usr/include/dqt6/QtCore -isystem /usr/include/dqt6 -isystem
	/usr/lib64/dqt6/mkspecs/linux-g++ -isystem /usr/include/dqt6/QtGui -isystem
	/usr/include/dtk6/DCore -isystem /usr/include/dqt6/QtDBus -isystem /usr/include/dqt6/QtXml
	-isystem /usr/include/dtk6/DLog -isystem /usr/include/dtk6/DWidget -isystem
	/usr/include/dqt6/QtWidgets -isystem /usr/include/dqt6/QtNetwork -isystem
	/usr/include/dqt6/QtPrintSupport -isystem /usr/include/dtk6/DGui -isystem
	/usr/include/Fcitx5Qt6/Fcitx5Qt6DBusAddons -isystem /usr/include/Fcitx5/Core
	-isystem /usr/include/Fcitx5/Config -isystem /usr/include/Fcitx5/Utils
	-g -Wall -fno-operator-names -Wall -Wextra -Wcast-align -Wchar-subscripts
	-Wformat-security -Wno-long-long -Wpointer-arith -Wundef -Wnon-virtual-dtor
	-Woverloaded-virtual -Werror=return-type -Werror=init-self -Wvla -Wdate-time
	-Wsuggest-override -Wlogical-op -fdiagnostics-color=always -fexceptions -O2
	-g -DNDEBUG -std=c++17 -fPIC -fvisibility=hidden -fvisibility-inlines-hidden
	-fstack-protector-strong -D_FORTIFY_SOURCE=2 -z noexecstack -pie -fPIC -z
	lazy -MD -MT src/lib/configlib/CMakeFiles/configlib6.dir/addonmodel.cpp.o
	-MF src/lib/configlib/CMakeFiles/configlib6.dir/addonmodel.cpp.o.d
	-o src/lib/configlib/CMakeFiles/configlib6.dir/addonmodel.cpp.o -c
	/usr/src/RPM/BUILD/dde-fcitx5configtool-plugin-6.0.33/src/lib/configlib/addonmodel.cpp
	FAILED: [code=1] src/lib/configlib/CMakeFiles/configlib6.dir/addonmodel.cpp.o
	/usr/bin/c++ -DDCC_CONFIGTOOL_EXEC_PATH=\"libexec\"
	-DDSG_DATA_DIR=\"/usr/share/dsg\" -DDSYSINFO_PREFIX=\"\"
	-DFCITX_GETTEXT_DOMAIN=\"deepin-fcitx5-configtool\" -DPREFIX=\"/usr\"
	-DQT_CORE_LIB -DQT_DBUS_LIB -DQT_GUI_LIB -DQT_MESSAGELOGCONTEXT -DQT_NETWORK_LIB
	-DQT_NO_DEBUG -DQT_NO_KEYWORDS -DQT_PRINTSUPPORT_LIB -DQT_WIDGETS_LIB -DQT_XML_LIB
	-DTRANSLATION_DOMAIN=\"org.fcitx.fcitx5.kcm\" -D_GNU_SOURCE -D_LARGEFILE64_SOURCE
	-I/usr/src/RPM/BUILD/dde-fcitx5configtool-plugin-6.0.33/BUILD/src/lib/configlib
	-I/usr/src/RPM/BUILD/dde-fcitx5configtool-plugin-6.0.33/src/lib/configlib
	-I/usr/src/RPM/BUILD/dde-fcitx5configtool-plugin-6.0.33/BUILD/src/lib/configlib/configlib6_autogen/include
	-I/usr/src/RPM/BUILD/dde-fcitx5configtool-plugin-6.0.33/BUILD/src/lib
	-isystem /usr/include/dqt6/QtCore -isystem /usr/include/dqt6 -isystem
	/usr/lib64/dqt6/mkspecs/linux-g++ -isystem /usr/include/dqt6/QtGui -isystem
	/usr/include/dtk6/DCore -isystem /usr/include/dqt6/QtDBus -isystem /usr/include/dqt6/QtXml
	-isystem /usr/include/dtk6/DLog -isystem /usr/include/dtk6/DWidget -isystem
	/usr/include/dqt6/QtWidgets -isystem /usr/include/dqt6/QtNetwork -isystem
	/usr/include/dqt6/QtPrintSupport -isystem /usr/include/dtk6/DGui -isystem
	/usr/include/Fcitx5Qt6/Fcitx5Qt6DBusAddons -isystem /usr/include/Fcitx5/Core
	-isystem /usr/include/Fcitx5/Config -isystem /usr/include/Fcitx5/Utils
	-g -Wall -fno-operator-names -Wall -Wextra -Wcast-align -Wchar-subscripts
	-Wformat-security -Wno-long-long -Wpointer-arith -Wundef -Wnon-virtual-dtor
	-Woverloaded-virtual -Werror=return-type -Werror=init-self -Wvla -Wdate-time
	-Wsuggest-override -Wlogical-op -fdiagnostics-color=always -fexceptions -O2
	-g -DNDEBUG -std=c++17 -fPIC -fvisibility=hidden -fvisibility-inlines-hidden
	-fstack-protector-strong -D_FORTIFY_SOURCE=2 -z noexecstack -pie -fPIC -z
	lazy -MD -MT src/lib/configlib/CMakeFiles/configlib6.dir/addonmodel.cpp.o
	-MF src/lib/configlib/CMakeFiles/configlib6.dir/addonmodel.cpp.o.d
	-o src/lib/configlib/CMakeFiles/configlib6.dir/addonmodel.cpp.o -c
	/usr/src/RPM/BUILD/dde-fcitx5configtool-plugin-6.0.33/src/lib/configlib/addonmodel.cpp
	--
	/usr/include/Fcitx5/Utils/fcitx-utils/key.h: In member function ‘bool
	fcitx::Key::checkKeyList(const Container&) const’:
	/usr/include/Fcitx5/Utils/fcitx-utils/key.h:229:21: error: ‘std::ranges’ has not
	been declared [-Wtemplate-body]
	229 |	      return std::ranges::find_if(c, [this](const Key &toCheck) {
	/usr/include/Fcitx5/Utils/fcitx-utils/key.h:231:27: error: ‘std::ranges’ has not
	been declared [-Wtemplate-body]
	231 |		     }) != std::ranges::end(c);
	/usr/include/Fcitx5/Utils/fcitx-utils/log.h: At global scope:
	/usr/include/Fcitx5/Utils/fcitx-utils/log.h:171:46: error: ‘span’ in namespace
	‘std’ does not name a template type
	171 |	  LogMessageBuilder &operator<<(const std::span<T> &vec) {

fonts-ttf-IosevkaCurly-34.8.1-alt1
	[ACTION] Create TTF 'dist/IosevkaCurly/TTF-Unhinted/IosevkaCurly-HeavyItalic.ttf'
	[ACTION] Create TTF 'dist/IosevkaCurly/TTF-Unhinted/IosevkaCurly-ExtendedHeavyItalic.ttf'
	[ACTION] Create TTF 'dist/IosevkaCurly/TTF-Unhinted/IosevkaCurly-Thin.ttf'
	[ACTION] Create TTF 'dist/IosevkaCurly/TTF-Unhinted/IosevkaCurly-ExtendedThin.ttf'
	[ACTION] Create TTF 'dist/IosevkaCurly/TTF-Unhinted/IosevkaCurly-ThinOblique.ttf'
	[ACTION] Create TTF 'dist/IosevkaCurly/TTF-Unhinted/IosevkaCurly-ExtendedThinOblique.ttf'
	/usr/src/tmp/rpmb-tmp.fkxlw1: line 134: 2301710 CPU time limit exceeded npm run build
	-- ttf::IosevkaCurly
	error: Bad exit status from /usr/src/tmp/rpmb-tmp.fkxlw1 (%build)
	RPM build errors:
	Bad exit status from /usr/src/tmp/rpmb-tmp.fkxlw1 (%build)

fonts-ttf-IosevkaTermSlab-34.8.1-alt1
	[ACTION] Create TTF 'dist/IosevkaSlab/TTF-Unhinted/IosevkaSlab-HeavyItalic.ttf'
	[ACTION] Create TTF 'dist/IosevkaSlab/TTF-Unhinted/IosevkaSlab-ExtendedHeavyItalic.ttf'
	[ACTION] Create TTF 'dist/IosevkaSlab/TTF-Unhinted/IosevkaSlab-Thin.ttf'
	[ACTION] Create TTF 'dist/IosevkaSlab/TTF-Unhinted/IosevkaSlab-ExtendedThin.ttf'
	[ACTION] Create TTF 'dist/IosevkaSlab/TTF-Unhinted/IosevkaSlab-ThinOblique.ttf'
	[ACTION] Create TTF 'dist/IosevkaSlab/TTF-Unhinted/IosevkaSlab-ExtendedThinOblique.ttf'
	/usr/src/tmp/rpmb-tmp.z1pb1h: line 134: 991596 CPU time limit exceeded npm run build --
	ttf::IosevkaTermSlab
	error: Bad exit status from /usr/src/tmp/rpmb-tmp.z1pb1h (%build)
	RPM build errors:
	Bad exit status from /usr/src/tmp/rpmb-tmp.z1pb1h (%build)

gambit-4.9.7-alt5
	make[4]: Leaving directory '/usr/src/RPM/BUILD/gambit-4.9.7/lib/_irregex'
	make[4]: Entering directory '/usr/src/RPM/BUILD/gambit-4.9.7/lib'
	LD_LIBRARY_PATH=../lib:../gsi:../gsc:
	../gsc/gsc -:~~bin=../bin,~~lib=../lib,~~include=../include -f -target js  -prelude
	"(define-cond-expand-feature|enable-type-checking|)(define-cond-expand-feature|disable-auto-forcing|)(define-cond-expand-feature|enable-sharp-dot|)(define-cond-expand-feature|enable-bignum|)(define-cond-expand-feature|enable-ratnum|)(define-cond-expand-feature|enable-cpxnum|)(define-cond-expand-feature|enable-s8vector|)(define-cond-expand-feature|enable-u16vector|)(define-cond-expand-feature|enable-s16vector|)(define-cond-expand-feature|enable-u32vector|)(define-cond-expand-feature|enable-s32vector|)(define-cond-expand-feature|enable-u64vector|)(define-cond-expand-feature|enable-s64vector|)(define-cond-expand-feature|enable-f32vector|)(define-cond-expand-feature|disable-smp|)(##include\"../lib/header.scm\")"
	-label-namespace "" -c -o _gambit.js ../lib/_univlib.scm
	make[4]: Leaving directory '/usr/src/RPM/BUILD/gambit-4.9.7/lib'
	make[2]: *** [makefile:546: modules-recursive] Error 2
	make[1]: *** [makefile:373: modules] Error 2
	make: *** [makefile:107: all] Error 2
	error: Bad exit status from /usr/src/tmp/rpmb-tmp.iJN1Ry (%build)
	RPM build errors:
	Bad exit status from /usr/src/tmp/rpmb-tmp.iJN1Ry (%build)

gz-gui-10.0.0-alt3
	54/54 Test #54: check_INTEGRATION_transport_scene_manager ...	Passed	  0.01 sec
	98% tests passed, 1 tests failed out of 54
	Total Test time (real) = 119.76 sec
	The following tests FAILED:
	1 - UNIT_Application_TEST (Subprocess aborted)

java-1.8.0-openjdk-0:1.8.0.504.b01-alt1
	+ /usr/bin/gmake VERBOSE= LOG_LEVEL=trace -R -I
	/usr/src/RPM/BUILD/java-1.8.0-openjdk-1.8.0.504.b01-0.x86_64/openjdk/make/common
	-f adlc.make -r -rRw
	-I/usr/src/RPM/BUILD/java-1.8.0-openjdk-1.8.0.504.b01-0.x86_64/openjdk/make/common -j2
	-Otarget --sync-mutex=fnm:/usr/src/tmp/GmuV -j -IDB
	gmake: *** cannot open output sync mutex /usr/src/tmp/GmuV: No such file or directory.
	Stop.
	gmake[5]: ***
	[/usr/src/RPM/BUILD/java-1.8.0-openjdk-1.8.0.504.b01-0.x86_64/jdk8u504-b01/hotspot/make/linux/makefiles/top.make:91:
	ad_stuff] Error 2

ollama-0.35.0-alt1
	Wrote: /usr/src/in/nosrpm/ollama-0.35.0-alt1.nosrc.rpm (w1.gzdio)
	error: Macro %_priority_distbranch not found
	6<	       (empty)
	--
	2<     /(libcudart\.so\.
	error: Macro %__find_requires_filter failed to expand
	warning: Macro %_priority_distbranch not found
	error: Macro %_priority_distbranch not found
	3<	 (empty)
	--
	0< /usr/lib/ollama/cuda_v
	error: line 215: /usr/lib/ollama/cuda_v
	Installing ollama-0.35.0-alt1.src.rpm

perl-Tie-DBI-1.08-alt1
	Result: FAIL
	Failed 1/2 test programs. 0/46 subtests failed.
	make: *** [Makefile:781: test_dynamic] Error 255

postgresql18-18.6-alt1
	1..231\r
	# 13 of 231 tests failed.\r
	# The differences that caused some tests to fail can be viewed in the file
	"/usr/src/RPM/BUILD/postgresql18-18.6/src/test/regress/regression.diffs".\r

python3-module-crosshair-tool-0.0.110-alt1
	XPASS crosshair/fuzz_core_test.py::test_op[marshal.loads] - C helper rejects SymbolicBytes
	(no buffer protocol <3.12)
	FAILED crosshair/libimpl/builtinslib_ch_test.py::test_builtin[check_divmod]
	= 1 failed, 14546 passed, 847 skipped, 31 xfailed, 53 xpassed, 424 warnings in 680.33s
	(0:11:20) =
	INFO	 : Command's result: FAILURE
	INFO	 : Command's error: Command '['python3',
	'-m', 'pytest', '-vra', '-n', '32', '--deselect',
	'crosshair/libimpl/datetimelib_ch_test.py::test_builtin[check_timedelta_new]',
	'--deselect', 'crosshair/libimpl/datetimelib_test.py::test_leap_year']' returned non-zero
	exit status 1.
	error: Bad exit status from /usr/src/tmp/rpmb-tmp.AzcCZ5 (%check)

python3-module-flask-sqlalchemy-3.1.1-alt3
	"'@registry.mapped_as_dataclass'"
	E	    sqlalchemy.exc.InvalidRequestError: Class <class 'types.FlaskSQLAlchemyBase'>
	is already a dataclass; ensure that base classes / decorator styles of establishing
	dataclasses are not being mixed. This can happen if a class that inherits from
	'MappedAsDataclass', even indirectly, is been mapped with '@registry.mapped_as_dataclass'
	/usr/lib64/python3/site-packages/sqlalchemy/orm/decl_base.py:486: InvalidRequestError
	=========================== short test summary info ============================
	FAILED tests/test_engine.py::test_engine_per_bind[model_class2] - sqlalchemy....
	FAILED tests/test_engine.py::test_engine_per_bind[model_class4] - sqlalchemy....
	FAILED tests/test_engine.py::test_config_engine_options[model_class2] - sqlal...
	FAILED tests/test_engine.py::test_config_engine_options[model_class4] - sqlal...
	FAILED tests/test_engine.py::test_init_engine_options[model_class2] - sqlalch...
	FAILED tests/test_engine.py::test_init_engine_options[model_class4] - sqlalch...
	FAILED tests/test_engine.py::test_config_echo[model_class2] - sqlalchemy.exc....
	FAILED tests/test_engine.py::test_config_echo[model_class4] - sqlalchemy.exc....
	FAILED tests/test_engine.py::test_url_type[model_class2-sqlite://] - sqlalche...
	FAILED tests/test_engine.py::test_url_type[model_class2-value1] - sqlalchemy....

python3-module-httpdbg-2.1.8-alt1
	>	assert "def handle_exception" in group.label, records._print_for_debug()
	E	AssertionError: None
	E	assert 'def handle_exception' in ''
	--
	------------------------------ Captured log call -------------------------------
	ERROR	 tests.test_server_hook_flask:app.py:875 Exception on /boum [GET]
	Traceback (most recent call last):
	--
	1 / 0
	ZeroDivisionError: division by zero
	INFO	 werkzeug:_internal.py:97 127.0.0.1 - - [03/Oct/2026 03:12:27] "^[[35m^[[1mGET
	/boum HTTP/1.1^[[0m" 500 -
	=========================== short test summary info ============================
	FAILED tests/test_server_hook_fastapi.py::test_fastapi_endpoint - assert b'' ...
	FAILED tests/test_server_hook_flask.py::test_flask_internal_server_error - As...
	======================== 2 failed, 185 passed in 56.23s ========================
	INFO	 : Command's result: FAILURE
	INFO	 : Command's error: Command '['python3', '-m', 'pytest', '--ignore=tests/ui']'
	returned non-zero exit status 1.
	error: Bad exit status from /usr/src/tmp/rpmb-tmp.znwfnr (%check)

python3-module-kafka-3.0.11-alt1
	02:40:57.236 DEBUG    140004154664640:kafka-io-kafka-python-3.0.11 test.mock_broker
	<MockTransport [localhost:9092<-mock]>: Request api_key=21 version=2 correlation_id=43
	02:40:57.236 ERROR    140004154664640:kafka-io-kafka-python-3.0.11 kafka.net.selector
	Unhandled exception in task <kafka.net.selector.Task object at 0x7f55427cb380>:
	Traceback (most recent call last):
	--
	[(k, type(r).__name__) for k, r in self._response_queue]))
	ValueError: MockBroker: no handler for api_key=21 version=2 (correlation_id=43). Scripted
	queue has 0 entries: []
	02:40:57.438 WARNING  140004154664640:kafka-io-kafka-python-3.0.11 kafka.net.connection
	<KafkaConnection node_id=0 host=[localhost:9092<-mock] broker_version=(4, 2) (connected)>:
	Request timed out after 199 ms. Closing connection.
	02:40:57.439 ERROR    140004154664640:kafka-io-kafka-python-3.0.11 kafka.net.connection
	<KafkaConnection node_id=0 broker_version=(4, 2) (disconnected)>: Connection lost:
	[Error 7] RequestTimedOutError: Request timed out after 199 ms
	02:40:57.439 DEBUG    140004154664640:kafka-io-kafka-python-3.0.11 kafka.cluster
	Sending metadata request MetadataRequest(topics=[], allow_auto_topic_creation=True,
	include_cluster_authorized_operations=False, include_topic_authorized_operations=False)
	to node 0
	--
	SKIPPED [2] test/integration/test_ssl_integration.py: SSL support requires broker >=0.9
	FAILED
	test/admin/test_admin_partitions.py::TestDeleteRecordsMockBroker::test_persistent_not_leader_reports_error_after_timeout
	================= 1 failed, 2626 passed, 67 skipped in 18.13s ==================
	INFO	 : Command's result: FAILURE
	INFO	 : Command's error: Command '['python3', '-m', 'pytest', '-ra', '-Wignore']'
	returned non-zero exit status 1.
	error: Bad exit status from /usr/src/tmp/rpmb-tmp.gBjbQk (%check)

python3-module-mkdocs-1.6.1-alt2
	..................................................................................................................................................................................................................................................................................................................................................................................................................................................E...............................................s..................................................s................s...............s........................................................................................................................
	ERROR: test_watch_with_broken_symlinks
	(mkdocs.tests.livereload_tests.BuildTests.test_watch_with_broken_symlinks)
	Traceback (most recent call last):
	--
	paths = [os.path.join(root, entry.name) for entry in self.listdir(root)]
	OSError: [Errno 40] Too many levels of symbolic links:
	'/usr/src/tmp/mkdocs_test-zp2g2zx_/subdir/circular/subdir/circular/subdir/circular/subdir/circular/subdir/circular/subdir/circular/subdir/circular/subdir/circular/subdir/circular/subdir/circular/subdir/circular/subdir/circular/subdir/circular/subdir/circular/subdir/circular/subdir/circular/subdir/circular/subdir/circular/subdir/circular/subdir/circular/subdir/circular/subdir'
	Ran 687 tests in 8.805s
	FAILED (errors=1, skipped=4)
	INFO	 : Command's result: FAILURE
	INFO	 : Command's error: Command '['python3', '-m', 'unittest', 'discover', '-p',
	'*tests.py', 'mkdocs', '--top-level-directory', '.']' returned non-zero exit status 1.
	error: Bad exit status from /usr/src/tmp/rpmb-tmp.l25CEj (%check)

python3-module-netbox-sdk-0.0.12-alt1
	raise TimeoutError(f"timed out waiting for cache index lock: {lock_path}")
	E   TimeoutError: timed out waiting for cache index lock:
	/usr/src/tmp/pytest-of-builder/pytest-0/popen-gw4/test_portable_lock_reclaims_lo0/idx-test.json.lock
	=============================== warnings summary ===============================
	--
	=========================== short test summary info ============================
	FAILED tests/test_api_cache.py::test_portable_lock_reclaims_lock_left_by_dead_process
	====== 1 failed, 1644 passed, 17 skipped, 2 warnings in 63.70s (0:01:03) =======
	INFO	 : Command's result: FAILURE
	INFO	 : Command's error: Command '['python3', '-m', 'pytest', '-k',
	'not ( \tTestDevHttpInputValidation or \ttest_parse_select_requires_value or
	\ttest_parse_columns_requires_value or \ttest_parse_max_columns_requires_value
	or \ttest_parse_max_columns_invalid or \ttest_parse_max_columns_zero_raises
	or \ttest_main_handles_unknown_command_without_traceback or
	\ttest_metadata_generation_rejects_source_version_mismatch or
	\ttest_metadata_generation_rejects_materially_different_same_version_ancestor
	or \ttest_built_wheel_exposes_the_catalog_outside_the_checkout
	or \ttest_v46_typed_regeneration_matches_committed_artifact
	or \ttest_v47_typed_regeneration_matches_committed_artifact
	or \ttest_datamodel_code_generator_is_locked_and_installed
	or \ttest_v47_model_regeneration_matches_committed_artifact)',
	'--ignore=tests/test_gitea_release.py', '--ignore=tests/test_mcp.py',
	'--ignore=tests/test_mcp_connected_line.py', '--ignore=tests/test_mcp_plugin_bridge.py']'
	returned non-zero exit status 1.
	error: Bad exit status from /usr/src/tmp/rpmb-tmp.cF6S2R (%check)

python3-module-openstacksdk-4.7.1-alt1
	- Worker 121 (34 tests) => 0:00:02.866991
	- Worker 122 (34 tests) => 0:00:02.984361
	- Worker 123 (34 tests) => 0:00:02.590650
	- Worker 124 (34 tests) => 0:00:02.977825
	- Worker 125 (34 tests) => 0:00:01.682158
	- Worker 126 (34 tests) => 0:00:03.090387
	- Worker 127 (34 tests) => 0:00:01.902414
	error: Bad exit status from /usr/src/tmp/rpmb-tmp.2g2J4Z (%check)
	RPM build errors:
	Bad exit status from /usr/src/tmp/rpmb-tmp.2g2J4Z (%check)

python3-module-oslo.db-17.4.0-alt1
	- Worker 249 (2 tests) => 0:00:00.013284
	- Worker 250 (2 tests) => 0:00:00.028380
	- Worker 251 (2 tests) => 0:00:00.009251
	- Worker 252 (2 tests) => 0:00:00.003901
	- Worker 253 (2 tests) => 0:00:00.186760
	- Worker 254 (2 tests) => 0:00:00.204953
	- Worker 255 (2 tests) => 0:00:00.062784
	error: Bad exit status from /usr/src/tmp/rpmb-tmp.iyDSrd (%check)
	RPM build errors:
	Bad exit status from /usr/src/tmp/rpmb-tmp.iyDSrd (%check)

python3-module-slack-sdk-3.35.0-alt1
	==================================== ERRORS ====================================
	_ ERROR collecting tests/slack_sdk/oauth/installation_store/test_async_sqlalchemy.py _
	ImportError while importing test module
	'/usr/src/RPM/BUILD/python3-module-slack-sdk-3.35.0/tests/slack_sdk/oauth/installation_store/test_async_sqlalchemy.py'.
	--
	from greenlet import getcurrent
	E   ModuleNotFoundError: No module named 'greenlet'
	The above exception was the direct cause of the following exception:
	--
	raise ImportError(_ERROR_MESSAGE) from e
	E   ImportError: The SQLAlchemy asyncio module requires that the Python 'greenlet'
	library is installed.  In order to ensure this dependency is available, use the
	'sqlalchemy[asyncio]' install target:  'pip install sqlalchemy[asyncio]'
	=========================== short test summary info ============================
	ERROR tests/slack_sdk/oauth/installation_store/test_async_sqlalchemy.py
	!!!!!!!!!!!!!!!!!!!! Interrupted: 1 error during collection !!!!!!!!!!!!!!!!!!!!
	--
	INFO	 : Command's result: FAILURE
	INFO	 : Command's error: Command '['python3', '-m', 'pytest', '-v', '-k', 'not
	TestRTMClient and not test_send_message_while_disconnection']' returned non-zero exit
	status 2.
	error: Bad exit status from /usr/src/tmp/rpmb-tmp.rUCRi7 (%check)

python3-module-social-core-5.1.0-alt1
	raise DecodeError(f"Invalid {name} padding")
	jwt.exceptions.DecodeError: Invalid payload padding
	The above exception was the direct cause of the following exception:
	social_core.exceptions.AuthTokenError: Token error: Invalid payload padding
	During handling of the above exception, another exception occurred:
	--
	>	self.authtoken_raised(
	"Token error: Signature verification failed", tamper_message=True
	social_core/tests/backends/open_id_connect.py:218:
	--
	with self.assertRaisesRegex(AuthTokenError, expected_message):
	E   AssertionError: "Token error: Signature verification failed" does not match "Token
	error: Invalid payload padding"
	________________ VaultOpenIdConnectTest.test_invalid_signature _________________
	--
	>	    raise DecodeError(f"Invalid {name} padding")
	E	    jwt.exceptions.DecodeError: Invalid payload padding
	/usr/lib/python3/site-packages/jwt/api_jws.py:344: DecodeError
	--
	raise DecodeError(f"Invalid {name} padding")
	jwt.exceptions.DecodeError: Invalid payload padding
	The above exception was the direct cause of the following exception:
	social_core.exceptions.AuthTokenError: Token error: Invalid payload padding
	During handling of the above exception, another exception occurred:
	--
	>	self.authtoken_raised(
	"Token error: Signature verification failed", tamper_message=True
	social_core/tests/backends/open_id_connect.py:218:
	--
	with self.assertRaisesRegex(AuthTokenError, expected_message):
	E   AssertionError: "Token error: Signature verification failed" does not match "Token
	error: Invalid payload padding"
	=============================== warnings summary ===============================
	--
	=========================== short test summary info ============================
	FAILED
	social_core/tests/backends/test_auth0_openidconnect.py::Auth0OpenIdConnectTest::test_invalid_signature
	FAILED social_core/tests/backends/test_cas.py::CASOpenIdConnectTest::test_invalid_signature

watchexec-2.7.3-alt1
	test crates/lib/src/lib.rs - readme_doc_check::Readme (line 114) - compile ... ok
	test crates/lib/src/error/runtime.rs - error::runtime::RuntimeError (line 14) ... ok
	test crates/lib/src/config.rs - config::Config::error_handler (line 91) ... ok
	test crates/lib/src/config.rs - config::Config::error_handler (line 77) ... ok
	test crates/lib/src/error/runtime.rs - error::runtime::RuntimeError (line 36) ... ok
	test crates/lib/src/config.rs - config::Config::error_handler (line 67) ... ok
	--
	test result: ok. 8 passed; 0 failed; 0 ignored; 0 measured; 0 filtered out; finished
	in 5.88s
	error: 1 target failed:
	`-p watchexec --test fs_worker_real`

yq-go-4.53.3-alt1
	+ go test -compiler gc ./...
	--- FAIL: TestGoInstallCompatibility (0.30s)
	go_install_test.go:22: Module cannot be zipped for go install: create zip .: file
	"pkg/yqlib/doc/operators/system-operators.md" is larger than declared size

	14 error logs REMOVED from the list
0ad-1:0.27.1-alt1
cov-analysis-1.2-alt1
fonts-ttf-Iosevka-34.8.1-alt1
fonts-ttf-IosevkaTerm-34.8.1-alt1
gnuplot-1:6.0.5-alt1
libdqlite-1.18.2-alt2
libfprint2-1.94.100-alt1
ollama-0.34.4-alt2
podman-tui-1.11.3-alt1
python3-module-devpi-server-6.20.3-alt1
python3-module-mypy-2.3.1-alt1
python3-module-python-lsp-server-1.15.0-alt1
python3-module-qtconsole-5.7.2-alt1.1
tbb-2023.1.0-alt1

Total 346 error logs.


^ permalink raw reply	[flat|nested] only message in thread

only message in thread, other threads:[~2026-10-03  7:42 UTC | newest]

Thread overview: (only message) (download: mbox.gz / follow: Atom feed)
-- links below jump to the message on this page --
2026-10-03  7:42 [cyber] I: Sisyphus-20261003 x86_64 beehive_status: +23 -14 (346) ALT beekeeper

ALT Linux Sisyphus cybertalk

This inbox may be cloned and mirrored by anyone:

	git clone --mirror http://lore.altlinux.org/sisyphus-cybertalk/0 sisyphus-cybertalk/git/0.git

	# If you have public-inbox 1.1+ installed, you may
	# initialize and index your mirror using the following commands:
	public-inbox-init -V2 sisyphus-cybertalk sisyphus-cybertalk/ http://lore.altlinux.org/sisyphus-cybertalk \
		sisyphus-cybertalk@lists.altlinux.org sisyphus-cybertalk@lists.altlinux.ru sisyphus-cybertalk@lists.altlinux.com
	public-inbox-index sisyphus-cybertalk

Example config snippet for mirrors.
Newsgroup available over NNTP:
	nntp://lore.altlinux.org/org.altlinux.lists.sisyphus-cybertalk


AGPL code for this site: git clone https://public-inbox.org/public-inbox.git