ALT Linux Sisyphus cybertalk
 help / color / mirror / Atom feed
* [cyber] I: Sisyphus-20260930 x86_64 beehive_status: +13 -28 (338)
@ 2026-09-30  7:34 ALT beekeeper
  0 siblings, 0 replies; only message in thread
From: ALT beekeeper @ 2026-09-30  7:34 UTC (permalink / raw)
  To: sisyphus-cybertalk

[-- Warning: decoded text below may be mangled, UTF-8 assumed --]
[-- Attachment #1: Type: text/plain; charset=unknown-8bit, Size: 14260 bytes --]

	13 NEW error logs

binwalk3-3.1.0-alt1
	test src/extractors/common.rs - extractors::common::Chroot::append_to_file (line 429)
	... ok
	test src/binwalk.rs - binwalk::Binwalk::analyze (line 639) ... FAILED
	test src/binwalk.rs - binwalk::Binwalk::scan (line 225) ... ok
	--
	src/binwalk.rs - binwalk::Binwalk::analyze (line 639)
	test result: FAILED. 28 passed; 1 failed; 3 ignored; 0 measured; 0 filtered out;
	finished in 0.20s
	error: doctest failed, to rerun pass `--doc`
	error: Bad exit status from /usr/src/tmp/rpmb-tmp.RUhTck (%check)

bpftrace-0.27.0-alt1
	^[[94m[	 SKIP	]^[[0m probe.kprobe_offset_module_error (unmet condition: 'lsmod | grep
	'^nf_tables'')\r
	^[[91m[	FAILED	]^[[0m 3 tests, listed below:\r
	^[[91m[	FAILED	]^[[0m call.tseries\r
	^[[91m[	FAILED	]^[[0m call.tseries multiple\r
	^[[91m[	FAILED	]^[[0m probe.attach_to_bpf_program\r
	1766.45user 1687.11system 48:37.17elapsed 118%CPU (0avgtext+0avgdata 6799284maxresident)k

fonts-ttf-IosevkaTerm-34.8.1-alt1
	[ACTION] Create TTF 'dist/Iosevka/TTF-Unhinted/Iosevka-HeavyItalic.ttf'
	[ACTION] Create TTF 'dist/Iosevka/TTF-Unhinted/Iosevka-ExtendedHeavyItalic.ttf'
	[ACTION] Create TTF 'dist/Iosevka/TTF-Unhinted/Iosevka-Thin.ttf'
	[ACTION] Create TTF 'dist/Iosevka/TTF-Unhinted/Iosevka-ExtendedThin.ttf'
	[ACTION] Create TTF 'dist/Iosevka/TTF-Unhinted/Iosevka-ThinOblique.ttf'
	[ACTION] Create TTF 'dist/Iosevka/TTF-Unhinted/Iosevka-ExtendedThinOblique.ttf'
	/usr/src/tmp/rpmb-tmp.09Q4fQ: line 134: 2114660 CPU time limit exceeded npm run build
	-- ttf::IosevkaTerm
	error: Bad exit status from /usr/src/tmp/rpmb-tmp.09Q4fQ (%build)
	RPM build errors:
	Bad exit status from /usr/src/tmp/rpmb-tmp.09Q4fQ (%build)

fonts-ttf-IosevkaTermCurly-34.8.1-alt1
	[ACTION] Create TTF 'dist/IosevkaCurly/TTF-Unhinted/IosevkaCurly-HeavyItalic.ttf'
	[ACTION] Create TTF 'dist/IosevkaCurly/TTF-Unhinted/IosevkaCurly-ExtendedHeavyItalic.ttf'
	[ACTION] Create TTF 'dist/IosevkaCurly/TTF-Unhinted/IosevkaCurly-Thin.ttf'
	[ACTION] Create TTF 'dist/IosevkaCurly/TTF-Unhinted/IosevkaCurly-ExtendedThin.ttf'
	[ACTION] Create TTF 'dist/IosevkaCurly/TTF-Unhinted/IosevkaCurly-ThinOblique.ttf'
	[ACTION] Create TTF 'dist/IosevkaCurly/TTF-Unhinted/IosevkaCurly-ExtendedThinOblique.ttf'
	/usr/src/tmp/rpmb-tmp.QUC8pY: line 134: 3300195 CPU time limit exceeded npm run build
	-- ttf::IosevkaTermCurly
	error: Bad exit status from /usr/src/tmp/rpmb-tmp.QUC8pY (%build)
	RPM build errors:
	Bad exit status from /usr/src/tmp/rpmb-tmp.QUC8pY (%build)

greetd-tuigreet-0.11.1-alt2
	test ui::tests::test_password_prompt_renders ... ok
	test integration::display::show_time ... FAILED
	test ui::util::test::greeting_height_two_lines ... ok
	--
	integration::display::show_time
	test result: FAILED. 90 passed; 1 failed; 0 ignored; 0 measured; 0 filtered out;
	finished in 2.56s
	error: test failed, to rerun pass `-p tuigreet --bin tuigreet`
	Running unittests src/lib.rs (target/release/deps/tuigreet_config-cf33c26d45cc976a)
	--
	test result: ok. 0 passed; 0 failed; 0 ignored; 0 measured; 0 filtered out; finished
	in 0.00s
	error: 1 target failed:
	`-p tuigreet --bin tuigreet`

gz-gui-10.0.0-alt3
	54/54 Test #54: check_INTEGRATION_transport_scene_manager ...	Passed	  0.01 sec
	96% tests passed, 2 tests failed out of 54
	Total Test time (real) = 143.54 sec
	The following tests FAILED:
	1 - UNIT_Application_TEST (Subprocess aborted)

gz-sim-10.5.0-alt1
	296/296 Test #296: world_TEST ...................................................
	Passed	  2.32 sec
	99% tests passed, 1 tests failed out of 296
	Total Test time (real) = 567.72 sec
	The following tests FAILED:
	141 - INTEGRATION_joint_state_publisher_system (Failed)

intel-compute-runtime-26.31.39395.13-alt1
	[907/5969] /usr/bin/c++
	@level_zero/CMakeFiles/ze_intel_gpu_lib.dir/api/driver_experimental/public/mcl_ext/zex_mutable_cmdlist_api.cpp.o.rsp
	-MD -MT
	level_zero/CMakeFiles/ze_intel_gpu_lib.dir/api/driver_experimental/public/mcl_ext/zex_mutable_cmdlist_api.cpp.o
	-MF
	level_zero/CMakeFiles/ze_intel_gpu_lib.dir/api/driver_experimental/public/mcl_ext/zex_mutable_cmdlist_api.cpp.o.d
	-o
	level_zero/CMakeFiles/ze_intel_gpu_lib.dir/api/driver_experimental/public/mcl_ext/zex_mutable_cmdlist_api.cpp.o
	-c
	/usr/src/RPM/BUILD/intel-compute-runtime-26.31.39395.13/level_zero/api/driver_experimental/public/mcl_ext/zex_mutable_cmdlist_api.cpp
	FAILED: [code=1]
	level_zero/CMakeFiles/ze_intel_gpu_lib.dir/api/driver_experimental/public/mcl_ext/zex_mutable_cmdlist_api.cpp.o
	/usr/bin/c++
	@level_zero/CMakeFiles/ze_intel_gpu_lib.dir/api/driver_experimental/public/mcl_ext/zex_mutable_cmdlist_api.cpp.o.rsp
	-MD -MT
	level_zero/CMakeFiles/ze_intel_gpu_lib.dir/api/driver_experimental/public/mcl_ext/zex_mutable_cmdlist_api.cpp.o
	-MF
	level_zero/CMakeFiles/ze_intel_gpu_lib.dir/api/driver_experimental/public/mcl_ext/zex_mutable_cmdlist_api.cpp.o.d
	-o
	level_zero/CMakeFiles/ze_intel_gpu_lib.dir/api/driver_experimental/public/mcl_ext/zex_mutable_cmdlist_api.cpp.o
	-c
	/usr/src/RPM/BUILD/intel-compute-runtime-26.31.39395.13/level_zero/api/driver_experimental/public/mcl_ext/zex_mutable_cmdlist_api.cpp
	--
	from
	/usr/src/RPM/BUILD/intel-compute-runtime-26.31.39395.13/level_zero/api/driver_experimental/public/mcl_ext/zex_mutable_cmdlist_api.cpp:14:
	/usr/src/RPM/BUILD/intel-compute-runtime-26.31.39395.13/level_zero/include/level_zero/driver_experimental/mcl_ext/ze_mutable_command_list_exp.h:12:33:
	error: conflicting declaration 'typedef ze_result_t (*
	ze_pfnCommandListGetNextCommandIdExpCb_t)(ze_command_list_handle_t, const
	ze_mutable_command_id_exp_desc_t*, uint64_t*)'
	12 | typedef ze_result_t(ZE_APICALL *ze_pfnCommandListGetNextCommandIdExpCb_t)(
	--
	2271 | typedef void (ZE_APICALL *ze_pfnCommandListGetNextCommandIdExpCb_t)(
	/usr/src/RPM/BUILD/intel-compute-runtime-26.31.39395.13/level_zero/include/level_zero/driver_experimental/mcl_ext/ze_mutable_command_list_exp.h:17:33:
	error: conflicting declaration 'typedef ze_result_t (*
	ze_pfnCommandListUpdateMutableCommandsExpCb_t)(ze_command_list_handle_t, const
	ze_mutable_commands_exp_desc_t*)'
	17 | typedef ze_result_t(ZE_APICALL *ze_pfnCommandListUpdateMutableCommandsExpCb_t)(
	--
	2297 | typedef void (ZE_APICALL *ze_pfnCommandListUpdateMutableCommandsExpCb_t)(
	/usr/src/RPM/BUILD/intel-compute-runtime-26.31.39395.13/level_zero/include/level_zero/driver_experimental/mcl_ext/ze_mutable_command_list_exp.h:21:33:
	error: conflicting declaration 'typedef ze_result_t (*
	ze_pfnCommandListUpdateMutableCommandSignalEventExpCb_t)(ze_command_list_handle_t,
	uint64_t, ze_event_handle_t)'
	21 | typedef ze_result_t(ZE_APICALL
	*ze_pfnCommandListUpdateMutableCommandSignalEventExpCb_t)(
	--
	2324 | typedef void (ZE_APICALL *ze_pfnCommandListUpdateMutableCommandSignalEventExpCb_t)(
	/usr/src/RPM/BUILD/intel-compute-runtime-26.31.39395.13/level_zero/include/level_zero/driver_experimental/mcl_ext/ze_mutable_command_list_exp.h:26:33:
	error: conflicting declaration 'typedef ze_result_t (*
	ze_pfnCommandListUpdateMutableCommandWaitEventsExpCb_t)(ze_command_list_handle_t,
	uint64_t, uint32_t, struct _ze_event_handle_t**)'
	26 | typedef ze_result_t(ZE_APICALL
	*ze_pfnCommandListUpdateMutableCommandWaitEventsExpCb_t)(
	--
	2352 | typedef void (ZE_APICALL *ze_pfnCommandListUpdateMutableCommandWaitEventsExpCb_t)(
	/usr/src/RPM/BUILD/intel-compute-runtime-26.31.39395.13/level_zero/include/level_zero/driver_experimental/mcl_ext/ze_mutable_command_list_exp.h:32:33:
	error: conflicting declaration 'typedef ze_result_t (*
	ze_pfnCommandListGetNextCommandIdWithKernelsExpCb_t)(ze_command_list_handle_t, const
	ze_mutable_command_id_exp_desc_t*, uint32_t, struct _ze_kernel_handle_t**, uint64_t*)'
	32 | typedef ze_result_t(ZE_APICALL *ze_pfnCommandListGetNextCommandIdWithKernelsExpCb_t)(
	--
	1339 | typedef void (ZE_APICALL *ze_pfnCommandListGetNextCommandIdWithKernelsExpCb_t)(
	/usr/src/RPM/BUILD/intel-compute-runtime-26.31.39395.13/level_zero/include/level_zero/driver_experimental/mcl_ext/ze_mutable_command_list_exp.h:39:33:
	error: conflicting declaration 'typedef ze_result_t (*
	ze_pfnCommandListUpdateMutableCommandKernelsExpCb_t)(ze_command_list_handle_t, uint32_t,
	uint64_t*, struct _ze_kernel_handle_t**)'
	39 | typedef ze_result_t(ZE_APICALL *ze_pfnCommandListUpdateMutableCommandKernelsExpCb_t)(

lightdm-1.32.0-alt15
	# SKIP:  0
	# XFAIL: 0
	# FAIL:  1
	# XPASS: 0
	# ERROR: 0
	See tests/test-suite.log
	--
	# SKIP:  0
	# XFAIL: 0
	# FAIL:  1
	# XPASS: 0
	# ERROR: 0
	.. contents:: :depth: 2
	FAIL: test-switch-to-greeter-return-session-logout
	** (process:2707759): WARNING **: 02:20:46.464: Error loading passwd file: Failed to
	open file “/tmp/.r0/etc/passwd”: No such file or directory
	** (process:2707773): WARNING **: 02:20:46.472: Error loading passwd file: Failed to
	open file “/tmp/.r0/etc/passwd”: No such file or directory
	** (process:2707810): WARNING **: 02:20:46.481: Error loading passwd file: Failed to
	open file “/tmp/.r0/etc/passwd”: No such file or directory
	** (process:2707846): WARNING **: 02:20:46.488: Error loading passwd file: Failed to
	open file “/tmp/.r0/etc/passwd”: No such file or directory

python3-module-chess-1.11.2-alt1
	return await command.result
	chess.engine.EngineTerminatedError: engine process died unexpectedly (exit code: -11)
	ERROR: test_sf_multipv (__main__.EngineTestCase.test_sf_multipv)
	Traceback (most recent call last):
	--
	return await command.result
	chess.engine.EngineTerminatedError: engine process died unexpectedly (exit code: -11)
	ERROR: test_sf_options (__main__.EngineTestCase.test_sf_options)
	Traceback (most recent call last):
	--
	return await command.result
	chess.engine.EngineTerminatedError: engine process died unexpectedly (exit code: -11)
	ERROR: test_sf_quit (__main__.EngineTestCase.test_sf_quit)
	Traceback (most recent call last):
	--
	return await command.result
	chess.engine.EngineTerminatedError: engine process died unexpectedly (exit code: -11)
	Ran 288 tests in 2.448s
	FAILED (errors=4, skipped=17)
	py3: exit 1 (2.78 seconds) /usr/src/RPM/BUILD/python3-module-chess-1.11.2> python
	test.py --verbose pid=882886

python3-module-django-modern-rest-0.15.0-alt1
	>	assert response.status_code == HTTPStatus.OK, response.content
	E	AssertionError: b'{"detail":[{"msg":"Not authenticated","type":"security"}]}'
	E	assert 401 == <HTTPStatus.OK: 200>
	--
	>	assert response.status_code == HTTPStatus.OK, response.content
	E	AssertionError: b'{"detail":[{"msg":"Not authenticated","type":"security"}]}'
	E	assert 401 == <HTTPStatus.OK: 200>
	--
	>	assert response.status_code == HTTPStatus.OK, response.content
	E	AssertionError: b'{"detail":[{"msg":"Not authenticated","type":"security"}]}'
	E	assert 401 == <HTTPStatus.OK: 200>
	--
	>	assert response.status_code == HTTPStatus.OK, response.content
	E	AssertionError: b'{"detail":[{"msg":"Not authenticated","type":"security"}]}'
	E	assert 401 == <HTTPStatus.OK: 200>
	--
	SKIPPED [2] tests/test_unit/test_streaming/test_streaming_negotiation.py:90: JsonRenderer
	cannot render dataclasses
	FAILED
	tests/test_unit/test_security/test_allauth/test_allauth_session_auth.py::test_sync_session_token_custom_header
	FAILED
	tests/test_unit/test_security/test_allauth/test_allauth_session_auth.py::test_session_token_auth_falls_through
	FAILED
	tests/test_unit/test_security/test_allauth/test_allauth_session_auth.py::test_sync_session_token_auth
	FAILED
	tests/test_unit/test_security/test_allauth/test_allauth_session_auth.py::test_async_session_token_auth
	================= 4 failed, 1911 passed, 21 skipped in 36.43s ==================
	INFO	 : Command's result: FAILURE
	INFO	 : Command's error: Command '['python3', '-m', 'pytest', '-o',
	'addopts=-vra', '-o', 'filterwarnings=ignore::DeprecationWarning',
	'--ignore=tests/test_unit/test_metadata/test_unsupported_serializer.py',
	'--ignore=tests/test_unit/test_negotiation/test_breaking_contract.py',
	'--ignore=tests/test_unit/test_negotiation/test_global_configuration.py',
	'--ignore=tests/test_unit/test_openapi/test_schema_snapshots.py',
	'--ignore=tests/test_unit/test_plugins/test_pydantic/test_pydantic_fast.py',
	'--ignore=tests/test_unit/test_routing/test_not_found_handler.py',
	'--ignore=tests/test_unit/test_routing/test_server_error_handler.py',
	'--ignore=tests/test_unit/test_streaming/test_sse/test_sse_settings.py',
	'--ignore=tests/test_unit/test_throttling/test_throttling_and_parsing.py',
	'tests/test_unit/']' returned non-zero exit status 1.
	error: Bad exit status from /usr/src/tmp/rpmb-tmp.Mnkw5Z (%check)

python3-module-haversine-2.9.0-alt1
	SKIPPED [1] tests/test_performance.py:41: Skipped
	FAILED tests/test_performance.py::test_inverse_haversine - assert np.float64(...
	=================== 1 failed, 73 passed, 2 skipped in 3.49s ====================
	INFO	 : Command's result: FAILURE
	INFO	 : Command's error: Command '['python3', '-m', 'pytest', '-ra']' returned
	non-zero exit status 1.
	error: Bad exit status from /usr/src/tmp/rpmb-tmp.ouq5Xj (%check)

python3-module-trimesh-4.11.0-alt1
	tests/test_primitives.py::test_primitives
	hasher-privd: parent: handle_io: idle time limit (3600 seconds) exceeded

	28 error logs REMOVED from the list
altlinux-freedesktop-menu-0.70-alt2
bakefile-0.2.13-alt1
dotnet-diagnostics-8.0.505301-alt2
eartag-1.0.3-alt1
fonts-ttf-Iosevka-34.8.1-alt1
fonts-ttf-IosevkaSlab-34.8.1-alt1
fonts-ttf-IosevkaTermSlab-34.8.1-alt1
guile-fibers-1.4.3-alt1
hamlib-4.7.2-alt1
jellyfin-10.11.9-alt1
jline2-0:2.14.6-alt2
libfprint2-1.94.100-alt1
libratbag-0.18-alt1
mapserver-8.6.4-alt1
ocaml-lsp-1.27.0-alt2
perl-Starlet-0.31-alt1_22
python3-module-astor-0.8.1-alt1.1
python3-module-jsonpath-ng-1.8.0-alt1.1
python3-module-paho-2.1.0-alt2
python3-module-pygame-2.6.1-alt4
python3-module-python-lsp-server-1.15.0-alt1
python3-module-rapidfuzz-3.14.6-alt1
python3-module-signxml-5.1.0-alt1
python3-module-zict-3.0.0-alt1
stockfish-18-alt1
trusttunnel-1.0.33-alt2
wabt-1.0.41-alt1
watchexec-2.7.3-alt1

Total 338 error logs.


^ permalink raw reply	[flat|nested] only message in thread

only message in thread, other threads:[~2026-09-30  7:34 UTC | newest]

Thread overview: (only message) (download: mbox.gz / follow: Atom feed)
-- links below jump to the message on this page --
2026-09-30  7:34 [cyber] I: Sisyphus-20260930 x86_64 beehive_status: +13 -28 (338) ALT beekeeper

ALT Linux Sisyphus cybertalk

This inbox may be cloned and mirrored by anyone:

	git clone --mirror http://lore.altlinux.org/sisyphus-cybertalk/0 sisyphus-cybertalk/git/0.git

	# If you have public-inbox 1.1+ installed, you may
	# initialize and index your mirror using the following commands:
	public-inbox-init -V2 sisyphus-cybertalk sisyphus-cybertalk/ http://lore.altlinux.org/sisyphus-cybertalk \
		sisyphus-cybertalk@lists.altlinux.org sisyphus-cybertalk@lists.altlinux.ru sisyphus-cybertalk@lists.altlinux.com
	public-inbox-index sisyphus-cybertalk

Example config snippet for mirrors.
Newsgroup available over NNTP:
	nntp://lore.altlinux.org/org.altlinux.lists.sisyphus-cybertalk


AGPL code for this site: git clone https://public-inbox.org/public-inbox.git