ALT Linux Sisyphus cybertalk
 help / color / mirror / Atom feed
* [cyber] I: Sisyphus-20260929 x86_64 beehive_status: +45 -27 (353)
@ 2026-09-29  5:48 ALT beekeeper
  0 siblings, 0 replies; only message in thread
From: ALT beekeeper @ 2026-09-29  5:48 UTC (permalink / raw)
  To: sisyphus-cybertalk

[-- Warning: decoded text below may be mangled, UTF-8 assumed --]
[-- Attachment #1: Type: text/plain; charset=unknown-8bit, Size: 78569 bytes --]

	45 NEW error logs

altlinux-freedesktop-menu-0.70-alt2
	+ for i in desktop-directories/*.directory
	++ basename desktop-directories/altlinux-xfce.directory
	+ j=altlinux-xfce.directory
	+ grep altlinux-xfce.directory ignore.list
	+ rm ignore.list
	+ '[' 0 -gt 0 ']'
	+ exit 1
	error: Bad exit status from /usr/src/tmp/rpmb-tmp.sFLNKt (%check)
	RPM build errors:
	Bad exit status from /usr/src/tmp/rpmb-tmp.sFLNKt (%check)

apparmor-4.1.7-alt1.1
	libapparmor_wrap.c: In function ‘_wrap_aa_splitcon’:
	libapparmor_wrap.c:6577:14: error: expected expression before ‘%’ token
	6577 |	     arg1 = %new_copy_array(con_ptr, con_len+1, char);
	error: Command '['x86_64-alt-linux-gcc', '-fno-strict-overflow', '-Wsign-compare',
	'-DDYNAMIC_ANNOTATIONS_ENABLED=1', '-DNDEBUG', '-g', '-O3', '-Wall', '-pipe',
	'-frecord-gcc-switches', '-Wall', '-g', '-O3', '-flto=auto', '-ffat-lto-objects',
	'-pipe', '-frecord-gcc-switches', '-Wall', '-g', '-O3', '-flto=auto', '-ffat-lto-objects',
	'-I/usr/include/python3.14', '-I/usr/include/python3.14', '-pipe', '-frecord-gcc-switches',
	'-Wall', '-g', '-O2', '-Wall', '-Wsign-compare', '-Wmissing-field-initializers',
	'-Wformat', '-Wformat-security', '-Wunused-parameter', '-Wimplicit-fallthrough', '-fPIC',
	'-I../../include', '-I/usr/include/python3.14', '-c', 'libapparmor_wrap.c', '-o',
	'build/temp.linux-x86_64-cpython-314/libapparmor_wrap.o']' returned non-zero exit status 1.
	make[3]: *** [Makefile:667: all-local] Error 1

bakefile-0.2.13-alt1
	src/bkl_c_wrap.c:2522:5: note: (near initialization for 'slots[2]')
	src/bkl_c_wrap.c:2522:7: error: 'Py_tp_str' undeclared (first use in this function)
	2522 |	   { Py_tp_str, (void *)SwigPyPacked_str },
	--
	src/bkl_c_wrap.c:2523:5: note: (near initialization for 'slots[3]')
	src/bkl_c_wrap.c:2523:7: error: 'Py_tp_getattro' undeclared (first use in this function)
	2523 |	   { Py_tp_getattro, (void *)PyObject_GenericGetAttr },
	--
	src/bkl_c_wrap.c:2524:5: note: (near initialization for 'slots[4]')
	src/bkl_c_wrap.c:2524:7: error: 'Py_tp_doc' undeclared (first use in this function)
	2524 |	   { Py_tp_doc, (void *)SwigPyPacked_doc },
	--
	src/bkl_c_wrap.c:2525:10: note: (near initialization for 'slots[5]')
	src/bkl_c_wrap.c:2527:3: error: unknown type name 'PyType_Spec'; did you mean
	'PyType_Check'?
	2527 |	 PyType_Spec spec = {
	|   PyType_Check
	src/bkl_c_wrap.c:949:29: error: initialization of 'int' from 'char *' makes integer
	from pointer without a cast [-Wint-conversion]
	949 | #define SWIG_RUNTIME_MODULE "swig_runtime_data" SWIG_RUNTIME_VERSION
	--
	src/bkl_c_wrap.c:2532:5: note: (near initialization for 'spec')
	src/bkl_c_wrap.c:2534:22: error: initialization of 'PyObject *' {aka 'struct _object *'}
	from 'int' makes pointer from integer without a cast [-Wint-conversion]
	2534 |	 PyObject *pytype = PyType_FromSpec(&spec);
	src/bkl_c_wrap.c: In function 'PyInit__bkl_c':
	src/bkl_c_wrap.c:4031:10: error: unknown type name 'PyModuleDef_Slot'
	4031 |	 static PyModuleDef_Slot SwigSlots[] = {
	--
	src/bkl_c_wrap.c:4032:5: note: (near initialization for 'SwigSlots[0]')
	src/bkl_c_wrap.c:4033:7: error: 'Py_mod_exec' undeclared (first use in this function);
	did you mean 'SWIG_mod_exec'?
	4033 |	     Py_mod_exec, (void *)SWIG_mod_exec
	--
	src/bkl_c_wrap.c:4043:10: note: (near initialization for 'SwigSlots[1]')
	src/bkl_c_wrap.c:4047:17: error: variable 'SWIG_module' has initializer but incomplete type
	4047 |	 static struct PyModuleDef SWIG_module = {
	src/bkl_c_wrap.c:4048:5: error: 'PyModuleDef_HEAD_INIT' undeclared (first use in this
	function); did you mean 'PyObject_HEAD_INIT'?
	4048 |	   PyModuleDef_HEAD_INIT,

dotnet-diagnostics-8.0.505301-alt2
	Failed to execute 'wget -v -O
	/usr/src/RPM/BUILD/dotnet-diagnostics-8.0.505301//.dotnet/dotnet-install.sh
	https://dotnet.microsoft.com/download/dotnet/scripts/v1/dotnet-install.sh'. Waiting 80
	seconds before next attempt (4 out of 5).
	/usr/src/RPM/BUILD/dotnet-diagnostics-8.0.505301/eng/common/tools.sh: line 280: wget:
	command not found
	Failed to execute 'wget -v -O
	/usr/src/RPM/BUILD/dotnet-diagnostics-8.0.505301//.dotnet/dotnet-install.sh
	https://dotnet.microsoft.com/download/dotnet/scripts/v1/dotnet-install.sh'. Waiting
	242 seconds before next attempt (5 out of 5).
	/usr/src/RPM/BUILD/dotnet-diagnostics-8.0.505301/eng/common/tools.sh: line 280: wget:
	command not found
	Failed to execute 'wget -v -O
	/usr/src/RPM/BUILD/dotnet-diagnostics-8.0.505301//.dotnet/dotnet-install.sh
	https://dotnet.microsoft.com/download/dotnet/scripts/v1/dotnet-install.sh'. Waiting
	728 seconds before next attempt (6 out of 5).
	Failed to execute 'wget -v -O
	/usr/src/RPM/BUILD/dotnet-diagnostics-8.0.505301//.dotnet/dotnet-install.sh
	https://dotnet.microsoft.com/download/dotnet/scripts/v1/dotnet-install.sh' for 5 times.
	Failed to acquire dotnet install script (exit code '1').
	error: Bad exit status from /usr/src/tmp/rpmb-tmp.ZyKB4C (%build)
	RPM build errors:
	Bad exit status from /usr/src/tmp/rpmb-tmp.ZyKB4C (%build)

dtc-1.8.1-alt2
	[43/48] Compiling C object pylibfdt/_libfdt.cpython-314.so.p/meson-generated_.._libfdt.c.o
	FAILED: [code=1] pylibfdt/_libfdt.cpython-314.so.p/meson-generated_.._libfdt.c.o
	cc -Ipylibfdt/_libfdt.cpython-314.so.p -Ipylibfdt -I../pylibfdt -Ilibfdt
	-I../libfdt -I/usr/include/python3.14 -fvisibility=hidden -fdiagnostics-color=always
	-D_FILE_OFFSET_BITS=64 -Wall -Winvalid-pch -Werror -O2 -g -Wpointer-arith -Wcast-qual
	-Wnested-externs -Wstrict-prototypes -Wmissing-prototypes -Wredundant-decls
	-Wshadow -Wsuggest-attribute=format -Wwrite-strings -Wdiscarded-qualifiers
	-DFDT_ASSUME_MASK=0 -DNO_YAML -DNO_VALGRIND -pipe -frecord-gcc-switches -Wall -g -O2
	-fPIC -DPY_SSIZE_T_CLEAN -Wno-cast-qual -Wno-missing-prototypes -Wno-redundant-decls
	-MD -MQ pylibfdt/_libfdt.cpython-314.so.p/meson-generated_.._libfdt.c.o
	-MF pylibfdt/_libfdt.cpython-314.so.p/meson-generated_.._libfdt.c.o.d -o
	pylibfdt/_libfdt.cpython-314.so.p/meson-generated_.._libfdt.c.o -c pylibfdt/libfdt.c
	pylibfdt/libfdt.c: In function ‘_wrap_fdt_next_node’:
	pylibfdt/libfdt.c:5555:20: error: implicit declaration of function ‘PyInt_AsLong’;
	did you mean ‘PyLong_AsLong’? [-Wimplicit-function-declaration]
	5555 |	   depth3 = (int) PyInt_AsLong(swig_obj[2]);
	|		     PyLong_AsLong
	pylibfdt/libfdt.c:5555:20: error: nested extern declaration of ‘PyInt_AsLong’
	[-Werror=nested-externs]
	pylibfdt/libfdt.c: In function ‘_wrap_fdt_get_property_by_offset’:
	pylibfdt/libfdt.c:6606:19: error: implicit declaration
	of function ‘PyString_FromString’; did you mean
	‘PyLong_FromString’? [-Wimplicit-function-declaration]
	6606 |	     resultobj = PyString_FromString(
	|		    PyLong_FromString
	pylibfdt/libfdt.c:6606:19: error: nested extern declaration of ‘PyString_FromString’
	[-Werror=nested-externs]
	pylibfdt/libfdt.c:6606:17: error: assignment to ‘PyObject *’ {aka ‘struct _object
	*’} from ‘int’ makes pointer from integer without a cast [-Wint-conversion]
	6606 |	     resultobj = PyString_FromString(
	pylibfdt/libfdt.c: In function ‘_wrap_fdt_get_property_by_offset_w’:
	pylibfdt/libfdt.c:6660:17: error: assignment to ‘PyObject *’ {aka ‘struct _object
	*’} from ‘int’ makes pointer from integer without a cast [-Wint-conversion]
	6660 |	     resultobj = PyString_FromString(
	pylibfdt/libfdt.c: In function ‘_wrap_fdt_get_property’:
	pylibfdt/libfdt.c:6723:17: error: assignment to ‘PyObject *’ {aka ‘struct _object
	*’} from ‘int’ makes pointer from integer without a cast [-Wint-conversion]
	6723 |	     resultobj = PyString_FromString(
	pylibfdt/libfdt.c: In function ‘_wrap_fdt_get_property_w’:
	pylibfdt/libfdt.c:6788:17: error: assignment to ‘PyObject *’ {aka ‘struct _object
	*’} from ‘int’ makes pointer from integer without a cast [-Wint-conversion]
	6788 |	     resultobj = PyString_FromString(
	cc1: all warnings being treated as errors
	[44/48] Compiling C object dtc.p/flattree.c.o

eartag-1.0.3-alt1
	stderr:
	Fatal Python error: Segmentation fault
	Thread 0x00007f4c5f5436c0 [asyncio_0] (most recent call first):

gdcm-3.2.5-alt2
	/usr/src/RPM/BUILD/gdcm-3.2.5/x86_64-alt-linux/Wrapping/Python/CMakeFiles/gdcmswig.dir/gdcmswigPYTHON_wrap.cxx:
	In function 'PyObject* _wrap_DataElement_SetByteStringValue(PyObject*, PyObject*)':
	/usr/src/RPM/BUILD/gdcm-3.2.5/x86_64-alt-linux/Wrapping/Python/CMakeFiles/gdcmswig.dir/gdcmswigPYTHON_wrap.cxx:23153:12:
	error: 'PyString_AsString' was not declared in this scope
	23153 |     arg2 = PyString_AsString(swig_obj[1]);
	/usr/src/RPM/BUILD/gdcm-3.2.5/x86_64-alt-linux/Wrapping/Python/CMakeFiles/gdcmswig.dir/gdcmswigPYTHON_wrap.cxx:23157:25:
	error: 'PyString_Size' was not declared in this scope; did you mean 'PyMapping_Size'?
	23157 |     Py_ssize_t length = PyString_Size(swig_obj[1]);
	--
	/usr/src/RPM/BUILD/gdcm-3.2.5/x86_64-alt-linux/Wrapping/Python/CMakeFiles/gdcmswig.dir/gdcmswigPYTHON_wrap.cxx:
	In function 'PyObject* _wrap_Bitmap_GetDimensions(PyObject*, PyObject*)':
	/usr/src/RPM/BUILD/gdcm-3.2.5/x86_64-alt-linux/Wrapping/Python/CMakeFiles/gdcmswig.dir/gdcmswigPYTHON_wrap.cxx:32218:21:
	error: 'PyInt_FromLong' was not declared in this scope; did you mean 'PyLong_FromLong'?
	32218 |       PyObject *o = PyInt_FromLong((long) result[i]);
	--
	/usr/src/RPM/BUILD/gdcm-3.2.5/x86_64-alt-linux/Wrapping/Python/CMakeFiles/gdcmswig.dir/gdcmswigPYTHON_wrap.cxx:
	In function 'PyObject* _wrap_CSAElement_SetByteStringValue(PyObject*, PyObject*)':
	/usr/src/RPM/BUILD/gdcm-3.2.5/x86_64-alt-linux/Wrapping/Python/CMakeFiles/gdcmswig.dir/gdcmswigPYTHON_wrap.cxx:37926:12:
	error: 'PyString_AsString' was not declared in this scope
	37926 |     arg2 = PyString_AsString(swig_obj[1]);
	/usr/src/RPM/BUILD/gdcm-3.2.5/x86_64-alt-linux/Wrapping/Python/CMakeFiles/gdcmswig.dir/gdcmswigPYTHON_wrap.cxx:37930:25:
	error: 'PyString_Size' was not declared in this scope; did you mean 'PyMapping_Size'?
	37930 |     Py_ssize_t length = PyString_Size(swig_obj[1]);
	--
	/usr/src/RPM/BUILD/gdcm-3.2.5/x86_64-alt-linux/Wrapping/Python/CMakeFiles/gdcmswig.dir/gdcmswigPYTHON_wrap.cxx:
	In function 'PyObject* _wrap_ImageCodec_GetDimensions(PyObject*, PyObject*)':
	/usr/src/RPM/BUILD/gdcm-3.2.5/x86_64-alt-linux/Wrapping/Python/CMakeFiles/gdcmswig.dir/gdcmswigPYTHON_wrap.cxx:75497:21:
	error: 'PyInt_FromLong' was not declared in this scope; did you mean 'PyLong_FromLong'?
	75497 |       PyObject *o = PyInt_FromLong((long) result[i]);

gnucash-5.16-alt1
	[410/870] Building CXX object bindings/guile/CMakeFiles/gnucash-guile.dir/swig-engine.cpp.o
	FAILED: [code=1] bindings/guile/CMakeFiles/gnucash-guile.dir/swig-engine.cpp.o
	/usr/bin/c++ -DBOOST_ATOMIC_DYN_LINK -DBOOST_ATOMIC_NO_LIB -DBOOST_CHARCONV_DYN_LINK
	-DBOOST_CHARCONV_NO_LIB -DBOOST_CHRONO_DYN_LINK -DBOOST_CHRONO_NO_LIB
	-DBOOST_CONTAINER_DYN_LINK -DBOOST_CONTAINER_NO_LIB -DBOOST_DATE_TIME_DYN_LINK
	-DBOOST_DATE_TIME_NO_LIB -DBOOST_FILESYSTEM_DYN_LINK -DBOOST_FILESYSTEM_NO_LIB
	-DBOOST_LOCALE_DYN_LINK -DBOOST_LOCALE_NO_LIB -DBOOST_THREAD_DYN_LINK
	-DBOOST_THREAD_NO_LIB -DGLIB_VERSION_MAX_ALLOWED=GLIB_VERSION_2_68
	-DGLIB_VERSION_MIN_REQUIRED=GLIB_VERSION_2_68 -DHAVE_CONFIG_H -DHAVE_GUILE22
	-D_GNU_SOURCE -Dgnucash_guile_EXPORTS -I/usr/src/RPM/BUILD/gnucash-5.16/bindings/guile
	-I/usr/include/guile/2.2 -I/usr/src/RPM/BUILD/gnucash-5.16/common
	-I/usr/src/RPM/BUILD/gnucash-5.16/x86_64-alt-linux/common
	-I/usr/src/RPM/BUILD/gnucash-5.16/x86_64-alt-linux/libgnucash/core-utils
	-I/usr/src/RPM/BUILD/gnucash-5.16/libgnucash/core-utils
	-I/usr/src/RPM/BUILD/gnucash-5.16/borrowed/ctre
	-I/usr/src/RPM/BUILD/gnucash-5.16/libgnucash/engine
	-I/usr/src/RPM/BUILD/gnucash-5.16/borrowed/libc
	-I/usr/src/RPM/BUILD/gnucash-5.16/libgnucash/app-utils -isystem
	/usr/include/glib-2.0 -isystem /usr/lib64/glib-2.0/include -Werror -Wall
	-Wmissing-declarations -DGLIB_DISABLE_DEPRECATION_WARNINGS -std=c++17 -fPIC
	-MD -MT bindings/guile/CMakeFiles/gnucash-guile.dir/swig-engine.cpp.o
	-MF bindings/guile/CMakeFiles/gnucash-guile.dir/swig-engine.cpp.o.d
	-o bindings/guile/CMakeFiles/gnucash-guile.dir/swig-engine.cpp.o -c
	/usr/src/RPM/BUILD/gnucash-5.16/x86_64-alt-linux/bindings/guile/swig-engine.cpp
	/usr/src/RPM/BUILD/gnucash-5.16/x86_64-alt-linux/bindings/guile/swig-engine.cpp:
	In function 'scm_unused_struct* _wrap_GncOptionDBPtr_foreach_section__SWIG_1(int,
	scm_unused_struct**)':
	/usr/src/RPM/BUILD/gnucash-5.16/x86_64-alt-linux/bindings/guile/swig-engine.cpp:4575:27:
	error: ISO C++ says that these are ambiguous, even though the worst conversion for the
	first is better than the worst conversion for the second: [-Werror]
	4575 |	 (*arg1)->foreach_section(SWIG_STD_MOVE(*(&arg2)));
	--
	117 |	  void foreach_section(std::function<void(GncOptionSectionPtr&)> func)
	cc1plus: all warnings being treated as errors
	ninja: build stopped: subcommand failed.

google-api-ruby-client-20251103-alt1.3
	Wrote: /usr/src/in/nosrpm/google-api-ruby-client-20251103-alt1.3.nosrc.rpm (w1.gzdio)
	error: failed build dependencies:
	gem(redis) >= 5.0.8 conflicts with google-api-ruby-client-20251103-alt1.3

gpgmepy-2.0.0-alt1
	python3-gpg/gpgme_wrap.c: In function ‘_wrap_gpgme_data_seek’:
	python3-gpg/gpgme_wrap.c:4085:14: error: implicit declaration of function
	‘PyInt_Check’; did you mean ‘PySet_Check’? [-Wimplicit-function-declaration]
	4085 |	   else if (PyInt_Check(swig_obj[1]))
	|	       PySet_Check
	python3-gpg/gpgme_wrap.c:4086:12: error: implicit declaration of function
	‘PyInt_AsLong’; did you mean ‘PyLong_AsLong’? [-Wimplicit-function-declaration]
	4086 |	   arg2 = PyInt_AsLong(swig_obj[1]);
	--
	python3-gpg/gpgme_wrap.c: In function ‘_wrap_gpgme_op_receive_keys_start’:
	python3-gpg/gpgme_wrap.c:33926:18: error: implicit declaration of function
	‘PyString_Check’; did you mean ‘PyMapping_Check’? [-Wimplicit-function-declaration]
	33926 |		else if (PyString_Check(o))
	|		   PyMapping_Check
	python3-gpg/gpgme_wrap.c:33927:19: error: implicit declaration of function
	‘PyString_AsString’ [-Wimplicit-function-declaration]
	33927 |		arg2[i] = PyString_AsString(o);
	python3-gpg/gpgme_wrap.c:33927:17: error: assignment to ‘char *’ from ‘int’
	makes pointer from integer without a cast [-Wint-conversion]
	33927 |		arg2[i] = PyString_AsString(o);
	python3-gpg/gpgme_wrap.c: In function ‘_wrap_gpgme_op_receive_keys’:
	python3-gpg/gpgme_wrap.c:34013:17: error: assignment to ‘char *’ from ‘int’
	makes pointer from integer without a cast [-Wint-conversion]
	34013 |		arg2[i] = PyString_AsString(o);
	python3-gpg/gpgme_wrap.c: In function ‘_wrap_gpgme_op_export_ext_start’:
	python3-gpg/gpgme_wrap.c:34679:17: error: assignment to ‘char *’ from ‘int’
	makes pointer from integer without a cast [-Wint-conversion]
	34679 |		arg2[i] = PyString_AsString(o);
	python3-gpg/gpgme_wrap.c: In function ‘_wrap_gpgme_op_export_ext’:
	python3-gpg/gpgme_wrap.c:34995:17: error: assignment to ‘char *’ from ‘int’
	makes pointer from integer without a cast [-Wint-conversion]
	34995 |		arg2[i] = PyString_AsString(o);
	python3-gpg/gpgme_wrap.c: In function ‘_wrap_gpgme_op_keylist_ext_start’:
	python3-gpg/gpgme_wrap.c:40448:17: error: assignment to ‘char *’ from ‘int’
	makes pointer from integer without a cast [-Wint-conversion]
	40448 |		arg2[i] = PyString_AsString(o);
	python3-gpg/gpgme_wrap.c: In function ‘_wrap_gpgme_op_spawn_start’:
	python3-gpg/gpgme_wrap.c:41083:17: error: assignment to ‘char *’ from ‘int’
	makes pointer from integer without a cast [-Wint-conversion]
	41083 |		arg3[i] = PyString_AsString(o);

guile-fibers-1.4.3-alt1
	heap grew too much: 12.15 MiB vs. 5.12 MiB
	FAIL: tests/cancel-timer.scm
	success
	--
	PASS: tests/concurrent-web-server.scm
	1 of 13 tests failed
	(1 test was not run)

hamlib-4.7.2-alt1
	hamlibpy_wrap.c: In function '_wrap_rig_caps_preamp_get':
	hamlibpy_wrap.c:14632:34: error: implicit declaration of function 'PyInt_FromLong';
	did you mean 'PyLong_FromLong'? [-Wimplicit-function-declaration]
	14632 |       PyList_SetItem(resultobj,i,PyInt_FromLong((long)result[i]));
	|				   PyLong_FromLong
	hamlibpy_wrap.c:14632:34: error: passing argument 3 of 'PyList_SetItem' makes pointer
	from integer without a cast [-Wint-conversion]
	14632 |       PyList_SetItem(resultobj,i,PyInt_FromLong((long)result[i]));
	--
	hamlibpy_wrap.c: In function '_wrap_rig_caps_attenuator_get':
	hamlibpy_wrap.c:14700:34: error: passing argument 3 of 'PyList_SetItem' makes pointer
	from integer without a cast [-Wint-conversion]
	14700 |       PyList_SetItem(resultobj,i,PyInt_FromLong((long)result[i]));
	--
	hamlibpy_wrap.c: In function '_wrap_rig_caps_spectrum_attenuator_get':
	hamlibpy_wrap.c:16838:34: error: passing argument 3 of 'PyList_SetItem' makes pointer
	from integer without a cast [-Wint-conversion]
	16838 |       PyList_SetItem(resultobj,i,PyInt_FromLong((long)result[i]));
	--
	hamlibpy_wrap.c: In function '_wrap_rig_state_preamp_get':
	hamlibpy_wrap.c:25074:34: error: passing argument 3 of 'PyList_SetItem' makes pointer
	from integer without a cast [-Wint-conversion]
	25074 |       PyList_SetItem(resultobj,i,PyInt_FromLong((long)result[i]));
	--
	hamlibpy_wrap.c: In function '_wrap_rig_state_attenuator_get':
	hamlibpy_wrap.c:25142:34: error: passing argument 3 of 'PyList_SetItem' makes pointer
	from integer without a cast [-Wint-conversion]
	25142 |       PyList_SetItem(resultobj,i,PyInt_FromLong((long)result[i]));
	--
	hamlibpy_wrap.c: In function '_wrap_rig_state_spectrum_attenuator_get':
	hamlibpy_wrap.c:31067:34: error: passing argument 3 of 'PyList_SetItem' makes pointer
	from integer without a cast [-Wint-conversion]
	31067 |       PyList_SetItem(resultobj,i,PyInt_FromLong((long)result[i]));

hugin-2025.0.1-alt1
	cd /usr/src/RPM/BUILD/hugin-2025.0.1/x86_64-alt-linux/src/tools && /usr/bin/cmake -E
	cmake_link_script CMakeFiles/verdandi.dir/link.txt --verbose=1
	/usr/bin/c++ -pipe -frecord-gcc-switches -Wall -g -O2 -flto=auto -O2 -g -DNDEBUG  -fopenmp
	-Wl,--dependency-file=CMakeFiles/verdandi.dir/link.d CMakeFiles/verdandi.dir/verdandi.cpp.o
	-o verdandi  -Wl,-rpath,/usr/src/RPM/BUILD/hugin-2025.0.1/x86_64-alt-linux/src/hugin_base:
	../hugin_base/libhuginbase.so.0.0 /usr/lib64/libpano13.so
	../foreign/levmar/libhuginlevmar.a /usr/lib64/libfftw3.so /usr/lib64/libvigraimpex.so
	/usr/lib64/libOpenEXR.so /usr/lib64/libImath-3_2.so /usr/lib64/libIex.so
	/usr/lib64/libIlmThread.so /usr/lib64/libz.so /usr/lib64/libtiff.so /usr/lib64/libz.so
	/usr/lib64/libexiv2.so /usr/lib64/liblcms2.so /usr/lib64/libvigraimpex.so
	/usr/lib64/libOpenEXR.so /usr/lib64/libImath-3_2.so /usr/lib64/libIex.so
	/usr/lib64/libIlmThread.so /usr/lib64/libz.so /usr/lib64/libtiff.so /usr/lib64/libz.so
	/usr/lib64/libexiv2.so /usr/lib64/libX11.so /usr/lib64/libpano13.so /usr/lib64/libOpenGL.so
	/usr/lib64/libGLX.so /usr/lib64/libGLU.so /usr/lib64/libepoxy.so /usr/lib64/libsqlite3.so
	/usr/lib64/libOpenEXR.so /usr/lib64/libImath-3_2.so /usr/lib64/libIex.so
	/usr/lib64/libIlmThread.so /usr/lib64/libOpenEXR.so /usr/lib64/libImath-3_2.so
	/usr/lib64/libIex.so /usr/lib64/libIlmThread.so /usr/lib64/libz.so
	/usr/lib64/libvigraimpex.so /usr/lib64/libexiv2.so /usr/lib64/libtiff.so
	/usr/lib64/liblcms2.so
	gmake[2]: Leaving directory '/usr/src/RPM/BUILD/hugin-2025.0.1/x86_64-alt-linux'
	gmake[1]: Entering directory '/usr/src/RPM/BUILD/hugin-2025.0.1/x86_64-alt-linux'
	[ 62%] Built target verdandi
	gmake[1]: Leaving directory '/usr/src/RPM/BUILD/hugin-2025.0.1/x86_64-alt-linux'
	gmake: *** [Makefile:156: all] Error 2
	error: Bad exit status from /usr/src/tmp/rpmb-tmp.wu46mX (%build)
	RPM build errors:
	Bad exit status from /usr/src/tmp/rpmb-tmp.wu46mX (%build)

ifcopenshell-0.8.4-alt3
	/usr/src/RPM/BUILD/ifcopenshell-0.8.4/cmake/x86_64-alt-linux/ifcwrap/CMakeFiles/ifcopenshell_wrapper.dir/IfcPythonPYTHON_wrap.cxx:
	In function 'PyObject* _wrap_simple_type_declared_type(PyObject*, PyObject*)':
	/usr/src/RPM/BUILD/ifcopenshell-0.8.4/cmake/x86_64-alt-linux/ifcwrap/CMakeFiles/ifcopenshell_wrapper.dir/IfcPythonPYTHON_wrap.cxx:86566:17:
	error: 'SWIG_Python_str_FromChar' was not declared in this scope
	86566 |     resultobj = SWIG_Python_str_FromChar(data_type_strings[(int)result]);

libftdi1-1.5-alt3.2
	/usr/src/RPM/BUILD/libftdi1-1.5/python/CMakeFiles/_ftdi1.dir/ftdi1PYTHON_wrap.c: In
	function '_wrap_read_data':
	/usr/src/RPM/BUILD/libftdi1-1.5/python/CMakeFiles/_ftdi1.dir/ftdi1PYTHON_wrap.c:3985:10:
	error: implicit declaration of function 'PyInt_AsLong'; did you mean
	'PyLong_AsLong'? [-Wimplicit-function-declaration]
	3985 |	 arg3 = PyInt_AsLong(swig_obj[1]);arg2 = (unsigned char*)malloc(arg3*sizeof(char));

libratbag-0.18-alt1
	[69/78] Compiling C object _libratbag.so.p/meson-generated_libratbag.c.o
	FAILED: [code=1] _libratbag.so.p/meson-generated_libratbag.c.o
	cc -I_libratbag.so.p -I. -I.. -I../src -I../tools -I/usr/include/libevdev-1.0
	-I/usr/include/glib-2.0 -I/usr/lib64/glib-2.0/include -I/usr/include/json-glib-1.0
	-I/usr/include/python3.14 -fdiagnostics-color=always -D_FILE_OFFSET_BITS=64 -Wall
	-Winvalid-pch -Wextra -std=gnu99 -O2 -g -Wno-unused-parameter -fvisibility=hidden
	-Wmissing-prototypes -Wformat -Werror=format-security -Wstrict-prototypes
	-pipe -frecord-gcc-switches -Wall -g -O2 -flto=auto -fPIC -pthread
	-Wno-missing-prototypes -Wno-format-nonliteral -Wno-missing-field-initializers
	-MD -MQ _libratbag.so.p/meson-generated_libratbag.c.o
	-MF _libratbag.so.p/meson-generated_libratbag.c.o.d -o
	_libratbag.so.p/meson-generated_libratbag.c.o -c _libratbag.so.p/libratbag.c
	_libratbag.so.p/libratbag.c: In function ‘_wrap_ratbag_device_get_vendor_id’:
	_libratbag.so.p/libratbag.c:4583:17: error: implicit declaration of function
	‘PyInt_FromLong’; did you mean ‘PyLong_FromLong’? [-Wimplicit-function-declaration]
	4583 |	   resultobj = PyInt_FromLong((long) result);
	|		  PyLong_FromLong
	_libratbag.so.p/libratbag.c:4583:15: error: assignment to ‘PyObject *’ {aka ‘struct
	_object *’} from ‘int’ makes pointer from integer without a cast [-Wint-conversion]
	4583 |	   resultobj = PyInt_FromLong((long) result);
	_libratbag.so.p/libratbag.c: In function ‘_wrap_ratbag_device_get_product_id’:
	_libratbag.so.p/libratbag.c:4609:15: error: assignment to ‘PyObject *’ {aka ‘struct
	_object *’} from ‘int’ makes pointer from integer without a cast [-Wint-conversion]
	4609 |	   resultobj = PyInt_FromLong((long) result);
	_libratbag.so.p/libratbag.c: In function ‘_wrap_ratbag_device_get_product_version’:
	_libratbag.so.p/libratbag.c:4635:15: error: assignment to ‘PyObject *’ {aka ‘struct
	_object *’} from ‘int’ makes pointer from integer without a cast [-Wint-conversion]
	4635 |	   resultobj = PyInt_FromLong((long) result);
	_libratbag.so.p/libratbag.c: In function ‘_wrap_ratbag_profile_get_report_rate_list’:
	_libratbag.so.p/libratbag.c:5168:12: error: implicit declaration of function
	‘PyInt_Check’; did you mean ‘PySet_Check’? [-Wimplicit-function-declaration]
	5168 |	     if (!PyInt_Check(s)) {
	|	     PySet_Check
	_libratbag.so.p/libratbag.c:5173:17: error: implicit declaration of function
	‘PyInt_AsLong’; did you mean ‘PyLong_AsLong’? [-Wimplicit-function-declaration]
	5173 |	     arg2[i] = PyInt_AsLong(s);
	|		  PyLong_AsLong
	_libratbag.so.p/libratbag.c:5182:38: error: passing argument 3 of ‘PyList_SetItem’
	makes pointer from integer without a cast [-Wint-conversion]
	5182 |	     PyList_SetItem(swig_obj[1], i, PyInt_FromLong(arg2[i]));
	--
	_libratbag.so.p/libratbag.c: In function ‘_wrap_ratbag_profile_get_debounce_list’:
	_libratbag.so.p/libratbag.c:5350:38: error: passing argument 3 of ‘PyList_SetItem’
	makes pointer from integer without a cast [-Wint-conversion]
	5350 |	     PyList_SetItem(swig_obj[1], i, PyInt_FromLong(arg2[i]));
	--
	_libratbag.so.p/libratbag.c: In function ‘_wrap_ratbag_resolution_get_dpi_list’:
	_libratbag.so.p/libratbag.c:5688:38: error: passing argument 3 of ‘PyList_SetItem’
	makes pointer from integer without a cast [-Wint-conversion]
	5688 |	     PyList_SetItem(swig_obj[1], i, PyInt_FromLong(arg2[i]));

libselinux-1:3.9-alt1
	selinuxswig_python_wrap.c: In function ‘_wrap_get_ordered_context_list’:
	selinuxswig_python_wrap.c:6646:34: error: implicit declaration
	of function ‘PyString_FromString’; did you mean
	‘PyLong_FromString’? [-Wimplicit-function-declaration]
	6646 |	       PyList_SetItem(plist, i, PyString_FromString((*arg3)[i]));
	|				   PyLong_FromString
	selinuxswig_python_wrap.c:6646:34: error: passing argument 3 of ‘PyList_SetItem’
	makes pointer from integer without a cast [-Wint-conversion]
	6646 |	       PyList_SetItem(plist, i, PyString_FromString((*arg3)[i]));
	--
	selinuxswig_python_wrap.c: In function ‘_wrap_get_ordered_context_list_with_level’:
	selinuxswig_python_wrap.c:6724:34: error: passing argument 3 of ‘PyList_SetItem’
	makes pointer from integer without a cast [-Wint-conversion]
	6724 |	       PyList_SetItem(plist, i, PyString_FromString((*arg4)[i]));
	--
	selinuxswig_python_wrap.c: In function ‘_wrap_security_compute_user’:
	selinuxswig_python_wrap.c:11498:34: error: passing argument 3 of ‘PyList_SetItem’
	makes pointer from integer without a cast [-Wint-conversion]
	11498 |		PyList_SetItem(plist, i, PyString_FromString((*arg3)[i]));
	--
	selinuxswig_python_wrap.c: In function ‘_wrap_security_compute_user_raw’:
	selinuxswig_python_wrap.c:11569:34: error: passing argument 3 of ‘PyList_SetItem’
	makes pointer from integer without a cast [-Wint-conversion]
	11569 |		PyList_SetItem(plist, i, PyString_FromString((*arg3)[i]));
	--
	selinuxswig_python_wrap.c: In function ‘_wrap_security_get_boolean_names’:
	selinuxswig_python_wrap.c:12473:31: error: passing argument 3 of ‘PyList_SetItem’
	makes pointer from integer without a cast [-Wint-conversion]
	12473 |       PyList_SetItem(list, i, PyString_FromString((*arg1)[i]));
	--
	35 | PyAPI_FUNC(int) PyList_SetItem(PyObject *, Py_ssize_t, PyObject *);
	error: Command '['x86_64-alt-linux-gcc', '-fno-strict-overflow', '-Wsign-compare',
	'-DDYNAMIC_ANNOTATIONS_ENABLED=1', '-DNDEBUG', '-g', '-O3', '-Wall', '-pipe',
	'-frecord-gcc-switches', '-Wall', '-g', '-O3', '-flto=auto', '-ffat-lto-objects', '-pipe',
	'-frecord-gcc-switches', '-Wall', '-g', '-O3', '-flto=auto', '-ffat-lto-objects', '-pipe',
	'-frecord-gcc-switches', '-Wall', '-g', '-O2', '-flto=auto', '-ffat-lto-objects',
	'-D_FILE_OFFSET_BITS=64', '-D_LARGEFILE_SOURCE', '-D_FILE_OFFSET_BITS=64',
	'-I../include', '-D_GNU_SOURCE', '-DNO_ANDROID_BACKEND', '-DUSE_PCRE2',
	'-DPCRE2_CODE_UNIT_WIDTH=8', '-DHAVE_STRLCPY', '-DHAVE_REALLOCARRAY', '-Wno-error',
	'-Wno-unused-variable', '-Wno-unused-but-set-variable', '-Wno-unused-parameter',
	'-Wno-shadow', '-Wno-uninitialized', '-Wno-missing-prototypes',
	'-Wno-missing-declarations', '-Wno-deprecated-declarations', '-fPIC',
	'-I../include', '-I/usr/include/python3.14', '-c', 'selinuxswig_python_wrap.c', '-o',
	'build/temp.linux-x86_64-cpython-314/selinuxswig_python_wrap.o']' returned non-zero
	exit status 1.
	Traceback (most recent call last):
	--
	raise RuntimeError(err_msg) from None
	RuntimeError: build_wheel failed
	make[1]: *** [Makefile:156: pywrap] Error 1

libsigrok-0.6.0-alt0.20251120.1
	sigrok/core/classes_wrap.cpp: In function ‘Glib::VariantBase
	python_to_variant_by_key(PyObject*, const sigrok::ConfigKey*)’:
	sigrok/core/classes_wrap.cpp:7652:32: error: ‘PyInt_Check’ was not declared in this
	scope; did you mean ‘PySet_Check’?
	7652 |	   if (type == SR_T_UINT64 && PyInt_Check(input))
	|				 PySet_Check
	sigrok/core/classes_wrap.cpp:7653:47: error: ‘PyInt_AsLong’ was not declared in
	this scope; did you mean ‘PyLong_AsLong’?
	7653 |	       return Glib::Variant<guint64>::create(PyInt_AsLong(input));
	|						PyLong_AsLong
	sigrok/core/classes_wrap.cpp:7662:36: error: ‘PyInt_Check’ was not declared in this
	scope; did you mean ‘PySet_Check’?
	7662 |	   else if (type == SR_T_INT32 && PyInt_Check(input))
	|				     PySet_Check
	sigrok/core/classes_wrap.cpp:7663:46: error: ‘PyInt_AsLong’ was not declared in
	this scope; did you mean ‘PyLong_AsLong’?
	7663 |	       return Glib::Variant<gint32>::create(PyInt_AsLong(input));
	|					       PyLong_AsLong
	sigrok/core/classes_wrap.cpp:7665:47: error: ‘PyInt_AsLong’ was not declared in
	this scope; did you mean ‘PyLong_AsLong’?
	7665 |	       return Glib::Variant<guint32>::create(PyInt_AsLong(input));
	|						PyLong_AsLong
	sigrok/core/classes_wrap.cpp:7670:52: error: ‘PyInt_AsLong’ was not declared in
	this scope; did you mean ‘PyLong_AsLong’?
	7670 |		 const std::vector<guint64> v = {(guint64)PyInt_AsLong(numObj),
	(guint64)PyInt_AsLong(denomObj)};
	|						     PyLong_AsLong
	sigrok/core/classes_wrap.cpp:7670:105: error: could not convert ‘{<expression error>,
	<expression error>}’ from ‘<brace-enclosed initializer list>’ to ‘const
	std::vector<long unsigned int>’
	7670 |		 const std::vector<guint64> v = {(guint64)PyInt_AsLong(numObj),
	(guint64)PyInt_AsLong(denomObj)};
	|
	<brace-enclosed initializer list>
	sigrok/core/classes_wrap.cpp:7680:30: error: ‘PyInt_AsLong’ was not declared in
	this scope; did you mean ‘PyLong_AsLong’?
	7680 |			   (guint32)PyInt_AsLong(numObj),
	--
	sigrok/core/classes_wrap.cpp: In function ‘Glib::VariantBase
	python_to_variant_by_option(PyObject*, std::shared_ptr<sigrok::Option>)’:
	sigrok/core/classes_wrap.cpp:7695:42: error: ‘PyInt_Check’ was not declared in this
	scope; did you mean ‘PySet_Check’?
	7695 |	   if (type == G_VARIANT_TYPE_UINT64 && PyInt_Check(input))
	|					   PySet_Check
	sigrok/core/classes_wrap.cpp:7696:47: error: ‘PyInt_AsLong’ was not declared in
	this scope; did you mean ‘PyLong_AsLong’?
	7696 |	       return Glib::Variant<guint64>::create(PyInt_AsLong(input));

logtop-0.7-alt1.1
	logtop_wrap.c: In function ‘_wrap_logtop_get’:
	logtop_wrap.c:3649:36: error: implicit declaration of function ‘PyInt_FromLong’;
	did you mean ‘PyLong_FromLong’? [-Wimplicit-function-declaration]
	3649 |	     PyTuple_SetItem(log_line, 0, PyInt_FromLong(result->lines[i]->count));
	|				     PyLong_FromLong
	logtop_wrap.c:3649:36: error: passing argument 3 of ‘PyTuple_SetItem’ makes pointer
	from integer without a cast [-Wint-conversion]
	3649 |	     PyTuple_SetItem(log_line, 0, PyInt_FromLong(result->lines[i]->count));
	--
	33 | PyAPI_FUNC(int) PyTuple_SetItem(PyObject *, Py_ssize_t, PyObject *);
	logtop_wrap.c:3651:36: error: implicit declaration of function ‘PyString_FromString’;
	did you mean ‘PyLong_FromString’? [-Wimplicit-function-declaration]
	3651 |	     PyTuple_SetItem(log_line, 2, PyString_FromString(result->lines[i]->string));
	|				     PyLong_FromString
	logtop_wrap.c:3651:36: error: passing argument 3 of ‘PyTuple_SetItem’ makes pointer
	from integer without a cast [-Wint-conversion]
	3651 |	     PyTuple_SetItem(log_line, 2, PyString_FromString(result->lines[i]->string));
	--
	33 | PyAPI_FUNC(int) PyTuple_SetItem(PyObject *, Py_ssize_t, PyObject *);
	logtop_wrap.c:3658:9: error: assignment to ‘PyObject *’ {aka ‘struct _object *’}
	from ‘int’ makes pointer from integer without a cast [-Wint-conversion]
	3658 |	   tmp = PyInt_FromLong(result->count);
	error: Command '['x86_64-alt-linux-gcc', '-fno-strict-overflow', '-Wsign-compare',
	'-DDYNAMIC_ANNOTATIONS_ENABLED=1', '-DNDEBUG', '-g', '-O3', '-Wall', '-pipe',
	'-frecord-gcc-switches', '-Wall', '-g', '-O3', '-flto=auto', '-ffat-lto-objects',
	'-pipe', '-frecord-gcc-switches', '-Wall', '-g', '-O3', '-flto=auto',
	'-ffat-lto-objects', '-fPIC', '-I/usr/include/python3.14', '-c', 'logtop_wrap.c', '-o',
	'build/temp.linux-x86_64-cpython-314/logtop_wrap.o']' returned non-zero exit status 1.
	make: *** [Makefile:57: python3-module] Error 1

mapserver-8.6.4-alt1
	/usr/src/RPM/BUILD/mapserver-8.6.4/x86_64-alt-linux/src/mapscript/python/CMakeFiles/pythonmapscript.dir/mapscriptPYTHON_wrap.c:
	In function 'mapObj_getLayerOrder':
	/usr/src/RPM/BUILD/mapserver-8.6.4/x86_64-alt-linux/src/mapscript/python/CMakeFiles/pythonmapscript.dir/mapscriptPYTHON_wrap.c:5980:37:
	error: implicit declaration of function 'PyInt_FromLong'; did you mean
	'PyLong_FromLong'? [-Wimplicit-function-declaration]
	5980 |		   PyTuple_SetItem(order,i,PyInt_FromLong((long)self->layerorder[i]));
	|				      PyLong_FromLong
	/usr/src/RPM/BUILD/mapserver-8.6.4/x86_64-alt-linux/src/mapscript/python/CMakeFiles/pythonmapscript.dir/mapscriptPYTHON_wrap.c:5980:37:
	error: passing argument 3 of 'PyTuple_SetItem' makes pointer from integer without a cast
	[-Wint-conversion]
	5980 |		   PyTuple_SetItem(order,i,PyInt_FromLong((long)self->layerorder[i]));
	--
	/usr/src/RPM/BUILD/mapserver-8.6.4/x86_64-alt-linux/src/mapscript/python/CMakeFiles/pythonmapscript.dir/mapscriptPYTHON_wrap.c:
	In function 'mapObj_setLayerOrder':
	/usr/src/RPM/BUILD/mapserver-8.6.4/x86_64-alt-linux/src/mapscript/python/CMakeFiles/pythonmapscript.dir/mapscriptPYTHON_wrap.c:5988:40:
	error: implicit declaration of function 'PyInt_AsLong'; did you mean
	'PyLong_AsLong'? [-Wimplicit-function-declaration]
	5988 |		   self->layerorder[i] = (int)PyInt_AsLong(PyTuple_GetItem(order, i));
	--
	/usr/src/RPM/BUILD/mapserver-8.6.4/x86_64-alt-linux/src/mapscript/python/CMakeFiles/pythonmapscript.dir/mapscriptPYTHON_wrap.c:
	In function 'mapObj_getSize':
	/usr/src/RPM/BUILD/mapserver-8.6.4/x86_64-alt-linux/src/mapscript/python/CMakeFiles/pythonmapscript.dir/mapscriptPYTHON_wrap.c:5995:34:
	error: passing argument 3 of 'PyTuple_SetItem' makes pointer from integer without a cast
	[-Wint-conversion]
	5995 |	       PyTuple_SetItem(output,0,PyInt_FromLong((long)self->width));
	--
	33 | PyAPI_FUNC(int) PyTuple_SetItem(PyObject *, Py_ssize_t, PyObject *);
	/usr/src/RPM/BUILD/mapserver-8.6.4/x86_64-alt-linux/src/mapscript/python/CMakeFiles/pythonmapscript.dir/mapscriptPYTHON_wrap.c:5996:34:
	error: passing argument 3 of 'PyTuple_SetItem' makes pointer from integer without a cast
	[-Wint-conversion]
	5996 |	       PyTuple_SetItem(output,1,PyInt_FromLong((long)self->height));

mupdf-1.28.2-alt1
	(+18.1s): -b: 3: __main__.py:2238:build: platform/python/mupdfcpp_swig.i.cpp: In
	member function ‘virtual void SwigDirector_PdfProcessor2::op_SC_color(fz_context*,
	int, float*)’:
	(+18.1s): -b: 3: __main__.py:2238:build: platform/python/mupdfcpp_swig.i.cpp:31972:66:
	error: ‘PyString_FromString’ was not declared in this scope; did you mean
	‘PyLong_FromString’?
	(+18.1s): -b: 3: __main__.py:2238:build: 31972 |	     PyObject* format_tb =
	PyDict_GetItem(traceback_dict, PyString_FromString("format_tb"));
	--
	(+18.1s): -b: 3: __main__.py:2238:build: platform/python/mupdfcpp_swig.i.cpp: In
	member function ‘virtual void SwigDirector_PdfProcessor2::op_sc_color(fz_context*,
	int, float*)’:
	(+18.1s): -b: 3: __main__.py:2238:build: platform/python/mupdfcpp_swig.i.cpp:32144:66:
	error: ‘PyString_FromString’ was not declared in this scope; did you mean
	‘PyLong_FromString’?
	(+18.1s): -b: 3: __main__.py:2238:build: 32144 |	     PyObject* format_tb =
	PyDict_GetItem(traceback_dict, PyString_FromString("format_tb"));
	--
	(+18.2s): -b: 3: __main__.py:2238:build: platform/python/mupdfcpp_swig.i.cpp: In member
	function ‘virtual void SwigDirector_PdfProcessor2::op_G(fz_context*, float)’:
	(+18.2s): -b: 3: __main__.py:2238:build: platform/python/mupdfcpp_swig.i.cpp:32314:66:
	error: ‘PyString_FromString’ was not declared in this scope; did you mean
	‘PyLong_FromString’?
	(+18.2s): -b: 3: __main__.py:2238:build: 32314 |	     PyObject* format_tb =
	PyDict_GetItem(traceback_dict, PyString_FromString("format_tb"));
	--
	(+18.2s): -b: 3: __main__.py:2238:build: platform/python/mupdfcpp_swig.i.cpp: In member
	function ‘virtual void SwigDirector_PdfProcessor2::op_g(fz_context*, float)’:
	(+18.2s): -b: 3: __main__.py:2238:build: platform/python/mupdfcpp_swig.i.cpp:32484:66:
	error: ‘PyString_FromString’ was not declared in this scope; did you mean
	‘PyLong_FromString’?
	(+18.2s): -b: 3: __main__.py:2238:build: 32484 |	     PyObject* format_tb =
	PyDict_GetItem(traceback_dict, PyString_FromString("format_tb"));
	--
	(+18.2s): -b: 3: __main__.py:2238:build: platform/python/mupdfcpp_swig.i.cpp: In member
	function ‘virtual void SwigDirector_PdfProcessor2::op_RG(fz_context*, float, float,
	float)’:
	(+18.2s): -b: 3: __main__.py:2238:build: platform/python/mupdfcpp_swig.i.cpp:32658:66:
	error: ‘PyString_FromString’ was not declared in this scope; did you mean
	‘PyLong_FromString’?
	(+18.2s): -b: 3: __main__.py:2238:build: 32658 |	     PyObject* format_tb =
	PyDict_GetItem(traceback_dict, PyString_FromString("format_tb"));
	--
	(+18.2s): -b: 3: __main__.py:2238:build: platform/python/mupdfcpp_swig.i.cpp: In member
	function ‘virtual void SwigDirector_PdfProcessor2::op_rg(fz_context*, float, float,
	float)’:
	(+18.2s): -b: 3: __main__.py:2238:build: platform/python/mupdfcpp_swig.i.cpp:32832:66:
	error: ‘PyString_FromString’ was not declared in this scope; did you mean
	‘PyLong_FromString’?
	(+18.2s): -b: 3: __main__.py:2238:build: 32832 |	     PyObject* format_tb =
	PyDict_GetItem(traceback_dict, PyString_FromString("format_tb"));
	--
	(+18.2s): -b: 3: __main__.py:2238:build: platform/python/mupdfcpp_swig.i.cpp: In member
	function ‘virtual void SwigDirector_PdfProcessor2::op_K(fz_context*, float, float,
	float, float)’:
	(+18.2s): -b: 3: __main__.py:2238:build: platform/python/mupdfcpp_swig.i.cpp:33008:66:
	error: ‘PyString_FromString’ was not declared in this scope; did you mean
	‘PyLong_FromString’?
	(+18.2s): -b: 3: __main__.py:2238:build: 33008 |	     PyObject* format_tb =
	PyDict_GetItem(traceback_dict, PyString_FromString("format_tb"));
	--
	(+18.3s): -b: 3: __main__.py:2238:build: platform/python/mupdfcpp_swig.i.cpp: In member
	function ‘virtual void SwigDirector_PdfProcessor2::op_k(fz_context*, float, float,
	float, float)’:
	(+18.3s): -b: 3: __main__.py:2238:build: platform/python/mupdfcpp_swig.i.cpp:33184:66:
	error: ‘PyString_FromString’ was not declared in this scope; did you mean
	‘PyLong_FromString’?
	(+18.3s): -b: 3: __main__.py:2238:build: 33184 |	     PyObject* format_tb =
	PyDict_GetItem(traceback_dict, PyString_FromString("format_tb"));
	--
	(+18.3s): -b: 3: __main__.py:2238:build: platform/python/mupdfcpp_swig.i.cpp: In member
	function ‘virtual void SwigDirector_PdfProcessor2::op_BI(fz_context*, fz_image*,
	const char*)’:
	(+18.3s): -b: 3: __main__.py:2238:build: platform/python/mupdfcpp_swig.i.cpp:33356:66:
	error: ‘PyString_FromString’ was not declared in this scope; did you mean
	‘PyLong_FromString’?
	(+18.3s): -b: 3: __main__.py:2238:build: 33356 |	     PyObject* format_tb =
	PyDict_GetItem(traceback_dict, PyString_FromString("format_tb"));
	--
	(+18.3s): -b: 3: __main__.py:2238:build: platform/python/mupdfcpp_swig.i.cpp: In member
	function ‘virtual void SwigDirector_PdfProcessor2::op_sh(fz_context*, const char*,
	fz_shade*)’:
	(+18.3s): -b: 3: __main__.py:2238:build: platform/python/mupdfcpp_swig.i.cpp:33528:66:
	error: ‘PyString_FromString’ was not declared in this scope; did you mean
	‘PyLong_FromString’?
	(+18.3s): -b: 3: __main__.py:2238:build: 33528 |	     PyObject* format_tb =
	PyDict_GetItem(traceback_dict, PyString_FromString("format_tb"));

mypaint-2.0.1-alt2.3
	lib/tiledsurface.hpp: In function ‘PyObject* get_module(char*)’:
	lib/tiledsurface.hpp:134:23: error: ‘PyString_FromString’ was not declared in this
	scope; did you mean ‘PyLong_FromString’?
	134 |	  PyObject *pName = PyString_FromString(name);
	|			PyLong_FromString
	error: Command '['/usr/bin/x86_64-alt-linux-g++', '-pipe',
	'-frecord-gcc-switches', '-Wall', '-g', '-O2', '-flto=auto', '-fPIC',
	'-I/usr/lib64/python3/site-packages/numpy/_core/include', '-I/usr/include/libmypaint',
	'-I/usr/include/json-c', '-I/usr/include/glib-2.0', '-I/usr/lib64/glib-2.0/include',
	'-I/usr/include/pygobject-3.0', '-I/usr/include/gtk-3.0', '-I/usr/include/gio-unix-2.0',
	'-I/usr/include/pango-1.0', '-I/usr/include/harfbuzz', '-I/usr/include/atk-1.0',
	'-I/usr/include/cairo', '-I/usr/include/freetype2', '-I/usr/include/gdk-pixbuf-2.0',
	'-I/usr/include/libpng16', '-I/usr/include/python3.14', '-c', 'lib/mypaintlib_wrap.cpp',
	'-o', 'build/temp.linux-x86_64-cpython-314/lib/mypaintlib_wrap.o', '--std=c++11', '-Wall',
	'-Wno-sign-compare', '-Wno-write-strings', '-D_POSIX_C_SOURCE=200809L', '-DNO_TESTS',
	'-g', '-pthread', '-DMYPAINT_BRUSHES_DIR=\\"/usr/share/mypaint-data/2.0/brushes\\"',
	'-fopenmp', '-O3']' returned non-zero exit status 1.
	error: Bad exit status from /usr/src/tmp/rpmb-tmp.EDmWR9 (%build)

mysql-workbench-community-8.0.47-alt8
	/usr/src/RPM/BUILD/mysql-workbench-community-8.0.47/x86_64-alt-linux/library/forms/swig/CMakeFiles/_mforms.dir/mformsPYTHON_wrap.cxx:42071:28:
	error: 'PyString_AsString' was not declared in this scope
	42071 |     arg2 = new std::string(PyString_AsString(swig_obj[1]));
	/usr/src/RPM/BUILD/mysql-workbench-community-8.0.47/x86_64-alt-linux/library/forms/swig/CMakeFiles/_mforms.dir/mformsPYTHON_wrap.cxx:
	In function 'PyObject* _wrap_TreeNodeRef_set_icon_path(PyObject*, PyObject*)':
	/usr/src/RPM/BUILD/mysql-workbench-community-8.0.47/x86_64-alt-linux/library/forms/swig/CMakeFiles/_mforms.dir/mformsPYTHON_wrap.cxx:42943:30:
	error: 'PyString_AsString' was not declared in this scope
	42943 |       arg3 = new std::string(PyString_AsString(tmp));
	/usr/src/RPM/BUILD/mysql-workbench-community-8.0.47/x86_64-alt-linux/library/forms/swig/CMakeFiles/_mforms.dir/mformsPYTHON_wrap.cxx:42946:14:
	error: 'PyString_Check' was not declared in this scope; did you mean 'PyMapping_Check'?
	42946 |     else if (PyString_Check(swig_obj[2]))
	|	       PyMapping_Check
	/usr/src/RPM/BUILD/mysql-workbench-community-8.0.47/x86_64-alt-linux/library/forms/swig/CMakeFiles/_mforms.dir/mformsPYTHON_wrap.cxx:42947:28:
	error: 'PyString_AsString' was not declared in this scope
	42947 |     arg3 = new std::string(PyString_AsString(swig_obj[2]));
	/usr/src/RPM/BUILD/mysql-workbench-community-8.0.47/x86_64-alt-linux/library/forms/swig/CMakeFiles/_mforms.dir/mformsPYTHON_wrap.cxx:
	In function 'PyObject* _wrap_TreeNodeRef_set_string(PyObject*, PyObject*)':
	/usr/src/RPM/BUILD/mysql-workbench-community-8.0.47/x86_64-alt-linux/library/forms/swig/CMakeFiles/_mforms.dir/mformsPYTHON_wrap.cxx:43005:30:
	error: 'PyString_AsString' was not declared in this scope
	43005 |       arg3 = new std::string(PyString_AsString(tmp));
	/usr/src/RPM/BUILD/mysql-workbench-community-8.0.47/x86_64-alt-linux/library/forms/swig/CMakeFiles/_mforms.dir/mformsPYTHON_wrap.cxx:43008:14:
	error: 'PyString_Check' was not declared in this scope; did you mean 'PyMapping_Check'?
	43008 |     else if (PyString_Check(swig_obj[2]))
	|	       PyMapping_Check
	/usr/src/RPM/BUILD/mysql-workbench-community-8.0.47/x86_64-alt-linux/library/forms/swig/CMakeFiles/_mforms.dir/mformsPYTHON_wrap.cxx:43009:28:
	error: 'PyString_AsString' was not declared in this scope
	43009 |     arg3 = new std::string(PyString_AsString(swig_obj[2]));
	/usr/src/RPM/BUILD/mysql-workbench-community-8.0.47/x86_64-alt-linux/library/forms/swig/CMakeFiles/_mforms.dir/mformsPYTHON_wrap.cxx:
	In function 'PyObject* _wrap_TreeNodeRef_find_child_with_tag(PyObject*, PyObject*)':
	/usr/src/RPM/BUILD/mysql-workbench-community-8.0.47/x86_64-alt-linux/library/forms/swig/CMakeFiles/_mforms.dir/mformsPYTHON_wrap.cxx:43845:30:
	error: 'PyString_AsString' was not declared in this scope
	43845 |       arg2 = new std::string(PyString_AsString(tmp));
	/usr/src/RPM/BUILD/mysql-workbench-community-8.0.47/x86_64-alt-linux/library/forms/swig/CMakeFiles/_mforms.dir/mformsPYTHON_wrap.cxx:43848:14:
	error: 'PyString_Check' was not declared in this scope; did you mean 'PyMapping_Check'?
	43848 |     else if (PyString_Check(swig_obj[1]))
	|	       PyMapping_Check
	/usr/src/RPM/BUILD/mysql-workbench-community-8.0.47/x86_64-alt-linux/library/forms/swig/CMakeFiles/_mforms.dir/mformsPYTHON_wrap.cxx:43849:28:
	error: 'PyString_AsString' was not declared in this scope
	43849 |     arg2 = new std::string(PyString_AsString(swig_obj[1]));

naps2-8.3.2-alt1
	/usr/src/RPM/BUILD/naps2-8.3.2/NAPS2.Escl/NAPS2.Escl.csproj : error NU1102: Unable
	to find package Microsoft.NETCore.App.Runtime.linux-x64 with version (= 10.0.12)
	[/usr/src/RPM/BUILD/naps2-8.3.2/NAPS2.App.Gtk/NAPS2.App.Gtk.csproj]
	/usr/src/RPM/BUILD/naps2-8.3.2/NAPS2.Escl/NAPS2.Escl.csproj : error NU1102:   - Found 9
	version(s) in /usr/src/RPM/BUILD/naps2-8.3.2/nuget-sources [ Nearest version: 10.0.11 ]
	[/usr/src/RPM/BUILD/naps2-8.3.2/NAPS2.App.Gtk/NAPS2.App.Gtk.csproj]
	/usr/src/RPM/BUILD/naps2-8.3.2/NAPS2.Escl/NAPS2.Escl.csproj : error NU1102: Unable
	to find package Microsoft.AspNetCore.App.Runtime.linux-x64 with version (= 10.0.12)
	[/usr/src/RPM/BUILD/naps2-8.3.2/NAPS2.App.Gtk/NAPS2.App.Gtk.csproj]
	/usr/src/RPM/BUILD/naps2-8.3.2/NAPS2.Escl/NAPS2.Escl.csproj : error NU1102:   - Found 9
	version(s) in /usr/src/RPM/BUILD/naps2-8.3.2/nuget-sources [ Nearest version: 10.0.11 ]
	[/usr/src/RPM/BUILD/naps2-8.3.2/NAPS2.App.Gtk/NAPS2.App.Gtk.csproj]
	Failed to restore /usr/src/RPM/BUILD/naps2-8.3.2/NAPS2.Internals/NAPS2.Internals.csproj
	(in 2.07 sec).
	Failed to restore /usr/src/RPM/BUILD/naps2-8.3.2/NAPS2.Escl/NAPS2.Escl.csproj (in
	2.07 sec).
	Failed to restore /usr/src/RPM/BUILD/naps2-8.3.2/NAPS2.Images/NAPS2.Images.csproj
	(in 2.07 sec).
	error: Bad exit status from /usr/src/tmp/rpmb-tmp.IWLPrw (%build)
	RPM build errors:
	Bad exit status from /usr/src/tmp/rpmb-tmp.IWLPrw (%build)

ocaml-lsp-1.27.0-alt2
	+    detached: /-----------------------------------------------------------------------
	+    | Internal error: Uncaught exception.
	+    | ("Lev_fiber.Io: already closed",

openipmi-2.0.37-alt1
	OpenIPMI_wrap.c:18392:21: error: initialization of 'PyObject *' {aka 'struct _object *'}
	from 'int' makes pointer from integer without a cast [-Wint-conversion]
	18392 |       PyObject *o = PyString_FromString(*arg5);
	OpenIPMI_wrap.c: In function '_wrap_ipmi_fru_node_t_get_enum_val':
	OpenIPMI_wrap.c:18531:19: error: initialization of 'PyObject *' {aka 'struct _object *'}
	from 'int' makes pointer from integer without a cast [-Wint-conversion]
	18531 |     PyObject *o = PyInt_FromLong(*arg3);
	OpenIPMI_wrap.c:18544:19: error: initialization of 'PyObject *' {aka 'struct _object *'}
	from 'int' makes pointer from integer without a cast [-Wint-conversion]
	18544 |     PyObject *o = PyInt_FromLong(*arg4);
	OpenIPMI_wrap.c:18558:21: error: initialization of 'PyObject *' {aka 'struct _object *'}
	from 'int' makes pointer from integer without a cast [-Wint-conversion]
	18558 |       PyObject *o = PyString_FromString(*arg5);
	OpenIPMI_wrap.c: In function '_wrap_ipmi_event_t_get_data':
	OpenIPMI_wrap.c:20957:21: error: initialization of 'PyObject *' {aka 'struct _object *'}
	from 'int' makes pointer from integer without a cast [-Wint-conversion]
	20957 |       PyObject *o = PyInt_FromLong((&result)->val[i]);
	OpenIPMI_wrap.c: In function '_wrap_ipmi_sensor_t_threshold_event_supported':
	OpenIPMI_wrap.c:22365:19: error: initialization of 'PyObject *' {aka 'struct _object *'}
	from 'int' makes pointer from integer without a cast [-Wint-conversion]
	22365 |     PyObject *o = PyInt_FromLong(*arg3);
	OpenIPMI_wrap.c: In function '_wrap_ipmi_sensor_t_threshold_settable':
	OpenIPMI_wrap.c:22434:19: error: initialization of 'PyObject *' {aka 'struct _object *'}
	from 'int' makes pointer from integer without a cast [-Wint-conversion]
	22434 |     PyObject *o = PyInt_FromLong(*arg3);
	OpenIPMI_wrap.c: In function '_wrap_ipmi_sensor_t_threshold_readable':
	OpenIPMI_wrap.c:22503:19: error: initialization of 'PyObject *' {aka 'struct _object *'}
	from 'int' makes pointer from integer without a cast [-Wint-conversion]
	22503 |     PyObject *o = PyInt_FromLong(*arg3);
	OpenIPMI_wrap.c: In function '_wrap_ipmi_sensor_t_threshold_reading_supported':
	OpenIPMI_wrap.c:22572:19: error: initialization of 'PyObject *' {aka 'struct _object *'}
	from 'int' makes pointer from integer without a cast [-Wint-conversion]
	22572 |     PyObject *o = PyInt_FromLong(*arg3);
	OpenIPMI_wrap.c: In function '_wrap_ipmi_sensor_t_discrete_event_supported':
	OpenIPMI_wrap.c:22641:19: error: initialization of 'PyObject *' {aka 'struct _object *'}
	from 'int' makes pointer from integer without a cast [-Wint-conversion]
	22641 |     PyObject *o = PyInt_FromLong(*arg3);

partio-1.20.0-alt1
	/usr/src/RPM/BUILD/partio-1.20.0/x86_64-alt-linux/src/py/CMakeFiles/partio_mod.dir/partioPYTHON_wrap.cxx:
	In function 'PyObject* ParticlesData_findPoints(Partio::ParticlesData*, fixedFloatArray,
	fixedFloatArray)':
	/usr/src/RPM/BUILD/partio-1.20.0/x86_64-alt-linux/src/py/CMakeFiles/partio_mod.dir/partioPYTHON_wrap.cxx:4192:35:
	error: 'PyInt_FromLong' was not declared in this scope; did you mean 'PyLong_FromLong'?
	4192 |		   PyList_SetItem(list,i,PyInt_FromLong(points[i])); // tuple reference
	is stolen, so no decref needed
	--
	/usr/src/RPM/BUILD/partio-1.20.0/x86_64-alt-linux/src/py/CMakeFiles/partio_mod.dir/partioPYTHON_wrap.cxx:
	In function 'PyObject* ParticlesData_get(Partio::ParticlesData*, const
	Partio::ParticleAttribute&, Partio::ParticleIndex)':
	/usr/src/RPM/BUILD/partio-1.20.0/x86_64-alt-linux/src/py/CMakeFiles/partio_mod.dir/partioPYTHON_wrap.cxx:4200:67:
	error: 'PyInt_FromLong' was not declared in this scope; did you mean 'PyLong_FromLong'?
	4200 |		   for(int k=0;k<attr.count;k++)
	PyTuple_SetItem(tuple,k,PyInt_FromLong(p[k]));
	--
	/usr/src/RPM/BUILD/partio-1.20.0/x86_64-alt-linux/src/py/CMakeFiles/partio_mod.dir/partioPYTHON_wrap.cxx:
	In function 'PyObject* ParticlesData_getFixed(Partio::ParticlesData*, const
	Partio::FixedAttribute&)':
	/usr/src/RPM/BUILD/partio-1.20.0/x86_64-alt-linux/src/py/CMakeFiles/partio_mod.dir/partioPYTHON_wrap.cxx:4215:67:
	error: 'PyInt_FromLong' was not declared in this scope; did you mean 'PyLong_FromLong'?
	4215 |		   for(int k=0;k<attr.count;k++)
	PyTuple_SetItem(tuple,k,PyInt_FromLong(p[k]));
	--
	/usr/src/RPM/BUILD/partio-1.20.0/x86_64-alt-linux/src/py/CMakeFiles/partio_mod.dir/partioPYTHON_wrap.cxx:
	In function 'PyObject* ParticlesData_indexedStrs(const Partio::ParticlesData*, const
	Partio::ParticleAttribute&)':
	/usr/src/RPM/BUILD/partio-1.20.0/x86_64-alt-linux/src/py/CMakeFiles/partio_mod.dir/partioPYTHON_wrap.cxx:4229:68:
	error: 'PyString_FromString' was not declared in this scope; did you mean
	'PyLong_FromString'?
	4229 |	       for(size_t k=0;k<indexes.size();k++)
	PyList_SetItem(list,k,PyString_FromString(indexes[k].c_str()));
	--
	/usr/src/RPM/BUILD/partio-1.20.0/x86_64-alt-linux/src/py/CMakeFiles/partio_mod.dir/partioPYTHON_wrap.cxx:
	In function 'PyObject* ParticlesData_fixedIndexedStrs(const Partio::ParticlesData*,
	const Partio::FixedAttribute&)':
	/usr/src/RPM/BUILD/partio-1.20.0/x86_64-alt-linux/src/py/CMakeFiles/partio_mod.dir/partioPYTHON_wrap.cxx:4235:68:
	error: 'PyString_FromString' was not declared in this scope; did you mean
	'PyLong_FromString'?
	4235 |	       for(size_t k=0;k<indexes.size();k++)
	PyList_SetItem(list,k,PyString_FromString(indexes[k].c_str()));
	--
	/usr/src/RPM/BUILD/partio-1.20.0/x86_64-alt-linux/src/py/CMakeFiles/partio_mod.dir/partioPYTHON_wrap.cxx:
	In function 'PyObject* ParticlesDataMutable_set(Partio::ParticlesDataMutable*, const
	Partio::ParticleAttribute&, uint64_t, PyObject*)':
	/usr/src/RPM/BUILD/partio-1.20.0/x86_64-alt-linux/src/py/CMakeFiles/partio_mod.dir/partioPYTHON_wrap.cxx:4254:24:
	error: 'PyInt_Check' was not declared in this scope; did you mean 'PySet_Check'?
	4254 |			   if(PyInt_Check(o)){
	|			 PySet_Check
	/usr/src/RPM/BUILD/partio-1.20.0/x86_64-alt-linux/src/py/CMakeFiles/partio_mod.dir/partioPYTHON_wrap.cxx:4255:30:
	error: 'PyInt_AsLong' was not declared in this scope; did you mean 'PyLong_AsLong'?
	4255 |			       p[i]=PyInt_AsLong(o);
	|			       PyLong_AsLong
	/usr/src/RPM/BUILD/partio-1.20.0/x86_64-alt-linux/src/py/CMakeFiles/partio_mod.dir/partioPYTHON_wrap.cxx:4272:30:
	error: 'PyInt_Check' was not declared in this scope; did you mean 'PySet_Check'?
	4272 |			   }else if(PyInt_Check(o)){
	|			       PySet_Check
	/usr/src/RPM/BUILD/partio-1.20.0/x86_64-alt-linux/src/py/CMakeFiles/partio_mod.dir/partioPYTHON_wrap.cxx:4273:37:
	error: 'PyInt_AsLong' was not declared in this scope; did you mean 'PyLong_AsLong'?
	4273 |			       p[i]=(float)PyInt_AsLong(o);
	--
	/usr/src/RPM/BUILD/partio-1.20.0/x86_64-alt-linux/src/py/CMakeFiles/partio_mod.dir/partioPYTHON_wrap.cxx:
	In function 'PyObject* ParticlesDataMutable_setFixed(Partio::ParticlesDataMutable*,
	const Partio::FixedAttribute&, PyObject*)':
	/usr/src/RPM/BUILD/partio-1.20.0/x86_64-alt-linux/src/py/CMakeFiles/partio_mod.dir/partioPYTHON_wrap.cxx:4305:20:
	error: 'PyInt_Check' was not declared in this scope; did you mean 'PySet_Check'?
	4305 |		       if(PyInt_Check(o)){

perl-Starlet-0.31-alt1_22
	t/11multi-sockets.t ........ ok
	#   Failed test 'No warnings'
	#   at t/12bad_request_line.t line 24.
	--
	t/12bad_request_line.t	 (Wstat: 256 (exited 1) Tests: 2 Failed: 1)
	Failed test:  2
	Non-zero exit status: 1
	--
	Result: FAIL
	Failed 1/15 test programs. 1/146 subtests failed.
	make: *** [Makefile:753: test_dynamic] Error 255

phosphor-certificate-manager-0.0.1-alt2.gitefe7c29.1
	[19/20] Linking target test/test-certs-manager
	FAILED: [code=1] test/test-certs-manager
	c++  -o test/test-certs-manager test/test-certs-manager.p/certs_manager_test.cpp.o
	-Wl,--fatal-warnings -Wl,--as-needed -Wl,--no-undefined -pipe -frecord-gcc-switches
	-Wall -g -O2 -flto=auto -Wl,--start-group libphosphor-certificate-manager.a
	/usr/lib64/libgtest_main.so /usr/lib64/libgtest.so /usr/lib64/libgmock.so
	/usr/lib64/libssl.so /usr/lib64/libcrypto.so /usr/lib64/libphosphor_dbus.so
	/usr/lib64/libphosphor_logging.so /usr/lib64/libsdbusplus.so /usr/lib64/libsystemd.so
	/usr/lib64/libsdeventplus.so /usr/lib64/libstdplus.so /usr/lib64/libfmt.so -Wl,--end-group
	--
	/usr/src/RPM/BUILD/phosphor-certificate-manager-0.0.1/x86_64-alt-linux/../certificate.cpp:141:(.text+0x19f6):
	warning: the use of `tempnam' is dangerous, better use `mkstemp'
	collect2: error: ld returned 1 exit status
	[20/20] Linking target phosphor-certificate-manager
	FAILED: [code=1] phosphor-certificate-manager
	c++  -o phosphor-certificate-manager phosphor-certificate-manager.p/mainapp.cpp.o
	-Wl,--fatal-warnings -Wl,--as-needed -Wl,--no-undefined -pipe -frecord-gcc-switches -Wall
	-g -O2 -flto=auto -Wl,--start-group libphosphor-certificate-manager.a /usr/lib64/libssl.so
	/usr/lib64/libcrypto.so /usr/lib64/libphosphor_dbus.so /usr/lib64/libphosphor_logging.so
	/usr/lib64/libsdbusplus.so /usr/lib64/libsystemd.so /usr/lib64/libsdeventplus.so
	/usr/lib64/libstdplus.so /usr/lib64/libfmt.so -Wl,--end-group
	--
	/usr/src/RPM/BUILD/phosphor-certificate-manager-0.0.1/x86_64-alt-linux/../certificate.cpp:141:(.text+0x3c06):
	warning: the use of `tempnam' is dangerous, better use `mkstemp'
	collect2: error: ld returned 1 exit status
	ninja: build stopped: subcommand failed.

python3-module-jsonpath-ng-1.8.0-alt1.1
	=========================== short test summary info ============================
	FAILED tests/test_roundtrip.py::test_roundtrip_basic - hypothesis.errors.Fail...
	======================== 1 failed, 350 passed in 5.41s =========================
	INFO	 : Command's result: FAILURE
	INFO	 : Command's error: Command '['python3', '-m', 'pytest']' returned non-zero
	exit status 1.
	error: Bad exit status from /usr/src/tmp/rpmb-tmp.Xpv7QJ (%check)

python3-module-m2crypto-0.47.0-alt1
	src/SWIG/_m2crypto_wrap.c: In function ‘x509_store_verify_callback’:
	src/SWIG/_m2crypto_wrap.c:4906:21: error: implicit declaration of function
	‘PyInt_AsLong’; did you mean ‘PyLong_AsLong’? [-Wimplicit-function-declaration]
	4906 |	       cret = (int)PyInt_AsLong(ret);
	--
	src/SWIG/_m2crypto_wrap.c: In function ‘rsa_get_ex_data’:
	src/SWIG/_m2crypto_wrap.c:7602:12: error: implicit declaration of function
	‘PyInt_FromLong’; did you mean ‘PyLong_FromLong’? [-Wimplicit-function-declaration]
	7602 |	   return PyInt_FromLong(*data);
	|	     PyLong_FromLong
	src/SWIG/_m2crypto_wrap.c:7602:12: error: returning ‘int’ from a function with
	return type ‘PyObject *’ {aka ‘struct _object *’} makes pointer from integer
	without a cast [-Wint-conversion]
	7602 |	   return PyInt_FromLong(*data);
	src/SWIG/_m2crypto_wrap.c: In function ‘ec_get_builtin_curves’:
	src/SWIG/_m2crypto_wrap.c:9853:26: error: implicit declaration
	of function ‘PyString_FromString’; did you mean
	‘PyLong_FromString’? [-Wimplicit-function-declaration]
	9853 |				PyString_FromString(sname));
	|			   PyLong_FromString
	src/SWIG/_m2crypto_wrap.c:9853:26: error: passing argument 3 of ‘PyDict_SetItemString’
	makes pointer from integer without a cast [-Wint-conversion]
	9853 |				PyString_FromString(sname));
	--
	58 | PyAPI_FUNC(int) PyDict_SetItemString(PyObject *dp, const char *key, PyObject *item);
	src/SWIG/_m2crypto_wrap.c:9855:26: error: passing argument 3 of ‘PyDict_SetItemString’
	makes pointer from integer without a cast [-Wint-conversion]
	9855 |				PyString_FromString(comment));
	--
	58 | PyAPI_FUNC(int) PyDict_SetItemString(PyObject *dp, const char *key, PyObject *item);
	error: Command '['x86_64-alt-linux-gcc', '-fno-strict-overflow', '-Wsign-compare',
	'-DDYNAMIC_ANNOTATIONS_ENABLED=1', '-DNDEBUG', '-g', '-O3', '-Wall',
	'-pipe', '-frecord-gcc-switches', '-Wall', '-g', '-O3', '-flto=auto',
	'-ffat-lto-objects', '-pipe', '-frecord-gcc-switches', '-Wall', '-g',
	'-O3', '-flto=auto', '-ffat-lto-objects', '-pipe', '-frecord-gcc-switches',
	'-Wall', '-g', '-O2', '-flto=auto', '-fPIC', '-I/usr/include/python3.14',
	'-I/usr/src/RPM/BUILD/python3-module-m2crypto-0.47.0/src/SWIG',
	'-c', 'src/SWIG/_m2crypto_wrap.c', '-o',
	'build/temp.linux-x86_64-cpython-314/src/SWIG/_m2crypto_wrap.o', '-DTHREADING',
	'-Wno-deprecated-declarations']' returned non-zero exit status 1.
	error: Bad exit status from /usr/src/tmp/rpmb-tmp.4Ti2mv (%build)

python3-module-paho-2.1.0-alt2
	"on_disconnect",
	E	    AssertionError: assert ['on_connect'..._unsubscribe'] ==
	['on_connect'...n_disconnect']
	E
	--
	"on_disconnect",
	E	    AssertionError: assert ['on_connect'..._unsubscribe'] ==
	['on_connect'...n_disconnect']
	E
	--
	=========================== short test summary info ============================
	FAILED tests/test_client.py::TestPublish::test_publish_before_connect[unix]
	FAILED tests/test_client.py::TestCompatibility::test_callback_v1_mqtt3[tcp]
	FAILED tests/test_client.py::TestCompatibility::test_callback_v1_mqtt3[unix]
	============ 3 failed, 133 passed, 26 skipped, 1 xfailed in 35.18s =============
	INFO	 : Command's result: FAILURE
	INFO	 : Command's error: Command '['python3', '-m', 'pytest', '-o', 'addopts=',
	'tests']' returned non-zero exit status 1.
	error: Bad exit status from /usr/src/tmp/rpmb-tmp.yVYw1N (%check)

python3-module-pivy-2:0.6.11-alt1
	pivy/coin_wrap.cpp: In function ‘PyObject* _wrap_SoMFInt32_getValues__SWIG_0(PyObject*,
	Py_ssize_t, PyObject**)’:
	pivy/coin_wrap.cpp:247336:38: error: ‘PyInt_FromLong’ was not declared in this scope;
	did you mean ‘PyLong_FromLong’?
	247336 |	 PyList_SetItem(resultobj, i, PyInt_FromLong((long)result[i]));
	--
	pivy/coin_wrap.cpp: In function ‘PyObject* _wrap_SoMFInt32_getValues__SWIG_1(PyObject*,
	Py_ssize_t, PyObject**)’:
	pivy/coin_wrap.cpp:247373:38: error: ‘PyInt_FromLong’ was not declared in this scope;
	did you mean ‘PyLong_FromLong’?
	247373 |	 PyList_SetItem(resultobj, i, PyInt_FromLong((long)result[i]));
	--
	pivy/coin_wrap.cpp: In function ‘PyObject* _wrap_SoMFShort_getValues__SWIG_0(PyObject*,
	Py_ssize_t, PyObject**)’:
	pivy/coin_wrap.cpp:251663:38: error: ‘PyInt_FromLong’ was not declared in this scope;
	did you mean ‘PyLong_FromLong’?
	251663 |	 PyList_SetItem(resultobj, i, PyInt_FromLong((long)result[i]));
	--
	pivy/coin_wrap.cpp: In function ‘PyObject* _wrap_SoMFShort_getValues__SWIG_1(PyObject*,
	Py_ssize_t, PyObject**)’:
	pivy/coin_wrap.cpp:251700:38: error: ‘PyInt_FromLong’ was not declared in this scope;
	did you mean ‘PyLong_FromLong’?
	251700 |	 PyList_SetItem(resultobj, i, PyInt_FromLong((long)result[i]));
	--
	pivy/coin_wrap.cpp: In function ‘PyObject* _wrap_SoMFUInt32_getValues__SWIG_0(PyObject*,
	Py_ssize_t, PyObject**)’:
	pivy/coin_wrap.cpp:253567:38: error: ‘PyInt_FromLong’ was not declared in this scope;
	did you mean ‘PyLong_FromLong’?
	253567 |	 PyList_SetItem(resultobj, i, PyInt_FromLong((long)result[i]));
	--
	pivy/coin_wrap.cpp: In function ‘PyObject* _wrap_SoMFUInt32_getValues__SWIG_1(PyObject*,
	Py_ssize_t, PyObject**)’:
	pivy/coin_wrap.cpp:253604:38: error: ‘PyInt_FromLong’ was not declared in this scope;
	did you mean ‘PyLong_FromLong’?
	253604 |	 PyList_SetItem(resultobj, i, PyInt_FromLong((long)result[i]));
	--
	pivy/coin_wrap.cpp: In function ‘PyObject* _wrap_SoMFUShort_getValues__SWIG_0(PyObject*,
	Py_ssize_t, PyObject**)’:
	pivy/coin_wrap.cpp:254529:38: error: ‘PyInt_FromLong’ was not declared in this scope;
	did you mean ‘PyLong_FromLong’?
	254529 |	 PyList_SetItem(resultobj, i, PyInt_FromLong((long)result[i]));
	--
	pivy/coin_wrap.cpp: In function ‘PyObject* _wrap_SoMFUShort_getValues__SWIG_1(PyObject*,
	Py_ssize_t, PyObject**)’:
	pivy/coin_wrap.cpp:254566:38: error: ‘PyInt_FromLong’ was not declared in this scope;
	did you mean ‘PyLong_FromLong’?
	254566 |	 PyList_SetItem(resultobj, i, PyInt_FromLong((long)result[i]));
	--
	pivy/coin_wrap.cpp: In function ‘PyObject* _wrap_new_SbImage__SWIG_1(PyObject*,
	Py_ssize_t, PyObject**)’:
	pivy/coin_wrap.cpp:353888:12: error: ‘PyInt_AsLong’ was not declared in this scope;
	did you mean ‘PyLong_AsLong’?
	353888 |     arg3 = PyInt_AsLong(nc);
	--
	pivy/coin_wrap.cpp: In function ‘PyObject* _wrap_new_SbImage__SWIG_2(PyObject*,
	Py_ssize_t, PyObject**)’:
	pivy/coin_wrap.cpp:353933:12: error: ‘PyInt_AsLong’ was not declared in this scope;
	did you mean ‘PyLong_AsLong’?
	353933 |     arg3 = PyInt_AsLong(nc);

python3-module-pyfltk-1.3.8-alt1.2
	./fltk/fltk_wrap.cpp: In function ‘PyObject* _wrap_Fl_FormsBitmap_set(PyObject*,
	PyObject*)’:
	./fltk/fltk_wrap.cpp:93339:15: error: ‘PyInt_Check’ was not declared in this scope;
	did you mean ‘PySet_Check’?
	93339 |		  if (PyInt_Check(o))
	|		PySet_Check
	./fltk/fltk_wrap.cpp:93340:27: error: ‘PyInt_AsLong’ was not declared in this scope;
	did you mean ‘PyLong_AsLong’?
	93340 |		  arg4[i] = (char)PyInt_AsLong(o);
	--
	./fltk/fltk_wrap.cpp: In function ‘PyObject* _wrap_Fl_Gl_Window_valid__SWIG_0(PyObject*,
	Py_ssize_t, PyObject**)’:
	./fltk/fltk_wrap.cpp:95204:17: error: ‘PyInt_FromLong’ was not declared in this
	scope; did you mean ‘PyLong_FromLong’?
	95204 |     resultobj = PyInt_FromLong( (long)result);
	--
	./fltk/fltk_wrap.cpp: In function ‘PyObject*
	_wrap_Fl_Gl_Window_context_valid__SWIG_0(PyObject*, Py_ssize_t, PyObject**)’:
	./fltk/fltk_wrap.cpp:95329:17: error: ‘PyInt_FromLong’ was not declared in this
	scope; did you mean ‘PyLong_FromLong’?
	95329 |     resultobj = PyInt_FromLong( (long)result);
	--
	./fltk/fltk_wrap.cpp: In function ‘PyObject* _wrap_gl_draw_image(PyObject*,
	PyObject*)’:
	./fltk/fltk_wrap.cpp:97522:15: error: ‘PyInt_Check’ was not declared in this scope;
	did you mean ‘PySet_Check’?
	97522 |		  if (PyInt_Check(o))
	|		PySet_Check
	./fltk/fltk_wrap.cpp:97523:27: error: ‘PyInt_AsLong’ was not declared in this scope;
	did you mean ‘PyLong_AsLong’?
	97523 |		  arg1[i] = (char)PyInt_AsLong(o);
	--
	./fltk/fltk_wrap.cpp: In function ‘PyObject* _wrap_new_Fl_JPEG_Image__SWIG_1(PyObject*,
	Py_ssize_t, PyObject**)’:
	./fltk/fltk_wrap.cpp:104453:15: error: ‘PyInt_Check’ was not declared in this scope;
	did you mean ‘PySet_Check’?
	104453 |	   if (PyInt_Check(o))
	|		PySet_Check
	./fltk/fltk_wrap.cpp:104454:28: error: ‘PyInt_AsLong’ was not declared in this scope;
	did you mean ‘PyLong_AsLong’?
	104454 |	   arg3[i] = (uchar)PyInt_AsLong(o);
	--
	./fltk/fltk_wrap.cpp: In function ‘PyObject* _wrap_new_Fl_PNG_Image__SWIG_1(PyObject*,
	Py_ssize_t, PyObject**)’:
	./fltk/fltk_wrap.cpp:112032:15: error: ‘PyInt_Check’ was not declared in this scope;
	did you mean ‘PySet_Check’?
	112032 |	   if (PyInt_Check(o))
	|		PySet_Check
	./fltk/fltk_wrap.cpp:112033:28: error: ‘PyInt_AsLong’ was not declared in this scope;
	did you mean ‘PyLong_AsLong’?
	112033 |	   arg3[i] = (uchar)PyInt_AsLong(o);

python3-module-pykcs11-1.5.18-alt1
	src/pykcs11_wrap.cpp: In function ‘PyObject* _wrap_CPKCS11Lib_C_EncryptUpdate(PyObject*,
	PyObject*)’:
	src/pykcs11_wrap.cpp:16704:17: error: ‘PyInt_FromLong’ was not declared in this
	scope; did you mean ‘PyLong_FromLong’?
	16704 |     resultobj = PyInt_FromLong((long)result);
	--
	src/pykcs11_wrap.cpp: In function ‘PyObject* _wrap_CPKCS11Lib_C_EncryptFinal(PyObject*,
	PyObject*)’:
	src/pykcs11_wrap.cpp:16756:17: error: ‘PyInt_FromLong’ was not declared in this
	scope; did you mean ‘PyLong_FromLong’?
	16756 |     resultobj = PyInt_FromLong((long)result);
	--
	src/pykcs11_wrap.cpp: In function ‘PyObject* _wrap_CPKCS11Lib_C_DecryptInit(PyObject*,
	PyObject*)’:
	src/pykcs11_wrap.cpp:16821:17: error: ‘PyInt_FromLong’ was not declared in this
	scope; did you mean ‘PyLong_FromLong’?
	16821 |     resultobj = PyInt_FromLong((long)result);
	--
	src/pykcs11_wrap.cpp: In function ‘PyObject* _wrap_CPKCS11Lib_C_Decrypt(PyObject*,
	PyObject*)’:
	src/pykcs11_wrap.cpp:16883:17: error: ‘PyInt_FromLong’ was not declared in this
	scope; did you mean ‘PyLong_FromLong’?
	16883 |     resultobj = PyInt_FromLong((long)result);
	--
	src/pykcs11_wrap.cpp: In function ‘PyObject* _wrap_CPKCS11Lib_C_DecryptUpdate(PyObject*,
	PyObject*)’:
	src/pykcs11_wrap.cpp:16945:17: error: ‘PyInt_FromLong’ was not declared in this
	scope; did you mean ‘PyLong_FromLong’?
	16945 |     resultobj = PyInt_FromLong((long)result);
	--
	src/pykcs11_wrap.cpp: In function ‘PyObject* _wrap_CPKCS11Lib_C_DecryptFinal(PyObject*,
	PyObject*)’:
	src/pykcs11_wrap.cpp:16997:17: error: ‘PyInt_FromLong’ was not declared in this
	scope; did you mean ‘PyLong_FromLong’?
	16997 |     resultobj = PyInt_FromLong((long)result);
	--
	src/pykcs11_wrap.cpp: In function ‘PyObject* _wrap_CPKCS11Lib_C_DigestInit(PyObject*,
	PyObject*)’:
	src/pykcs11_wrap.cpp:17046:17: error: ‘PyInt_FromLong’ was not declared in this
	scope; did you mean ‘PyLong_FromLong’?
	17046 |     resultobj = PyInt_FromLong((long)result);
	--
	src/pykcs11_wrap.cpp: In function ‘PyObject* _wrap_CPKCS11Lib_C_Digest(PyObject*,
	PyObject*)’:
	src/pykcs11_wrap.cpp:17108:17: error: ‘PyInt_FromLong’ was not declared in this
	scope; did you mean ‘PyLong_FromLong’?
	17108 |     resultobj = PyInt_FromLong((long)result);
	--
	src/pykcs11_wrap.cpp: In function ‘PyObject* _wrap_CPKCS11Lib_C_DigestUpdate(PyObject*,
	PyObject*)’:
	src/pykcs11_wrap.cpp:17159:17: error: ‘PyInt_FromLong’ was not declared in this
	scope; did you mean ‘PyLong_FromLong’?
	17159 |     resultobj = PyInt_FromLong((long)result);
	--
	src/pykcs11_wrap.cpp: In function ‘PyObject* _wrap_CPKCS11Lib_C_DigestKey(PyObject*,
	PyObject*)’:
	src/pykcs11_wrap.cpp:17216:17: error: ‘PyInt_FromLong’ was not declared in this
	scope; did you mean ‘PyLong_FromLong’?
	17216 |     resultobj = PyInt_FromLong((long)result);

python3-module-pymupdf-1.28.2-alt1
	[+0.4s] ../../../../lib/python3/site-packages/pipcl/__init__.py:2106: build_extension():
	/usr/src/RPM/BUILD/python3-module-pymupdf-1.28.2/src/build/extra.i.cpp: In function
	‘void messagev(const char*, __va_list_tag*)’:
	[+0.4s] ../../../../lib/python3/site-packages/pipcl/__init__.py:2106: build_extension():
	/usr/src/RPM/BUILD/python3-module-pymupdf-1.28.2/src/build/extra.i.cpp:3529:25:
	error: ‘PyString_FromString’ was not declared in this scope; did you mean
	‘PyLong_FromString’?
	[+0.4s] ../../../../lib/python3/site-packages/pipcl/__init__.py:2106: build_extension():
	3529 |	   PyObject* text_py = PyString_FromString(text);
	--
	raise subprocess.CalledProcessError(e, command2, capture_text if capture else None)
	subprocess.CalledProcessError: Command 'c++ \
	-O2 -DNDEBUG \
	--
	raise RuntimeError(err_msg) from None
	RuntimeError: build_wheel failed
	error: Bad exit status from /usr/src/tmp/rpmb-tmp.6CrWp4 (%build)

python3-module-python-lsp-server-1.15.0-alt1
	SKIPPED [2] test/test_uris.py:48: Windows only
	FAILED test/test_python_lsp.py::test_concurrent_ws_requests - AssertionError: Worker
	thread <Thread(Thread-44 (thread_target), started 139986928465600)> hung!
	assert not True
	--
	INFO	 : Command's result: FAILURE
	INFO	 : Command's error: Command '['python3', '-m',
	'pytest', '-ra', '-o=addopts=-Wignore', 'test', '--deselect',
	'test/plugins/test_completion.py::test_jedi_completion_environment', '--deselect',
	'test/plugins/test_symbols.py::test_symbols_all_scopes_with_jedi_environment']' returned
	non-zero exit status 1.
	error: Bad exit status from /usr/src/tmp/rpmb-tmp.5WSeF0 (%check)

python3-module-signxml-5.1.0-alt1
	INFO	 : Command's result: FAILURE
	INFO	 : Command's error: Command '['python3', './test/test.py', '-v']' returned
	non-zero exit status 1.
	error: Bad exit status from /usr/src/tmp/rpmb-tmp.XW2bhk (%check)

qpid-proton-0.36.0-alt3
	/usr/src/RPM/BUILD/qpid-proton-0.36.0/x86_64-alt-linux/python/CMakeFiles/_cproton.dir/cprotonPYTHON_wrap.c:
	In function 'pn_pytracer':
	/usr/src/RPM/BUILD/qpid-proton-0.36.0/x86_64-alt-linux/python/CMakeFiles/_cproton.dir/cprotonPYTHON_wrap.c:3846:23:
	error: implicit declaration of function 'PyString_FromString'; did you mean
	'PyLong_FromString'? [-Wimplicit-function-declaration]
	3846 |	   PyObject *pymsg = PyString_FromString(message);
	|			PyLong_FromString
	/usr/src/RPM/BUILD/qpid-proton-0.36.0/x86_64-alt-linux/python/CMakeFiles/_cproton.dir/cprotonPYTHON_wrap.c:3846:23:
	error: initialization of 'PyObject *' {aka 'struct _object *'} from 'int' makes pointer
	from integer without a cast [-Wint-conversion]
	gmake[2]: *** [python/CMakeFiles/_cproton.dir/build.make:79:
	python/CMakeFiles/_cproton.dir/CMakeFiles/_cproton.dir/cprotonPYTHON_wrap.c.o] Error 1
	--
	cproton_wrap.c: In function ‘pn_pytracer’:
	cproton_wrap.c:3846:23: error: implicit declaration of function ‘PyString_FromString’;
	did you mean ‘PyLong_FromString’? [-Wimplicit-function-declaration]
	3846 |	   PyObject *pymsg = PyString_FromString(message);
	|			PyLong_FromString
	cproton_wrap.c:3846:23: error: initialization of ‘PyObject *’ {aka ‘struct _object
	*’} from ‘int’ makes pointer from integer without a cast [-Wint-conversion]
	cproton_wrap.c: At top level:
	--
	6625 | static int check_state(int x) {
	error: Command '['x86_64-alt-linux-gcc', '-fno-strict-overflow',
	'-Wsign-compare', '-DDYNAMIC_ANNOTATIONS_ENABLED=1', '-DNDEBUG', '-g',
	'-O3', '-Wall', '-pipe', '-frecord-gcc-switches', '-Wall', '-g', '-O3',
	'-flto=auto', '-ffat-lto-objects', '-pipe', '-frecord-gcc-switches', '-Wall',
	'-g', '-O3', '-flto=auto', '-ffat-lto-objects', '-fPIC', '-Ibuild/include',
	'-I/usr/src/RPM/BUILD/qpid-proton-0.36.0/x86_64-alt-linux/python/dist/include',
	'-I/usr/include/python3.14', '-c', 'cproton_wrap.c', '-o',
	'build/temp.linux-x86_64-cpython-314/cproton_wrap.o', '-DPROTON_DECLARE_STATIC']'
	returned non-zero exit status 1.
	gmake[2]: *** [python/CMakeFiles/py_pkg_wheel.dir/build.make:70:
	python/CMakeFiles/py_pkg_wheel] Error 1

sharpemu-0.0.4-alt1.release.2
	Restored /usr/src/RPM/BUILD/sharpemu-0.0.4-release.2/src/SharpEmu.GUI/SharpEmu.GUI.csproj
	(in 554 ms).
	Restored
	/usr/src/RPM/BUILD/sharpemu-0.0.4-release.2/tests/SharpEmu.Libs.Tests/SharpEmu.Libs.Tests.csproj
	(in 560 ms).
	Restored
	/usr/src/RPM/BUILD/sharpemu-0.0.4-release.2/src/SharpEmu.SourceGenerators/SharpEmu.SourceGenerators.csproj
	(in 642 ms).
	/usr/src/RPM/BUILD/sharpemu-0.0.4-release.2/src/SharpEmu.CLI/SharpEmu.CLI.csproj : error
	NU1301: Unable to load the service index for source https://api.nuget.org/v3/index.json.
	[/usr/src/RPM/BUILD/sharpemu-0.0.4-release.2/SharpEmu.slnx]
	/usr/src/RPM/BUILD/sharpemu-0.0.4-release.2/src/SharpEmu.CLI/SharpEmu.CLI.csproj
	: error NU1301:   Resource temporarily unavailable (api.nuget.org:443)
	[/usr/src/RPM/BUILD/sharpemu-0.0.4-release.2/SharpEmu.slnx]
	/usr/src/RPM/BUILD/sharpemu-0.0.4-release.2/src/SharpEmu.CLI/SharpEmu.CLI.csproj
	: error NU1301:   Resource temporarily unavailable
	[/usr/src/RPM/BUILD/sharpemu-0.0.4-release.2/SharpEmu.slnx]
	Failed to restore
	/usr/src/RPM/BUILD/sharpemu-0.0.4-release.2/src/SharpEmu.CLI/SharpEmu.CLI.csproj (in
	6.32 sec).
	error: Bad exit status from /usr/src/tmp/rpmb-tmp.24EIBW (%build)
	RPM build errors:
	Bad exit status from /usr/src/tmp/rpmb-tmp.24EIBW (%build)

trusttunnel-1.0.33-alt2
	test result: ok. 0 passed; 0 failed; 0 ignored; 0 measured; 0 filtered out; finished
	in 0.00s
	error: 1 target failed:
	`-p trusttunnel --test speedtest`

wabt-1.0.41-alt1
	+ test/wasm2c/spec/simd_f32x4_pmin_pmax.txt (190.360s)
	**** FAILED ******************************************************************
	- test/wasm2c/spec/memory64/memory_copy.txt

watchexec-2.7.3-alt1
	test crates/lib/src/config.rs - config::Config::error_handler (line 77) ... ok
	test crates/lib/src/error/runtime.rs - error::runtime::RuntimeError (line 14) ... ok
	test crates/lib/src/config.rs - config::Config::error_handler (line 91) ... ok
	test crates/lib/src/config.rs - config::Config::error_handler (line 67) ... ok
	test crates/lib/src/error/runtime.rs - error::runtime::RuntimeError (line 36) ... ok
	test result: ok. 11 passed; 0 failed; 0 ignored; 0 measured; 0 filtered out; finished
	in 14.54s
	--
	test result: ok. 8 passed; 0 failed; 0 ignored; 0 measured; 0 filtered out; finished
	in 5.83s
	error: 1 target failed:
	`-p watchexec --lib`

wineglass-1.2.1-alt2
	ninja: Entering directory `x86_64-alt-linux'
	ninja: error: 'x86_64-alt-linux/conf.vala', needed by
	'com.github.aggalex.wineglass.p/x86_64-alt-linux/x86_64-alt-linux/conf.c', missing and
	no known rule to make it
	error: Bad exit status from /usr/src/tmp/rpmb-tmp.bP8b6a (%build)

xraylib-4.1.5-alt1
	xraylib_wrap.c: In function '_wrap_GetRadioNuclideDataByName':
	xraylib_wrap.c:11855:41: error: passing argument 3 of 'PyDict_SetItemString' makes
	pointer from integer without a cast [-Wint-conversion]
	11855 |       PyDict_SetItemString(dict, "name",PyString_FromString(rnd->name));
	--
	58 | PyAPI_FUNC(int) PyDict_SetItemString(PyObject *dp, const char *key, PyObject *item);
	xraylib_wrap.c:11856:38: error: passing argument 3 of 'PyDict_SetItemString' makes
	pointer from integer without a cast [-Wint-conversion]
	11856 |       PyDict_SetItemString(dict, "Z",PyInt_FromLong(rnd->Z));
	--
	58 | PyAPI_FUNC(int) PyDict_SetItemString(PyObject *dp, const char *key, PyObject *item);
	xraylib_wrap.c:11857:38: error: passing argument 3 of 'PyDict_SetItemString' makes
	pointer from integer without a cast [-Wint-conversion]
	11857 |       PyDict_SetItemString(dict, "A",PyInt_FromLong(rnd->A));
	--
	58 | PyAPI_FUNC(int) PyDict_SetItemString(PyObject *dp, const char *key, PyObject *item);
	xraylib_wrap.c:11858:38: error: passing argument 3 of 'PyDict_SetItemString' makes
	pointer from integer without a cast [-Wint-conversion]
	11858 |       PyDict_SetItemString(dict, "N",PyInt_FromLong(rnd->N));
	--
	58 | PyAPI_FUNC(int) PyDict_SetItemString(PyObject *dp, const char *key, PyObject *item);
	xraylib_wrap.c:11859:43: error: passing argument 3 of 'PyDict_SetItemString' makes
	pointer from integer without a cast [-Wint-conversion]
	11859 |       PyDict_SetItemString(dict, "Z_xray",PyInt_FromLong(rnd->Z_xray));
	--
	58 | PyAPI_FUNC(int) PyDict_SetItemString(PyObject *dp, const char *key, PyObject *item);
	xraylib_wrap.c:11860:43: error: passing argument 3 of 'PyDict_SetItemString' makes
	pointer from integer without a cast [-Wint-conversion]
	11860 |       PyDict_SetItemString(dict, "nXrays",PyInt_FromLong(rnd->nXrays));
	--
	58 | PyAPI_FUNC(int) PyDict_SetItemString(PyObject *dp, const char *key, PyObject *item);
	xraylib_wrap.c:11861:44: error: passing argument 3 of 'PyDict_SetItemString' makes
	pointer from integer without a cast [-Wint-conversion]
	11861 |       PyDict_SetItemString(dict, "nGammas",PyInt_FromLong(rnd->nGammas));
	--
	xraylib_wrap.c: In function '_wrap_GetRadioNuclideDataByIndex':
	xraylib_wrap.c:11950:41: error: passing argument 3 of 'PyDict_SetItemString' makes
	pointer from integer without a cast [-Wint-conversion]
	11950 |       PyDict_SetItemString(dict, "name",PyString_FromString(rnd->name));
	--
	58 | PyAPI_FUNC(int) PyDict_SetItemString(PyObject *dp, const char *key, PyObject *item);
	xraylib_wrap.c:11951:38: error: passing argument 3 of 'PyDict_SetItemString' makes
	pointer from integer without a cast [-Wint-conversion]
	11951 |       PyDict_SetItemString(dict, "Z",PyInt_FromLong(rnd->Z));
	--
	58 | PyAPI_FUNC(int) PyDict_SetItemString(PyObject *dp, const char *key, PyObject *item);
	xraylib_wrap.c:11952:38: error: passing argument 3 of 'PyDict_SetItemString' makes
	pointer from integer without a cast [-Wint-conversion]
	11952 |       PyDict_SetItemString(dict, "A",PyInt_FromLong(rnd->A));

	27 error logs REMOVED from the list
bpftrace-0.27.0-alt1
deepin-editor-6.5.58-alt1
fonts-ttf-IosevkaTerm-34.8.1-alt1
fonts-ttf-IosevkaTermCurly-34.8.1-alt1
gawk-5.1.0.0.213.d04f-alt2
gem-resque-3.0.0-alt1
gem-rspec-retry-0.6.2.11-alt0.1
gem-ruby-growl-4.1-alt1.1
gem-rugged-1.9.0-alt1
gem-sidekiq-7.3.8-alt1
gem-socksify-1.8.1-alt1
gem-tpm-key-attestation-0.14.1-alt1
gem-webauthn-3.4.3-alt1
gnuplot-1:6.0.5-alt1
gz-gui-10.0.0-alt3
jnr-enxio-0.19-alt1_8jpp11
jnr-posix-3.0.47-alt2
perl-Parallel-Runner-0.014-alt1_3
perl-SQL-Statement-1.414-alt1
projectlibre-1.9.8-alt2
python3-module-cbor2-6.1.4-alt1
python3-module-mdp-3.6.0.15.g64f14eee-alt7
python3-module-pyrogram-2.0.106-alt1
python3-module-tenacity-8.5.0-alt1
python3-module-textdistance-4.6.3-alt1
python3-module-vcrpy-8.1.1-alt2
vector-0.58.0-alt1

Total 353 error logs.


^ permalink raw reply	[flat|nested] only message in thread

only message in thread, other threads:[~2026-09-29  5:48 UTC | newest]

Thread overview: (only message) (download: mbox.gz / follow: Atom feed)
-- links below jump to the message on this page --
2026-09-29  5:48 [cyber] I: Sisyphus-20260929 x86_64 beehive_status: +45 -27 (353) ALT beekeeper

ALT Linux Sisyphus cybertalk

This inbox may be cloned and mirrored by anyone:

	git clone --mirror http://lore.altlinux.org/sisyphus-cybertalk/0 sisyphus-cybertalk/git/0.git

	# If you have public-inbox 1.1+ installed, you may
	# initialize and index your mirror using the following commands:
	public-inbox-init -V2 sisyphus-cybertalk sisyphus-cybertalk/ http://lore.altlinux.org/sisyphus-cybertalk \
		sisyphus-cybertalk@lists.altlinux.org sisyphus-cybertalk@lists.altlinux.ru sisyphus-cybertalk@lists.altlinux.com
	public-inbox-index sisyphus-cybertalk

Example config snippet for mirrors.
Newsgroup available over NNTP:
	nntp://lore.altlinux.org/org.altlinux.lists.sisyphus-cybertalk


AGPL code for this site: git clone https://public-inbox.org/public-inbox.git