* [cyber] I: Sisyphus-20260928 x86_64 beehive_status: +16 -15 (335)
@ 2026-09-28 3:34 ALT beekeeper
0 siblings, 0 replies; only message in thread
From: ALT beekeeper @ 2026-09-28 3:34 UTC (permalink / raw)
To: sisyphus-cybertalk
16 NEW error logs
bpftrace-0.27.0-alt1
^[[94m[ SKIP ]^[[0m probe.kprobe_offset_module_error (unmet condition: 'lsmod | grep
'^nf_tables'')\r
^[[91m[ FAILED ]^[[0m 3 tests, listed below:\r
^[[91m[ FAILED ]^[[0m call.tseries\r
^[[91m[ FAILED ]^[[0m json-output.time series avg\r
^[[91m[ FAILED ]^[[0m probe.attach_to_bpf_program\r
1850.40user 1663.64system 51:09.31elapsed 114%CPU (0avgtext+0avgdata 7093408maxresident)k
fonts-ttf-IosevkaCurly-34.8.1-alt1
[ACTION] Create TTF 'dist/IosevkaCurly/TTF-Unhinted/IosevkaCurly-ExtendedHeavyItalic.ttf'
[ACTION] Create TTF 'dist/IosevkaCurly/TTF-Unhinted/IosevkaCurly-Thin.ttf'
[ACTION] Create TTF 'dist/IosevkaCurly/TTF-Unhinted/IosevkaCurly-ExtendedThin.ttf'
[ACTION] Create TTF 'dist/IosevkaCurly/TTF-Unhinted/IosevkaCurly-ThinOblique.ttf'
[ACTION] Create TTF 'dist/IosevkaCurly/TTF-Unhinted/IosevkaCurly-ExtendedThinOblique.ttf'
[ACTION] Hint TTF 'dist/IosevkaCurly/TTF/IosevkaCurly-Heavy.ttf' <-
'dist/IosevkaCurly/TTF-Unhinted/IosevkaCurly-Heavy.ttf'
/usr/src/tmp/rpmb-tmp.6FX0Te: line 134: 3932751 CPU time limit exceeded npm run build
-- ttf::IosevkaCurly
error: Bad exit status from /usr/src/tmp/rpmb-tmp.6FX0Te (%build)
RPM build errors:
Bad exit status from /usr/src/tmp/rpmb-tmp.6FX0Te (%build)
gawk-5.1.0.0.213.d04f-alt2
make[3]: Entering directory '/usr/src/RPM/BUILD/gawk-5.1.0.0.213.d04f-alt2/test'
1 TESTS FAILED
make[3]: *** [Makefile:5248: pass-fail] Error 1
gnuplot-1:6.0.5-alt1
make[1]: Leaving directory '/usr/src/RPM/BUILD/gnuplot-6.0.5/docs'
make[1]: *** Deleting file 'gnuplot.tex'
make[1]: Entering directory '/usr/src/RPM/BUILD/gnuplot-6.0.5/docs'
./doc2tex -figures ./gnuplot.doc gnuplot.tex
make[1]: *** [Makefile:1101: gnuplot.tex] Segmentation fault
make[1]: Leaving directory '/usr/src/RPM/BUILD/gnuplot-6.0.5/docs'
make: *** [Makefile:1104: pdf] Error 2
error: Bad exit status from /usr/src/tmp/rpmb-tmp.Vj6N3j (%build)
RPM build errors:
Bad exit status from /usr/src/tmp/rpmb-tmp.Vj6N3j (%build)
gz-gui-10.0.0-alt3
54/54 Test #54: check_INTEGRATION_transport_scene_manager ... Passed 0.01 sec
96% tests passed, 2 tests failed out of 54
Total Test time (real) = 143.05 sec
The following tests FAILED:
21 - UNIT_ImageDisplay_TEST (Subprocess aborted)
kernel-modules-r8168-rt-8.056.02-alt1.k.396399.1
kernel-headers-modules-rt is already the newest version.
E: Version ='8.056.02' for 'kernel-source-r8168' was not found
hsh-install: Failed to calculate package file list.
perl-SQL-Statement-1.414-alt1
t/03import.t .... ok
Fatal glibc error: pthread_mutex_lock.c:110 (___pthread_mutex_lock): assertion failed:
mutex->__data.__owner == 0
t/04idents.t ....
--
Result: FAIL
Failed 1/17 test programs. 0/6420 subtests failed.
make: *** [Makefile:792: test_dynamic] Error 255
python3-module-cbor2-6.1.4-alt1
tests/test_encoder.py::test_largest_tag PASSED [ 89%]
tests/test_encoder.py::test_invariant_encode_decode FAILED [ 89%]
tests/test_encoder.py::test_indefinite_containers PASSED [ 90%]
--
> assert loads(dumps(val)) == val
E AssertionError: assert datetime.datetime(1938, 9, 25, 0, 0,
tzinfo=datetime.timezone(datetime.timedelta(days=-1, seconds=72000))) ==
datetime.datetime(1938, 9, 25, 0, 0, tzinfo=zoneinfo.ZoneInfo(key='Atlantic/Stanley'))
E + where datetime.datetime(1938, 9, 25, 0, 0,
tzinfo=datetime.timezone(datetime.timedelta(days=-1, seconds=72000))) =
loads(b'\xc0x\x191938-09-25T00:00:00-04:00')
--
=========================== short test summary info ============================
FAILED tests/test_encoder.py::test_invariant_encode_decode - AssertionError: ...
======================== 1 failed, 460 passed in 1.49s =========================
INFO : Command's result: FAILURE
INFO : Command's error: Command '['python3', '-m', 'pytest', '-vra', '-o=addopts=']'
returned non-zero exit status 1.
error: Bad exit status from /usr/src/tmp/rpmb-tmp.arx6pr (%check)
python3-module-mdp-3.6.0.15.g64f14eee-alt7
=========================== short test summary info ============================
FAILED mdp/test/test_SFANode.py::testSFANode_rank_deficit - assert 1 == 0
============ 1 failed, 730 passed, 26 skipped, 3 warnings in 21.46s ============
python3-module-oscrypto-1.3.0-alt1.1
test_dump_certificate (tests.test_asymmetric.AsymmetricTests.test_dump_certificate) ... ok
test_dump_private (tests.test_asymmetric.AsymmetricTests.test_dump_private) ... ERROR
test_dump_private_openssl (tests.test_asymmetric.AsymmetricTests.test_dump_private_openssl)
... ok
--
test_load_order (tests.test_init.InitTests.test_load_order) ... ok
ERROR: test_dump_private (tests.test_asymmetric.AsymmetricTests.test_dump_private)
Traceback (most recent call last):
--
iterations = int(iterations / fraction / 2.0)
ZeroDivisionError: division by zero
Ran 141 tests in 0.314s
FAILED (errors=1)
error: Bad exit status from /usr/src/tmp/rpmb-tmp.SGzWTh (%check)
python3-module-rapidfuzz-3.14.6-alt1
=========================== short test summary info ============================
FAILED tests/test_hypothesis.py::test_jaro_winkler_word - AssertionError
======================== 1 failed, 420 passed in 10.59s ========================
python3-module-textdistance-4.6.3-alt1
XFAIL tests/test_external.py::test_list_of_numbers[Levenshtein] - module not installed:
distance.levenshtein
FAILED tests/test_compression/test_common.py::test_is_normalized[alg0] - Dead...
============ 1 failed, 417 passed, 12 xfailed in 103.06s (0:01:43) =============
INFO : Command's result: FAILURE
INFO : Command's error: Command '['python3', '-m', 'pytest', '-vra']' returned
non-zero exit status 1.
error: Bad exit status from /usr/src/tmp/rpmb-tmp.xANv1f (%check)
python3-module-vcrpy-8.1.1-alt2
> self.sock.sendall(data)
E BrokenPipeError: [Errno 32] Broken pipe
/usr/lib64/python3.14/http/client.py:1105: BrokenPipeError
--
=========================== short test summary info ============================
FAILED tests/unit/test_stubs.py::TestVCRConnection::test_body_consumed_once_iterator
================= 1 failed, 177 passed, 3 deselected in 1.19s ==================
INFO : Command's result: FAILURE
INFO : Command's error: Command '['python3', '-m', 'pytest', '-ra', '-m', 'not online',
'tests/unit/']' returned non-zero exit status 1.
error: Bad exit status from /usr/src/tmp/rpmb-tmp.vsxwr5 (%check)
python3-module-zict-3.0.0-alt1
File "/usr/src/RPM/BUILD/python3-module-zict-3.0.0/zict/tests/utils_test.py", line 193,
in check_different_keys_threadsafe
f1.result()
File "/usr/lib64/python3.14/concurrent/futures/_base.py", line 449, in result
self._condition.wait(timeout)
File "/usr/lib64/python3.14/threading.py", line 370, in wait
waiter.acquire()
+++++++++++++++++++++++++++++++++++ Timeout ++++++++++++++++++++++++++++++++++++
error: Bad exit status from /usr/src/tmp/rpmb-tmp.tS3NKp (%check)
RPM build errors:
Bad exit status from /usr/src/tmp/rpmb-tmp.tS3NKp (%check)
stockfish-18-alt1
+ umask 022
+ /bin/mkdir -p /usr/src/RPM/BUILD
+ cd /usr/src/RPM/BUILD
+ cd stockfish-18
+ ./src/stockfish bench
Stockfish 18 by the Stockfish developers (see AUTHORS file)
/usr/src/tmp/rpmb-tmp.zYAgGv: line 137: 207819 Segmentation fault ./src/stockfish
bench
error: Bad exit status from /usr/src/tmp/rpmb-tmp.zYAgGv (%check)
RPM build errors:
Bad exit status from /usr/src/tmp/rpmb-tmp.zYAgGv (%check)
vector-0.58.0-alt1
Compiling vector-lib v0.1.0 (/usr/src/RPM/BUILD/vector-0.58.0/lib/vector-lib)
hasher-privd: parent: handle_io: idle time limit (3600 seconds) exceeded
15 error logs REMOVED from the list
casr-2.13.1-alt2
gz-sim-10.5.0-alt1
hasher-priv-2.0.14-alt1
libgupnp-igd-1.6.0-alt1
libopencv4.13-1:4.13.0-alt2
libopentelemetry-1.22.0-alt2
perl-Net-SIP-0.840-alt1
plasma-discover-stplr-0.1.3-alt1
postgresql18-18.6-alt1
python3-module-chess-1.11.2-alt1
python3-module-fabio-2025.10.0-alt1
python3-module-qtconsole-5.7.2-alt1.1
rumdl-0.2.77-alt1
tbb-2023.1.0-alt1
verilator-5.052-alt1
Total 335 error logs.
^ permalink raw reply [flat|nested] only message in thread
only message in thread, other threads:[~2026-09-28 3:34 UTC | newest]
Thread overview: (only message) (download: mbox.gz / follow: Atom feed)
-- links below jump to the message on this page --
2026-09-28 3:34 [cyber] I: Sisyphus-20260928 x86_64 beehive_status: +16 -15 (335) ALT beekeeper
ALT Linux Sisyphus cybertalk
This inbox may be cloned and mirrored by anyone:
git clone --mirror http://lore.altlinux.org/sisyphus-cybertalk/0 sisyphus-cybertalk/git/0.git
# If you have public-inbox 1.1+ installed, you may
# initialize and index your mirror using the following commands:
public-inbox-init -V2 sisyphus-cybertalk sisyphus-cybertalk/ http://lore.altlinux.org/sisyphus-cybertalk \
sisyphus-cybertalk@lists.altlinux.org sisyphus-cybertalk@lists.altlinux.ru sisyphus-cybertalk@lists.altlinux.com
public-inbox-index sisyphus-cybertalk
Example config snippet for mirrors.
Newsgroup available over NNTP:
nntp://lore.altlinux.org/org.altlinux.lists.sisyphus-cybertalk
AGPL code for this site: git clone https://public-inbox.org/public-inbox.git