ALT Linux Sisyphus cybertalk
 help / color / mirror / Atom feed
* [cyber] I: p10-20260927 x86_64 beehive_status: +17 -14 (101)
@ 2026-09-27 16:48 ALT beekeeper
  0 siblings, 0 replies; only message in thread
From: ALT beekeeper @ 2026-09-27 16:48 UTC (permalink / raw)
  To: sisyphus-cybertalk

	17 NEW error logs

automake_1.11-1.11.6-alt9
	checking for upc... no
	configure: error: no Unified Parallel C compiler was found
	+ exit_status=77
	--
	+ exit 77
	1 of 878 tests failed
	(73 tests were not run)

fscrypt-0.3.0.0.5.e479779-alt1
	make: Entering directory '/usr/src/RPM/BUILD/fscrypt-0.3.0.0.5.e479779'
	make: git: No such file or directory
	make: Leaving directory '/usr/src/RPM/BUILD/fscrypt-0.3.0.0.5.e479779'
	--
	make: Entering directory '/usr/src/RPM/BUILD/fscrypt-0.3.0.0.5.e479779'
	make: git: No such file or directory
	make: Leaving directory '/usr/src/RPM/BUILD/fscrypt-0.3.0.0.5.e479779'
	--
	0inputs+0outputs (0major+37291minor)pagefaults 0swaps
	Error: no exit code is found, failure.

glibc-6:2.32-alt5.p10.7
	UNSUPPORTED: sunrpc/tst-svc_register
	FAIL: time/tst-cpuclock1
	Summary of test results:
	--
	+ rc=2
	+ grep '^FAIL:' build-x86_64-linux/tests.sum
	+ cut '-d ' -f2-
	--
	==> build-x86_64-linux/time/tst-cpuclock1.test-result <==
	FAIL: time/tst-cpuclock1
	original exit status 1

gnome-builder-3.40.2-alt1.1
	[1219/1220] Generating src/Ide-3.40.gir with a custom command (wrapped by meson to set env)
	FAILED: src/Ide-3.40.gir
	env
	PKG_CONFIG_PATH=/usr/src/RPM/BUILD/gnome-builder-3.40.2/x86_64-alt-linux/meson-uninstalled
	/usr/bin/g-ir-scanner --quiet --no-libtool --namespace=Ide --nsversion=3.40
	--warn-all --output src/Ide-3.40.gir --pkg-export=gnome-builder-1.0
	--c-include=libide-core.h -DIDE_CORE_COMPILATION --c-include=libide-plugins.h
	-DIDE_PLUGINS_COMPILATION --c-include=libide-threading.h -DIDE_THREADING_COMPILATION
	--c-include=libide-io.h -DIDE_IO_COMPILATION --c-include=libide-code.h
	-DIDE_CODE_COMPILATION --c-include=libide-vcs.h -DIDE_VCS_COMPILATION
	--c-include=libide-projects.h -DIDE_PROJECTS_COMPILATION --c-include=libide-search.h
	-DIDE_SEARCH_COMPILATION --c-include=libide-foundry.h -DIDE_FOUNDRY_COMPILATION
	--c-include=libide-debugger.h -DIDE_DEBUGGER_COMPILATION --c-include=libide-gui.h
	-DIDE_GUI_COMPILATION --c-include=libide-terminal.h -DIDE_TERMINAL_COMPILATION
	--c-include=libide-sourceview.h -DIDE_SOURCEVIEW_COMPILATION --c-include=libide-editor.h
	-DIDE_EDITOR_COMPILATION --c-include=libide-lsp.h -DIDE_LSP_COMPILATION
	--c-include=libide-greeter.h -DIDE_GREETER_COMPILATION --c-include=libide-tree.h
	-DIDE_TREE_COMPILATION -I/usr/src/RPM/BUILD/gnome-builder-3.40.2/src
	-I/usr/src/RPM/BUILD/gnome-builder-3.40.2/x86_64-alt-linux/src
	-I/usr/src/RPM/BUILD/gnome-builder-3.40.2/src/libide/code/.
	-I/usr/src/RPM/BUILD/gnome-builder-3.40.2/x86_64-alt-linux/src/libide/code/.
	-I/usr/src/RPM/BUILD/gnome-builder-3.40.2/src/libide/core/.
	-I/usr/src/RPM/BUILD/gnome-builder-3.40.2/x86_64-alt-linux/src/libide/core/.
	-I/usr/src/RPM/BUILD/gnome-builder-3.40.2/src/libide/plugins/.
	-I/usr/src/RPM/BUILD/gnome-builder-3.40.2/x86_64-alt-linux/src/libide/plugins/.
	-I/usr/src/RPM/BUILD/gnome-builder-3.40.2/src/libide/io/.
	-I/usr/src/RPM/BUILD/gnome-builder-3.40.2/x86_64-alt-linux/src/libide/io/.
	-I/usr/src/RPM/BUILD/gnome-builder-3.40.2/src/libide/threading/.
	-I/usr/src/RPM/BUILD/gnome-builder-3.40.2/x86_64-alt-linux/src/libide/threading/.
	-I/usr/src/RPM/BUILD/gnome-builder-3.40.2/src/libide/debugger/.
	-I/usr/src/RPM/BUILD/gnome-builder-3.40.2/x86_64-alt-linux/src/libide/debugger/.
	-I/usr/src/RPM/BUILD/gnome-builder-3.40.2/src/libide/foundry/.
	-I/usr/src/RPM/BUILD/gnome-builder-3.40.2/x86_64-alt-linux/src/libide/foundry/.
	-I/usr/src/RPM/BUILD/gnome-builder-3.40.2/src/libide/projects/.
	-I/usr/src/RPM/BUILD/gnome-builder-3.40.2/x86_64-alt-linux/src/libide/projects/.
	-I/usr/src/RPM/BUILD/gnome-builder-3.40.2/src/libide/vcs/.
	-I/usr/src/RPM/BUILD/gnome-builder-3.40.2/x86_64-alt-linux/src/libide/vcs/.
	-I/usr/src/RPM/BUILD/gnome-builder-3.40.2/src/libide/editor/.
	-I/usr/src/RPM/BUILD/gnome-builder-3.40.2/x86_64-alt-linux/src/libide/editor/.
	-I/usr/src/RPM/BUILD/gnome-builder-3.40.2/src/libide/search/.
	-I/usr/src/RPM/BUILD/gnome-builder-3.40.2/x86_64-alt-linux/src/libide/search/.
	-I/usr/src/RPM/BUILD/gnome-builder-3.40.2/src/libide/sourceview/.
	-I/usr/src/RPM/BUILD/gnome-builder-3.40.2/x86_64-alt-linux/src/libide/sourceview/.
	-I/usr/src/RPM/BUILD/gnome-builder-3.40.2/src/libide/gui/.
	-I/usr/src/RPM/BUILD/gnome-builder-3.40.2/x86_64-alt-linux/src/libide/gui/.
	-I/usr/src/RPM/BUILD/gnome-builder-3.40.2/src/libide/themes/.
	-I/usr/src/RPM/BUILD/gnome-builder-3.40.2/x86_64-alt-linux/src/libide/themes/.
	-I/usr/src/RPM/BUILD/gnome-builder-3.40.2/src/libide/greeter/.
	-I/usr/src/RPM/BUILD/gnome-builder-3.40.2/x86_64-alt-linux/src/libide/greeter/.
	-I/usr/src/RPM/BUILD/gnome-builder-3.40.2/src/libide/lsp/.
	-I/usr/src/RPM/BUILD/gnome-builder-3.40.2/x86_64-alt-linux/src/libide/lsp/.
	-I/usr/src/RPM/BUILD/gnome-builder-3.40.2/src/libide/terminal/.
	-I/usr/src/RPM/BUILD/gnome-builder-3.40.2/x86_64-alt-linux/src/libide/terminal/.
	-I/usr/src/RPM/BUILD/gnome-builder-3.40.2/src/libide/tree/.
	-I/usr/src/RPM/BUILD/gnome-builder-3.40.2/x86_64-alt-linux/src/libide/tree/.
	-I/usr/src/RPM/BUILD/gnome-builder-3.40.2/src/libide/webkit/.
	-I/usr/src/RPM/BUILD/gnome-builder-3.40.2/x86_64-alt-linux/src/libide/webkit/.
	--filelist=/usr/src/RPM/BUILD/gnome-builder-3.40.2/x86_64-alt-linux/src/gnome-builder.p/Ide_3.40_gir_filelist
	--include=Gio-2.0 --include=Gtk-3.0 --include=Dazzle-1.0 --include=Pea

kernel-image-rt-5.10.255-alt1.rt151
	0inputs+0outputs (0major+35982minor)pagefaults 0swaps
	Error: no exit code is found, failure.

kernel-image-std-def-2:5.10.268-alt1
	0inputs+0outputs (0major+35700minor)pagefaults 0swaps
	Error: no exit code is found, failure.
	error: Bad exit status from /usr/src/tmp/rpm-tmp.22078 (%check)

kernel-image-un-def-1:6.1.186-alt1
	0inputs+0outputs (0major+36947minor)pagefaults 0swaps
	Error: no exit code is found, failure.

kernel-modules-lkrg-un-def-0.9.8-alt3.393658.1
	0inputs+0outputs (0major+35624minor)pagefaults 0swaps
	Error: no exit code is found, failure.
	+ exit 1

libdb5.3-5.3.28-alt4
	115255 |       if( (nLeft==RTREE_MINCELLS(pRtree))
	115256 |	|| (overlap<fBestOverlap)
	115257 |	|| (overlap==fBestOverlap && area<fBestArea)
	../../lang/sql/generated/sqlite3.c:115226:11: note: 'fBestOverlap' was declared here
	115226 |     float fBestOverlap;
	../../lang/sql/generated/sqlite3.c: In function 'bdbSqlDbStatPrint':
	../../lang/sql/generated/sqlite3.c:46850:9: warning: 'rc' may be used uninitialized in
	this function [-Wmaybe-uninitialized]
	46850 |  int i, rc, nRow, iTable, openTransaction = 0;
	libtool: compile:  x86_64-alt-linux-gcc -c -I. -I../../src -D_GNU_SOURCE -D_REENTRANT -pipe
	-frecord-gcc-switches -Wall -g -O2 -fno-strict-aliasing -DSHAREDSTATEDIR=\"/var/lib\"
	-DSQLITE_ENABLE_COLUMN_METADATA=1 -DSQLITE_DISABLE_DIRSYNC=1 -DSQLITE_ENABLE_FTS3=3
	-DSQLITE_ENABLE_RTREE=1 -DSQLITE_SECURE_DELETE=1 -DSQLITE_ENABLE_UNLOCK_NOTIFY=1
	-I../../../lang/sql/sqlite/ext/fts3/ -I. -I./sql -I../../lang/sql/generated
	-D_HAVE_SQLITE_CONFIG_H ../../lang/sql/generated/sqlite3.c -o sqlite3.o >/dev/null 2>&1
	make: Leaving directory '/usr/src/RPM/BUILD/db-5.3.28/dist/dist-tls'

libtraceevent-1.7.2-alt1
	Verifying ELF objects in /usr/src/tmp/libtraceevent-buildroot
	(arch=strict,fhs=strict,lfs=strict,lint=strict,rpath=strict,stack=strict,textrel=strict,unresolved=strict)
	verify-elf: ERROR: ./usr/lib64/traceevent/plugins/plugin_cfg80211.so: undefined symbol:
	tep_register_print_function
	verify-elf: ERROR: ./usr/lib64/traceevent/plugins/plugin_cfg80211.so: undefined symbol:
	tep_unregister_print_function

os-autoinst-4.6-alt15.1
	3:
	3: #   Failed test 'commands server stopped'
	3: #   at t/07-commands.t line 208.
	--
	3: t/07-commands.t			  (Wstat: 256 Tests: 14 Failed: 1)
	3:   Failed test:  12
	3:   Non-zero exit status: 1
	--
	test-doc-testapi-spellchecking
	67% tests passed, 1 tests failed out of 3
	Total Test time (real) =  49.07 sec
	The following tests FAILED:
	3 - test-perl-testsuite (Failed)
	--
	Use "--rerun-failed --output-on-failure" to re-run the failed cases verbosely.
	FAILED: CMakeFiles/check-pkg-build
	/usr/src/RPM/BUILD/os-autoinst-4.6/x86_64-alt-linux/CMakeFiles/check-pkg-build
	cd /usr/src/RPM/BUILD/os-autoinst-4.6/x86_64-alt-linux && /usr/bin/ctest -V -E
	test-local-.*

php8.2-pcntl-8.2.31-alt1
	0inputs+0outputs (0major+35884minor)pagefaults 0swaps
	Error: no exit code is found, failure.

psmisc-23.3-alt2
	0inputs+0outputs (0major+36828minor)pagefaults 0swaps
	Error: no exit code is found, failure.

python3-module-websockets-12.0-alt0.p10.1
	raise ValueError("Invalid file descriptor: {}".format(fd))
	ValueError: Invalid file descriptor: -1
	.Exception in thread Thread-495:
	--
	raise ValueError("Invalid file descriptor: {}".format(fd))
	ValueError: Invalid file descriptor: -1
	.Exception in thread Thread-496:
	--
	raise ValueError("Invalid file descriptor: {}".format(fd))
	ValueError: Invalid file descriptor: -1
	..................................................................................................................s..............................................................................................................................................................................................................................................................................................................................................................................
	ERROR: test_send_mixed_iterable (tests.sync.test_connection.ServerConnectionTests)
	send raises TypeError when called with an iterable of inconsistent types.
	TimeoutError: timed out while closing connection
	The above exception was the direct cause of the following exception:
	--
	raise self.protocol.close_exc from original_exc
	websockets.exceptions.ConnectionClosedError: sent 1011 (internal error) error in
	fragmented message; no close frame received
	FAIL: test_close_timeout_waiting_for_recv
	(tests.sync.test_connection.ClientConnectionTests)
	Traceback (most recent call last):
	--
	self.assertFalse(close_thread.is_alive())
	AssertionError: True is not false
	FAIL: test_close_waits_for_recv (tests.sync.test_connection.ServerConnectionTests)
	Traceback (most recent call last):
	--
	raise EOFError("stream of frames ended")
	EOFError: stream of frames ended
	During handling of the above exception, another exception occurred:

tclx-1:8.4.4-alt1
	(but everything is probably ok)
	==== nice-1.5 nice tests FAILED
	==== Contents of test case:
	--
	23 23
	==== nice-1.5 FAILED
	pipe.test
	--
	profile.test
	==== profile-10.1 profile CPU time tests FAILED
	==== Contents of test case:
	--
	---- errorCode: NONE
	==== profile-10.1 FAILED
	==== profile-10.2 profile CPU time tests FAILED
	==== Contents of test case:
	--
	---- errorCode: NONE
	==== profile-10.2 FAILED
	==== profile-12.1 profile namespace tests FAILED
	==== Contents of test case:
	--
	---- errorCode: NONE
	==== profile-12.1 FAILED
	==== profile-12.2 profile namespace tests FAILED
	==== Contents of test case:
	--
	---- errorCode: NONE
	==== profile-12.2 FAILED
	==== profile-12.3 profile namespace tests FAILED

trace-cmd-3.1.6-alt2
	0inputs+0outputs (0major+36358minor)pagefaults 0swaps
	Error: no exit code is found, failure.

tuned-2.22.1-alt1
	0inputs+0outputs (0major+37328minor)pagefaults 0swaps
	Error: no exit code is found, failure.

	14 error logs REMOVED from the list
btrfs-progs-6.3.1-alt1.P10.1
eresi-0.83-alt4
fsverity-utils-1.4-alt1
kernel-modules-dm-secdel-std-def-2:1.0.9-alt1.330508.1
kernel-modules-ipt-so-std-def-1.0-alt9.330508.1
openblas-0.3.23-alt1.2
partclone-0.3.17-alt1
php8.1-pcntl-8.1.34-alt1
pocl-6.0-alt0.1.p10.2
postfix-1:3.6.2-alt1
proftpd-1.3.6-alt0.4.ga73dbfe3b
python3-module-pexpect-4.8.0-alt3
qemu-8.2.6-alt0.p10.1
tripso-1.2-alt1

Total 101 error logs.


^ permalink raw reply	[flat|nested] only message in thread

only message in thread, other threads:[~2026-09-27 16:48 UTC | newest]

Thread overview: (only message) (download: mbox.gz / follow: Atom feed)
-- links below jump to the message on this page --
2026-09-27 16:48 [cyber] I: p10-20260927 x86_64 beehive_status: +17 -14 (101) ALT beekeeper

ALT Linux Sisyphus cybertalk

This inbox may be cloned and mirrored by anyone:

	git clone --mirror http://lore.altlinux.org/sisyphus-cybertalk/0 sisyphus-cybertalk/git/0.git

	# If you have public-inbox 1.1+ installed, you may
	# initialize and index your mirror using the following commands:
	public-inbox-init -V2 sisyphus-cybertalk sisyphus-cybertalk/ http://lore.altlinux.org/sisyphus-cybertalk \
		sisyphus-cybertalk@lists.altlinux.org sisyphus-cybertalk@lists.altlinux.ru sisyphus-cybertalk@lists.altlinux.com
	public-inbox-index sisyphus-cybertalk

Example config snippet for mirrors.
Newsgroup available over NNTP:
	nntp://lore.altlinux.org/org.altlinux.lists.sisyphus-cybertalk


AGPL code for this site: git clone https://public-inbox.org/public-inbox.git