* [cyber] I: Sisyphus-20260927 x86_64 beehive_status: +12 -22 (334)
@ 2026-09-27 10:38 ALT beekeeper
0 siblings, 0 replies; only message in thread
From: ALT beekeeper @ 2026-09-27 10:38 UTC (permalink / raw)
To: sisyphus-cybertalk
12 NEW error logs
fonts-ttf-IosevkaCurlySlab-34.8.1-alt1
[ACTION] Create TTF 'dist/IosevkaCurlySlab/TTF-Unhinted/IosevkaCurlySlab-HeavyItalic.ttf'
[ACTION] Create TTF
'dist/IosevkaCurlySlab/TTF-Unhinted/IosevkaCurlySlab-ExtendedHeavyItalic.ttf'
[ACTION] Create TTF 'dist/IosevkaCurlySlab/TTF-Unhinted/IosevkaCurlySlab-Thin.ttf'
[ACTION] Create TTF 'dist/IosevkaCurlySlab/TTF-Unhinted/IosevkaCurlySlab-ExtendedThin.ttf'
[ACTION] Create TTF 'dist/IosevkaCurlySlab/TTF-Unhinted/IosevkaCurlySlab-ThinOblique.ttf'
[ACTION] Create TTF
'dist/IosevkaCurlySlab/TTF-Unhinted/IosevkaCurlySlab-ExtendedThinOblique.ttf'
/usr/src/tmp/rpmb-tmp.I7Hagv: line 134: 910952 CPU time limit exceeded npm run build --
ttf::IosevkaCurlySlab
error: Bad exit status from /usr/src/tmp/rpmb-tmp.I7Hagv (%build)
RPM build errors:
Bad exit status from /usr/src/tmp/rpmb-tmp.I7Hagv (%build)
gz-sim-10.5.0-alt1
296/296 Test #296: world_TEST ...................................................
Passed 2.38 sec
99% tests passed, 1 tests failed out of 296
Total Test time (real) = 809.97 sec
The following tests FAILED:
177 - INTEGRATION_multiple_servers (Timeout)
libfprint2-1.94.100-alt1
(process:261509): libfprint-device-DEBUG: 09:59:32.624: Device reported finger status
change: FP_FINGER_STATUS_NEEDED -> FP_FINGER_STATUS_PRESENT
(process:261509): libfprint-SSM-DEBUG: 09:59:32.624: [egis_etu905] SSM IDENTIFY_STATES
failed in state 4 with error: Operation was cancelled
(process:261509): libfprint-SSM-DEBUG: 09:59:32.624: [egis_etu905] IDENTIFY_STATES
completed with error: Operation was cancelled
(process:261509): libfprint-egis_etu905-DEBUG: 09:59:32.624: Task SSM done
--
(process:261509): libfprint-SSM-DEBUG: 09:59:32.624: [egis_etu905] CMD_STATES entering
state 0
(process:261509): libfprint-SSM-DEBUG: 09:59:37.624: [egis_etu905] SSM CMD_STATES failed
in state 0 with error: transfer timed out
(process:261509): libfprint-SSM-DEBUG: 09:59:37.624: [egis_etu905] CMD_STATES completed
with error: transfer timed out
(process:261509): libfprint-SSM-DEBUG: 09:59:37.624: [egis_etu905] SSM CANCEL_STATES
failed in state 0 with error: transfer timed out
(process:261509): libfprint-SSM-DEBUG: 09:59:37.624: [egis_etu905] CANCEL_STATES
completed with error: transfer timed out
** (process:261399): DEBUG (recursed): umockdev-utils.vala:50: umockdev: caught signal 6,
propagating to child
--
stderr:
ERROR: uevent_sender_send: Failed
udev_device_new_from_syspath(/sys/devices/pci0000:00/0000:00:14.0/usb3/3-4): No such device
ERROR: uevent_sender_send: Failed
udev_device_new_from_syspath(/sys/devices/pci0000:00/0000:00:14.0/usb3/3-4) after retry:
No such device
ERROR: uevent_sender_send: Failed
udev_device_new_from_syspath(/sys/devices/pci0000:00/0000:00:14.0/usb3): No such device
ERROR: uevent_sender_send: Failed
udev_device_new_from_syspath(/sys/devices/pci0000:00/0000:00:14.0/usb3) after retry:
No such device
ERROR: uevent_sender_send: Failed
udev_device_new_from_syspath(/sys/devices/pci0000:00/0000:00:14.0): No such device
libgupnp-igd-1.6.0-alt1
Bail out!
1/1 gupnp-igd:gupnp-simple-igd FAIL 8.24s killed by signal 6 SIGABRT
Summary of Failures:
1/1 gupnp-igd:gupnp-simple-igd FAIL 8.24s killed by signal 6 SIGABRT
Ok: 0
Fail: 1
Full log written to
/usr/src/RPM/BUILD/gupnp-igd-1.6.0/x86_64-alt-linux/meson-logs/testlog.txt
error: Bad exit status from /usr/src/tmp/rpmb-tmp.uDNdIr (%check)
RPM build errors:
Bad exit status from /usr/src/tmp/rpmb-tmp.uDNdIr (%check)
libopentelemetry-1.22.0-alt2
[Error] File:
/usr/src/RPM/BUILD/libopentelemetry-1.22.0/exporters/prometheus/src/exporter.cc:38
[Prometheus Exporter] Can't initialize prometheus exposer with endpoint: localhost:9464
Error: null context when constructing CivetServer. Possible problem binding to port. Error:
Failed to setup server ports
/usr/src/RPM/BUILD/libopentelemetry-1.22.0/exporters/prometheus/test/exporter_test.cc:45:
Failure
--
Expected: true
[ FAILED ] PrometheusExporter.ShutdownSetsIsShutdownToTrue (0 ms)
[----------] 1 test from PrometheusExporter (0 ms total)
--
[ PASSED ] 0 tests.
[ FAILED ] 1 test, listed below:
[ FAILED ] PrometheusExporter.ShutdownSetsIsShutdownToTrue
1 FAILED TEST
554/590 Test #565: exporter.PrometheusCollector.BasicTests
.............................................................. Passed 0.05 sec
--
590/590 Test #414: metrics.HistogramStress.UnsignedInt64
................................................................ Passed 73.03 sec
99% tests passed, 1 tests failed out of 586
Total Test time (real) = 73.96 sec
--
588 - examples.metrics_simple (Disabled)
The following tests FAILED:
563 - exporter.PrometheusExporter.ShutdownSetsIsShutdownToTrue (Failed)
perl-Net-SIP-0.840-alt1
# received=110 lost=0 expect ca. 467.5 packets, events='1 2 D # 3 4 B *'
# Failed test 'UAS RTP ok'
# at t/19_call_with_dtmf.t line 151.
--
t/19_call_with_dtmf.t (Wstat: 256 (exited 1) Tests: 216 Failed: 1)
Failed test: 169
Non-zero exit status: 1
--
Result: FAIL
Failed 1/26 test programs. 1/2000 subtests failed.
make: *** [Makefile:829: test_dynamic] Error 255
perl-Parallel-Runner-0.014-alt1_3
PERL_DL_NONLAZY=1 "/usr/bin/perl" "-MExtUtils::Command::MM" "-MTest::Harness" "-e"
"undef *Test::Harness::Switches; test_harness(0, 'blib/lib', 'blib/arch')" t/*.t
# Failed test 'First signal sent after delay'
# at t/Destruction.t line 76.
--
t/Destruction.t (Wstat: 256 (exited 1) Tests: 10 Failed: 1)
Failed test: 7
Non-zero exit status: 1
--
Result: FAIL
Failed 1/3 test programs. 1/57 subtests failed.
make: *** [Makefile:776: test_dynamic] Error 255
postgresql18-18.6-alt1
1..231
# 50 of 231 tests failed.
# The differences that caused some tests to fail can be viewed in the file
"/usr/src/RPM/BUILD/postgresql18-18.6/src/test/regress/regression.diffs".
python3-module-qtconsole-5.7.2-alt1.1
qtconsole/tests/test_00_console_widget.py::test_scroll[False] PASSED [ 4%]
qtconsole/tests/test_00_console_widget.py::test_input FAILED [ 6%]
qtconsole/tests/test_00_console_widget.py::test_debug FAILED [ 8%]
qtconsole/tests/test_00_console_widget.py::test_input_and_print PASSED [ 10%]
--
timeout=SHELL_TIMEOUT)
E pytestqt.exceptions.TimeoutError: waitUntil timed out in 20000 milliseconds
qtconsole/tests/test_00_console_widget.py:153: TimeoutError
--
timeout=SHELL_TIMEOUT)
E pytestqt.exceptions.TimeoutError: waitUntil timed out in 20000 milliseconds
qtconsole/tests/test_00_console_widget.py:197: TimeoutError
--
=========================== short test summary info ============================
FAILED qtconsole/tests/test_00_console_widget.py::test_input - pytestqt.excep...
FAILED qtconsole/tests/test_00_console_widget.py::test_debug - pytestqt.excep...
============= 2 failed, 45 passed, 1 skipped in 231.14s (0:03:51) ==============
INFO : Command's result: FAILURE
INFO : Command's error: Command '['xvfb-run', '-s', '-nolisten local', 'pytest',
'-v', 'qtconsole', '--ignore', 'qtconsole/tests/test_inprocess_kernel.py']' returned
non-zero exit status 1.
error: Bad exit status from /usr/src/tmp/rpmb-tmp.Ox5OOs (%check)
rumdl-0.2.77-alt1
cli::cli_code_block_tool_modes_test::modes_are_rejected_for_every_stdin_entry_point
test result: FAILED. 6225 passed; 1 failed; 4 ignored; 0 measured; 0 filtered out;
finished in 48.76s
error: test failed, to rerun pass `--test lib`
Doc-tests rumdl_lib
--
all doctests ran in 18.38s; merged doctests compilation took 18.26s
error: 1 target failed:
`--test lib`
tbb-2023.1.0-alt1
143/143 Test #143: test_malloc_new_handler .................. Passed 0.01 sec
99% tests passed, 1 tests failed out of 143
Total Test time (real) = 123.51 sec
The following tests FAILED:
25 - test_task_arena (Failed)
verilator-5.052-alt1
221 | struct yy_buffer_state
V3ParseBison.c: In function 'yyparse':
V3ParseBison.c:55522:18: warning: 'free' called on unallocated object 'yyssa'
[-Wfree-nonheap-object]
55522 | YYSTACK_FREE (yyss);
V3ParseBison.c:32703:16: note: declared here
32703 | yy_state_t yyssa[YYINITDEPTH];
make[2]: Leaving directory '/usr/src/RPM/BUILD/verilator-5.052/src/obj_dbg'
error: Bad exit status from /usr/src/tmp/rpmb-tmp.MX7CCz (%build)
RPM build errors:
Bad exit status from /usr/src/tmp/rpmb-tmp.MX7CCz (%build)
22 error logs REMOVED from the list
bookokrat-0.3.12-alt1
bpftrace-0.27.0-alt1
compiz-0.9.14.2-alt3.4
fonts-ttf-IosevkaCurly-34.8.1-alt1
gcc11-11.4.1-alt1
gz-rendering-10.0.2-alt1
jasmine-gjs-3.10.1-alt1
kernel-modules-aic8800-6.12-0.0.95.bef3-alt1.396399.1
kernel-modules-aic8800-6.18-0.0.95.bef3-alt1.397877.1
libgmime3.0-3.2.15-alt2
lore-0.8.6-alt1
perl-Tie-DBI-1.08-alt1
podman-tui-1.11.3-alt1
postgresql17-17.11-alt1
python3-module-devpi-server-6.20.3-alt1
python3-module-opcua-asyncio-2.0.1-alt1
python3-module-oscrypto-1.3.0-alt1.1
python3-module-rapidfuzz-3.14.6-alt1
python3-module-zict-3.0.0-alt1
qt5-pim-5.15-alt1
srt-1.5.7-alt1
stockfish-18-alt1
Total 334 error logs.
^ permalink raw reply [flat|nested] only message in thread
only message in thread, other threads:[~2026-09-27 10:38 UTC | newest]
Thread overview: (only message) (download: mbox.gz / follow: Atom feed)
-- links below jump to the message on this page --
2026-09-27 10:38 [cyber] I: Sisyphus-20260927 x86_64 beehive_status: +12 -22 (334) ALT beekeeper
ALT Linux Sisyphus cybertalk
This inbox may be cloned and mirrored by anyone:
git clone --mirror http://lore.altlinux.org/sisyphus-cybertalk/0 sisyphus-cybertalk/git/0.git
# If you have public-inbox 1.1+ installed, you may
# initialize and index your mirror using the following commands:
public-inbox-init -V2 sisyphus-cybertalk sisyphus-cybertalk/ http://lore.altlinux.org/sisyphus-cybertalk \
sisyphus-cybertalk@lists.altlinux.org sisyphus-cybertalk@lists.altlinux.ru sisyphus-cybertalk@lists.altlinux.com
public-inbox-index sisyphus-cybertalk
Example config snippet for mirrors.
Newsgroup available over NNTP:
nntp://lore.altlinux.org/org.altlinux.lists.sisyphus-cybertalk
AGPL code for this site: git clone https://public-inbox.org/public-inbox.git