* [cyber] I: p11-20260927 x86_64 beehive_status: +16 -15 (89)
@ 2026-09-27 7:03 ALT beekeeper
0 siblings, 0 replies; only message in thread
From: ALT beekeeper @ 2026-09-27 7:03 UTC (permalink / raw)
To: sisyphus-cybertalk
16 NEW error logs
altlinux-freedesktop-menu-0.70-alt1
+ for i in desktop-directories/*.directory
++ basename desktop-directories/altlinux-xfce.directory
+ j=altlinux-xfce.directory
+ grep altlinux-xfce.directory ignore.list
+ rm ignore.list
+ '[' 0 -gt 0 ']'
+ exit 1
error: Bad exit status from /usr/src/tmp/rpmb-tmp.wsJhZt (%check)
RPM build errors:
Bad exit status from /usr/src/tmp/rpmb-tmp.wsJhZt (%check)
auditd-plugin-clickhouse-lite-0.1.8-alt2
ok 5 auditd-plugin-clickhouse def-threads 100-loads
hasher-privd: parent: handle_io: idle time limit (3600 seconds) exceeded
clisp-1:2.49.92-alt2
Bye.
(echo *.erg | grep '*' >/dev/null) || (echo "Test failed:" ; ls -l *erg; echo "To see
which tests failed, type" ; echo " cat "`pwd`"/*.erg" ; exit 1)
Test failed:
-rw-r--r-- 1 builder builder 848 Sep 27 02:12 socket.erg
To see which tests failed, type
cat /usr/src/RPM/BUILD/clisp-2.49.92/src/tests/*.erg
doctest-2.4.11-alt2
155/155 Test #155: playground_junit ........................... Passed 0.00 sec
99% tests passed, 1 tests failed out of 155
Total Test time (real) = 1.09 sec
The following tests FAILED:
121 - order_1 (Failed)
gambit-4.9.7-alt4
make[4]: Leaving directory '/usr/src/RPM/BUILD/gambit-4.9.7/lib/_irregex'
make[4]: Entering directory '/usr/src/RPM/BUILD/gambit-4.9.7/lib'
LD_LIBRARY_PATH=../lib:../gsi:../gsc:
../gsc/gsc -:~~bin=../bin,~~lib=../lib,~~include=../include -f -target js -prelude
"(define-cond-expand-feature|enable-type-checking|)(define-cond-expand-feature|disable-auto-forcing|)(define-cond-expand-feature|enable-sharp-dot|)(define-cond-expand-feature|enable-bignum|)(define-cond-expand-feature|enable-ratnum|)(define-cond-expand-feature|enable-cpxnum|)(define-cond-expand-feature|enable-s8vector|)(define-cond-expand-feature|enable-u16vector|)(define-cond-expand-feature|enable-s16vector|)(define-cond-expand-feature|enable-u32vector|)(define-cond-expand-feature|enable-s32vector|)(define-cond-expand-feature|enable-u64vector|)(define-cond-expand-feature|enable-s64vector|)(define-cond-expand-feature|enable-f32vector|)(define-cond-expand-feature|disable-smp|)(##include\"../lib/header.scm\")"
-label-namespace "" -c -o _gambit.js ../lib/_univlib.scm
make[4]: Leaving directory '/usr/src/RPM/BUILD/gambit-4.9.7/lib'
make[2]: *** [makefile:546: modules-recursive] Error 2
make[1]: *** [makefile:373: modules] Error 2
make: *** [makefile:107: all] Error 2
error: Bad exit status from /usr/src/tmp/rpmb-tmp.XD0jz6 (%build)
RPM build errors:
Bad exit status from /usr/src/tmp/rpmb-tmp.XD0jz6 (%build)
gettext-0.21-alt2
# SKIP: 23
# XFAIL: 0
# FAIL: 0
# XPASS: 0
# ERROR: 0
make[7]: Leaving directory '/usr/src/RPM/BUILD/gettext-0.21/gettext-tools/gnulib-tests'
libgupnp-igd-1.6.0-alt1
1/1 gupnp-simple-igd TIMEOUT 60.02s killed by signal 15 SIGTERM
Summary of Failures:
1/1 gupnp-simple-igd TIMEOUT 60.02s killed by signal 15 SIGTERM
Ok: 0
Fail: 0
Timeout: 1
Full log written to
/usr/src/RPM/BUILD/gupnp-igd-1.6.0/x86_64-alt-linux/meson-logs/testlog.txt
error: Bad exit status from /usr/src/tmp/rpmb-tmp.0GoLJ9 (%check)
RPM build errors:
Bad exit status from /usr/src/tmp/rpmb-tmp.0GoLJ9 (%check)
llvm21.1-21.1.5-alt0.1
[100/703] Building CXX object
libc/src/__support/OSUtil/gpu/CMakeFiles/libc.src.__support.OSUtil.gpu.gpu_util.dir/exit.cpp.o
FAILED:
libc/src/__support/OSUtil/gpu/CMakeFiles/libc.src.__support.OSUtil.gpu.gpu_util.dir/exit.cpp.o
/usr/src/RPM/BUILD/llvm-project-21/x86_64-alt-linux/bin/clang++
--target=amdgcn-amd-amdhsa -DLIBC_NAMESPACE=__llvm_libc_21_1_5_
-D__LIBC_USE_FLOAT16_CONVERSION -I/usr/src/RPM/BUILD/llvm-project-21/libc -isystem
/usr/src/RPM/BUILD/llvm-project-21/x86_64-alt-linux/include/amdgcn-amd-amdhsa -O2
-DNDEBUG -std=gnu++17 --target=amdgcn-amd-amdhsa -DLIBC_QSORT_IMPL=LIBC_QSORT_QUICK_SORT
-DLIBC_ADD_NULL_CHECKS "-DLIBC_MATH=(LIBC_MATH_SKIP_ACCURATE_PASS | LIBC_MATH_SMALL_TABLES
| LIBC_MATH_NO_ERRNO | LIBC_MATH_NO_EXCEPT)" -DLIBC_ERRNO_MODE=LIBC_ERRNO_MODE_SHARED
-fpie -DLIBC_FULL_BUILD -nostdlibinc -ffixed-point -fno-exceptions
-fno-lax-vector-conversions -fno-unwind-tables -fno-asynchronous-unwind-tables
-fno-rtti -ftrivial-auto-var-init=pattern -fno-omit-frame-pointer -Wall -Wextra
-Werror -Wconversion -Wno-sign-conversion -Wdeprecated -Wno-c99-extensions
-Wno-gnu-imaginary-constant -Wno-pedantic -Wimplicit-fallthrough -Wwrite-strings
-Wextra-semi -Wnewline-eof -Wnonportable-system-include-path -Wstrict-prototypes
-Wthread-safety -Wglobal-constructors -nogpulib -fvisibility=hidden
-fconvergent-functions -flto -Wno-multi-gpu -Xclang -mcode-object-version=none -MD -MT
libc/src/__support/OSUtil/gpu/CMakeFiles/libc.src.__support.OSUtil.gpu.gpu_util.dir/exit.cpp.o
-MF
libc/src/__support/OSUtil/gpu/CMakeFiles/libc.src.__support.OSUtil.gpu.gpu_util.dir/exit.cpp.o.d
-o
libc/src/__support/OSUtil/gpu/CMakeFiles/libc.src.__support.OSUtil.gpu.gpu_util.dir/exit.cpp.o
-c /usr/src/RPM/BUILD/llvm-project-21/libc/src/__support/OSUtil/gpu/exit.cpp
--
In file included from /usr/src/RPM/BUILD/llvm-project-21/libc/src/__support/GPU/utils.h:20:
/usr/src/RPM/BUILD/llvm-project-21/x86_64-alt-linux/lib64/clang/21/include/gpuintrin.h:41:37:
error: unknown type name 'uint64_t'
41 | _DEFAULT_FN_ATTRS static __inline__ uint64_t
/usr/src/RPM/BUILD/llvm-project-21/x86_64-alt-linux/lib64/clang/21/include/gpuintrin.h:42:26:
error: unknown type name 'uint64_t'
42 | __gpu_match_any_u32_impl(uint64_t __lane_mask, uint32_t __x);
/usr/src/RPM/BUILD/llvm-project-21/x86_64-alt-linux/lib64/clang/21/include/gpuintrin.h:42:48:
error: unknown type name 'uint32_t'
42 | __gpu_match_any_u32_impl(uint64_t __lane_mask, uint32_t __x);
/usr/src/RPM/BUILD/llvm-project-21/x86_64-alt-linux/lib64/clang/21/include/gpuintrin.h:45:37:
error: unknown type name 'uint64_t'
45 | _DEFAULT_FN_ATTRS static __inline__ uint64_t
/usr/src/RPM/BUILD/llvm-project-21/x86_64-alt-linux/lib64/clang/21/include/gpuintrin.h:46:26:
error: unknown type name 'uint64_t'
46 | __gpu_match_any_u64_impl(uint64_t __lane_mask, uint64_t __x);
/usr/src/RPM/BUILD/llvm-project-21/x86_64-alt-linux/lib64/clang/21/include/gpuintrin.h:46:48:
error: unknown type name 'uint64_t'
46 | __gpu_match_any_u64_impl(uint64_t __lane_mask, uint64_t __x);
/usr/src/RPM/BUILD/llvm-project-21/x86_64-alt-linux/lib64/clang/21/include/gpuintrin.h:49:37:
error: unknown type name 'uint64_t'
49 | _DEFAULT_FN_ATTRS static __inline__ uint64_t
/usr/src/RPM/BUILD/llvm-project-21/x86_64-alt-linux/lib64/clang/21/include/gpuintrin.h:50:26:
error: unknown type name 'uint64_t'
50 | __gpu_match_all_u32_impl(uint64_t __lane_mask, uint32_t __x);
/usr/src/RPM/BUILD/llvm-project-21/x86_64-alt-linux/lib64/clang/21/include/gpuintrin.h:50:48:
error: unknown type name 'uint32_t'
50 | __gpu_match_all_u32_impl(uint64_t __lane_mask, uint32_t __x);
mumps-5.3.5-alt4
gcc -shared graph.o gbipart.o gbisect.o ddcreate.o ddbisect.o nestdiss.o
multisector.o gelim.o bucket.o tree.o symbfac.o interface.o sort.o minpriority.o
-Wl,-soname,libpord_seq-5.3.so -o libpord_seq-5.3.so -fopenmp -lrt -Wl,-z,defs
lto1: internal compiler error: resolution sub id 0xf22a2fb27a80914c not in object file
libbacktrace could not find executable to open
--
See <http://bugzilla.altlinux.org> for instructions.
lto-wrapper: fatal error: x86_64-alt-linux-gcc returned 1 exit status
compilation terminated.
ld: error: lto-wrapper failed
collect2: error: ld returned 1 exit status
make[2]: *** [Makefile:34: libpord_seq.so] Error 1
newsboat-2.42-alt1
test utils::tests::t_run_command_executes_given_command_with_given_argument has been
running for over 60 seconds
hasher-privd: parent: handle_io: idle time limit (3600 seconds) exceeded
ocaml-lsp-1.27.0-alt2
+ detached: /-----------------------------------------------------------------------
+ | Internal error: Uncaught exception.
+ | ("Lev_fiber.Io: already closed",
openblas-0.3.27-alt1
gemv.c: In function 'sgemv_':
gemv.c:229:31: error: 'GEMM_MULTITHREAD_THRESHOLD' undeclared (first use in this function)
229 | if ( 1L * m * n < 115200L * GEMM_MULTITHREAD_THRESHOLD )
--
ger.c: In function 'sger_':
ger.c:167:49: error: 'GEMM_MULTITHREAD_THRESHOLD' undeclared (first use in this function)
167 | if (incx == 1 && incy == 1 && 1L*m*n <= 2048 *GEMM_MULTITHREAD_THRESHOLD) {
--
gemv.c: In function 'cblas_sgemv':
gemv.c:229:31: error: 'GEMM_MULTITHREAD_THRESHOLD' undeclared (first use in this function)
229 | if ( 1L * m * n < 115200L * GEMM_MULTITHREAD_THRESHOLD )
--
ger.c: In function 'cblas_sger':
ger.c:167:49: error: 'GEMM_MULTITHREAD_THRESHOLD' undeclared (first use in this function)
167 | if (incx == 1 && incy == 1 && 1L*m*n <= 2048 *GEMM_MULTITHREAD_THRESHOLD) {
pocl-6.0-alt0.3
-- Found hwloc, version 2.10.0
Package libxml-2.0 was not found in the pkg-config search path.
Perhaps you should add the directory containing `libxml-2.0.pc'
to the PKG_CONFIG_PATH environment variable
Package 'libxml-2.0', required by 'hwloc', not found
Package libxml-2.0 was not found in the pkg-config search path.
Perhaps you should add the directory containing `libxml-2.0.pc'
to the PKG_CONFIG_PATH environment variable
Package 'libxml-2.0', required by 'hwloc', not found
Package libxml-2.0 was not found in the pkg-config search path.
Perhaps you should add the directory containing `libxml-2.0.pc'
to the PKG_CONFIG_PATH environment variable
Package 'libxml-2.0', required by 'hwloc', not found
Package libxml-2.0 was not found in the pkg-config search path.
Perhaps you should add the directory containing `libxml-2.0.pc'
to the PKG_CONFIG_PATH environment variable
Package 'libxml-2.0', required by 'hwloc', not found
-- Found Hwloc: hwloc
python3-module-pyopengl-3.1.9-alt2.3
+ xvfb-run -a -s '-screen 0 1024x768x24 -ac +extension GLX +render -noreset' py.test-3
tests -k 'not test_check_egl_es1 and not test_check_egl_es2 and not test_egl_ext_enumerate
and not test_glCallLists_twice2'
_XSERVTransmkdir: ERROR: euid != 0,directory /tmp/.X11-unix will not be created.
The XKEYBOARD keymap compiler (xkbcomp) reports:
--
> raise RuntimeError("Test Failed")
E RuntimeError: Test Failed
tests/test_checks.py:88: RuntimeError
--
------------------------------ Captured log call -------------------------------
ERROR test_checks:test_checks.py:83 Failing check script output: <frozen
importlib._bootstrap>:488: RuntimeWarning: Your system is avx2 capable but pygame was
not built with support for it. The performance of some of your blits could be adversely
affected. Consider enabling compile time detection with environment variables like
PYGAME_DETECT_AVX2=1 if you are compiling without cross compilation.
/usr/lib64/python3/site-packages/pygame/pkgdata.py:25: UserWarning: pkg_resources is
deprecated as an API. See https://setuptools.pypa.io/en/latest/pkg_resources.html. The
pkg_resources package is slated for removal as early as 2025-11-30. Refrain from using
this package or pin to Setuptools<81.
--
ALSA lib confmisc.c:855:(parse_card) cannot find card '0'
ALSA lib conf.c:5205:(_snd_config_evaluate) function snd_func_card_inum returned error:
No such file or directory
ALSA lib confmisc.c:422:(snd_func_concat) error evaluating strings
ALSA lib conf.c:5205:(_snd_config_evaluate) function snd_func_concat returned error:
No such file or directory
ALSA lib confmisc.c:1342:(snd_func_refer) error evaluating name
ALSA lib conf.c:5205:(_snd_config_evaluate) function snd_func_refer returned error:
No such file or directory
ALSA lib conf.c:5728:(snd_config_expand) Evaluate error: No such file or directory
ALSA lib pcm.c:2722:(snd_pcm_open_noupdate) Unknown PCM default
--
=========================== short test summary info ============================
FAILED tests/test_checks.py::test_test_glgetfloat_leak - RuntimeError: Test F...
= 1 failed, 86 passed, 2 skipped, 4 deselected, 1 xfailed, 2 warnings in 17.12s =
python3-module-sanic-25.3.0-alt1
=========================== short test summary info ============================
FAILED tests/test_tls.py::test_custom_cert_loader - sanic.exceptions.ServerEr...
= 1 failed, 1663 passed, 19 skipped, 14 deselected, 3 xfailed, 6 xpassed, 178 warnings
in 149.96s (0:02:29) =
INFO : Command's result: FAILURE
INFO : Command's error: Command '['python3', '-m', 'pytest', '-k', 'not
test_websocket_route_with_subprotocols and not test_keep_alive_client_timeout and not
test_multiprocessing']' returned non-zero exit status 1.
error: Bad exit status from /usr/src/tmp/rpmb-tmp.jpi5pG (%check)
zstd-1.5.5-alt2
test209 : thread pool API tests :
thread pool test : threadPool re-use roundtrips: OK
thread pool test : threadPool simultaneous usage: OK
thread pool tests OK
1 11 14 16 19 21
29 31 45 48 50
53 54 61 65 70 77
90 93 95 98 104
109 121 123 127 139 147
151 152 161 165 166
168 171 175 177 178 180
188 192 198 208 218
221 222 242 253 262 264
267 268 273 276 278
281 294 301 307 308 309
314 320 325 331 332
336 351 356 362 367 384
392 400 408 411 415
418 436 438 448 462 468
482 487 490 496 501
506 516 528 529 533 546
553 565 572 578 590
591 594 602 610 615 624
633 635 637 641 650
651 665 670 673 675 676
680 688 697 702 716
729 730 733 744 751 760
764 765 769 781 784
798 802 804 810 817 826
833 840 855 868 870
881 889 897 899 901 911
913 925 930 943 953
957 959 963 971 977 982
990 994 996 1001 1002
1016 1021 1026 1030 1038
1059 1065 1068 1077 1087
1099 1105 1114 1127 1136
1140 1148 1156 1169 1173
1179 1183 1190 1191 1198
1205 1208 1214 1224 1245
1253 1256 1263 1267 1274
1276 1284 1285 1287 1297
1302 1308 1313 1319 1322
1331 1346 1354 1369 1371
1372 1376 1387 1399 1412
1413 1415 1420 1425 1438
1441 1442 1458 1460 1462
1475 1488 1490 1494 1503
1516 1517 1519 1523 1529 1532
make: Leaving directory '/usr/src/RPM/BUILD/zstd-1.5.5-alt2/tests'
make: Target 'test' not remade because of errors.
error: Bad exit status from /usr/src/tmp/rpmb-tmp.XrVRCt (%check)
RPM build errors:
Bad exit status from /usr/src/tmp/rpmb-tmp.XrVRCt (%check)
15 error logs REMOVED from the list
deepin-app-services-1.0.25-alt3
deepin-launchpad-0.6.12-alt2
deepin-movie-6.0.7-alt1
deepin-music-7.0.5-alt2
deepin-screen-recorder-6.0.5-alt1
deepin-widgets-6.0.22-alt1
gz-rendering-10.0.2-alt1
gz-sim-10.5.0-alt1
jasmine-gjs-3.10.1-alt1
litmus-0.14.0-alt2.git.9fbc73d
nushell-0.114.1-alt1
python3-module-curio-1.6-alt1
python3-module-jupyter_server-2.16.0-alt1
python3-module-pexpect-4.9.0-alt1
python3-module-pyshark-0.6-alt3
Total 89 error logs.
^ permalink raw reply [flat|nested] only message in thread
only message in thread, other threads:[~2026-09-27 7:03 UTC | newest]
Thread overview: (only message) (download: mbox.gz / follow: Atom feed)
-- links below jump to the message on this page --
2026-09-27 7:03 [cyber] I: p11-20260927 x86_64 beehive_status: +16 -15 (89) ALT beekeeper
ALT Linux Sisyphus cybertalk
This inbox may be cloned and mirrored by anyone:
git clone --mirror http://lore.altlinux.org/sisyphus-cybertalk/0 sisyphus-cybertalk/git/0.git
# If you have public-inbox 1.1+ installed, you may
# initialize and index your mirror using the following commands:
public-inbox-init -V2 sisyphus-cybertalk sisyphus-cybertalk/ http://lore.altlinux.org/sisyphus-cybertalk \
sisyphus-cybertalk@lists.altlinux.org sisyphus-cybertalk@lists.altlinux.ru sisyphus-cybertalk@lists.altlinux.com
public-inbox-index sisyphus-cybertalk
Example config snippet for mirrors.
Newsgroup available over NNTP:
nntp://lore.altlinux.org/org.altlinux.lists.sisyphus-cybertalk
AGPL code for this site: git clone https://public-inbox.org/public-inbox.git