ALT Linux Sisyphus cybertalk
 help / color / mirror / Atom feed
* [cyber] I: Sisyphus-20260926 i586 beehive_status: +33 -62 (306)
@ 2026-09-26 12:05 ALT beekeeper
  0 siblings, 0 replies; only message in thread
From: ALT beekeeper @ 2026-09-26 12:05 UTC (permalink / raw)
  To: sisyphus-cybertalk

[-- Warning: decoded text below may be mangled, UTF-8 assumed --]
[-- Attachment #1: Type: text/plain; charset=unknown-8bit, Size: 31053 bytes --]

	33 NEW error logs

Vanilla-Conquer-06032023-alt1.1
	pkg-config is already the newest version.
	E: Couldn't find package gcc13-c++
	hsh-install: Failed to calculate package file list.

c2man-2.0.40-alt1.3
	flex is already the newest version.
	E: Couldn't find package gcc13
	hsh-install: Failed to calculate package file list.

cppcheck-2.18.1-alt1_0_12337740f
	[ 48%] Building CXX object
	lib/CMakeFiles/cppcheck-core.dir/build/mc_templatesimplifier.cpp.o
	cd /usr/src/RPM/BUILD/cppcheck-2.18.1/i586-alt-linux/lib
	&& /usr/bin/c++ -DFILESDIR=\"/usr/share/Cppcheck\"
	-DHAVE_RULES -I/usr/src/RPM/BUILD/cppcheck-2.18.1/i586-alt-linux/lib
	-I/usr/src/RPM/BUILD/cppcheck-2.18.1/lib -I/usr/src/RPM/BUILD/cppcheck-2.18.1/externals
	-I/usr/src/RPM/BUILD/cppcheck-2.18.1/externals/tinyxml2
	-I/usr/src/RPM/BUILD/cppcheck-2.18.1/externals/picojson
	-I/usr/src/RPM/BUILD/cppcheck-2.18.1/externals/simplecpp -isystem /usr/include/pcre
	-pipe -frecord-gcc-switches -Wall -g -O2 -flto=auto -march=i586 -mtune=generic
	-Wno-error=return-type -O2 -DNDEBUG -std=c++11 -O2 -pedantic -Wall -Wextra -Wcast-qual
	-Wfloat-equal -Wmissing-declarations -Wmissing-format-attribute -Wno-long-long -Wpacked
	-Wredundant-decls -Wundef -Wno-sign-compare -Wno-multichar -Woverloaded-virtual
	-pipe -Wsuggest-attribute=noreturn -Wuseless-cast -Winvalid-pch -include
	/usr/src/RPM/BUILD/cppcheck-2.18.1/i586-alt-linux/lib/CMakeFiles/cppcheck-core.dir/cmake_pch.hxx
	-MD -MT lib/CMakeFiles/cppcheck-core.dir/build/mc_templatesimplifier.cpp.o
	-MF CMakeFiles/cppcheck-core.dir/build/mc_templatesimplifier.cpp.o.d
	-o CMakeFiles/cppcheck-core.dir/build/mc_templatesimplifier.cpp.o -c
	/usr/src/RPM/BUILD/cppcheck-2.18.1/i586-alt-linux/lib/build/mc_templatesimplifier.cpp
	gmake[2]: Leaving directory '/usr/src/RPM/BUILD/cppcheck-2.18.1/i586-alt-linux'
	gmake[1]: Entering directory '/usr/src/RPM/BUILD/cppcheck-2.18.1/i586-alt-linux'
	[ 50%] Built target cppcheck-core
	gmake[1]: Leaving directory '/usr/src/RPM/BUILD/cppcheck-2.18.1/i586-alt-linux'
	gmake: *** [Makefile:146: all] Error 2
	error: Bad exit status from /usr/src/tmp/rpmb-tmp.AJqAuI (%build)
	RPM build errors:
	Bad exit status from /usr/src/tmp/rpmb-tmp.AJqAuI (%build)

dev86-0.16.21-alt2
	Building Dependency Tree...
	E: Couldn't find package gcc13
	hsh-install: Failed to calculate package file list.

eartag-1.0.3-alt1
	stderr:
	Fatal Python error: Segmentation fault
	Thread 0xf346cb40 [asyncio_0] (most recent call first):

gambit-4.9.7-alt5
	make[4]: Leaving directory '/usr/src/RPM/BUILD/gambit-4.9.7/lib/_irregex'
	make[4]: Entering directory '/usr/src/RPM/BUILD/gambit-4.9.7/lib'
	LD_LIBRARY_PATH=../lib:../gsi:../gsc:
	../gsc/gsc -:~~bin=../bin,~~lib=../lib,~~include=../include -f -target js  -prelude
	"(define-cond-expand-feature|enable-type-checking|)(define-cond-expand-feature|disable-auto-forcing|)(define-cond-expand-feature|enable-sharp-dot|)(define-cond-expand-feature|enable-bignum|)(define-cond-expand-feature|enable-ratnum|)(define-cond-expand-feature|enable-cpxnum|)(define-cond-expand-feature|enable-s8vector|)(define-cond-expand-feature|enable-u16vector|)(define-cond-expand-feature|enable-s16vector|)(define-cond-expand-feature|enable-u32vector|)(define-cond-expand-feature|enable-s32vector|)(define-cond-expand-feature|enable-u64vector|)(define-cond-expand-feature|enable-s64vector|)(define-cond-expand-feature|enable-f32vector|)(define-cond-expand-feature|disable-smp|)(##include\"../lib/header.scm\")"
	-label-namespace "" -c -o _gambit.js ../lib/_univlib.scm
	make[4]: Leaving directory '/usr/src/RPM/BUILD/gambit-4.9.7/lib'
	make[2]: *** [makefile:546: modules-recursive] Error 2
	make[1]: *** [makefile:373: modules] Error 2
	make: *** [makefile:107: all] Error 2
	error: Bad exit status from /usr/src/tmp/rpmb-tmp.ROsiiN (%build)
	RPM build errors:
	Bad exit status from /usr/src/tmp/rpmb-tmp.ROsiiN (%build)

gem-redfish-client-0.6.0-alt1
	Wrote: /usr/src/in/nosrpm/gem-redfish-client-0.6.0-alt1.nosrc.rpm (w1.gzdio)
	error: failed build dependencies:
	gem(excon) >= 1 conflicts with gem-redfish-client-0.6.0-alt1

gem-zeus-0.17.0-alt1
	Processing files: gem-vagrant-zeus-0.17.0-alt1
	error: No such file or directory:
	/usr/src/tmp/gem-zeus-buildroot/usr/lib/ruby/gemie/specifications/vagrant-zeus-0.17.0.gemspec
	error: No such file or directory:
	/usr/src/tmp/gem-zeus-buildroot/usr/lib/ruby/gemie/gems/vagrant-zeus-0.17.0
	error: No such file or directory:
	/usr/src/tmp/gem-zeus-buildroot/usr/lib/ruby/gemie/extensions/vagrant-zeus-0.17.0
	Executing(%doc): /bin/sh -e /usr/src/tmp/rpmb-tmp.zWkVUa
	--
	RPM build errors:
	No such file or directory:
	/usr/src/tmp/gem-zeus-buildroot/usr/lib/ruby/gemie/specifications/vagrant-zeus-0.17.0.gemspec
	No such file or directory:
	/usr/src/tmp/gem-zeus-buildroot/usr/lib/ruby/gemie/gems/vagrant-zeus-0.17.0
	No such file or directory:
	/usr/src/tmp/gem-zeus-buildroot/usr/lib/ruby/gemie/extensions/vagrant-zeus-0.17.0

gsplus-0.14-alt2
	rpm-macros-cmake is already the newest version.
	E: Couldn't find package gcc13-c++
	hsh-install: Failed to calculate package file list.

kronos-2.7.0-alt1
	rpm-macros-cmake is already the newest version.
	E: Couldn't find package gcc13-c++
	hsh-install: Failed to calculate package file list.

kubetui-1.12.1-alt1
	= note: `#[warn(dead_code)]` (part of `#[warn(unused)]`) on by default
	rustc-LLVM ERROR: out of memory
	Allocation failed
	warning: `kubetui` (bin "kubetui") generated 1 warning
	error: could not compile `kubetui` (bin "kubetui"); 1 warning emitted
	Caused by:

libfprint2-1.94.100-alt1
	raise CalledProcessError(retcode, cmd)
	subprocess.CalledProcessError: Command '['umockdev-run', '-d',
	'/usr/src/RPM/BUILD/libfprint2-1.94.100/tests/egis_etu905/device', '-p',
	'/sys/devices/pci0000:00/0000:00:14.0/usb3/3-4=/usr/src/RPM/BUILD/libfprint2-1.94.100/tests/egis_etu905/custom.pcapng',
	'--', '/usr/bin/python3',
	'/usr/src/RPM/BUILD/libfprint2-1.94.100/tests/egis_etu905/custom.py']' returned non-zero
	exit status 6.
	127/129 drivers+custom - libfprint:mafpmoc
	OK		  5.33s

libgupnp-igd-1.6.0-alt1
	Bail out!
	1/1 gupnp-igd:gupnp-simple-igd FAIL	       8.06s   killed by signal 6 SIGABRT
	Summary of Failures:
	1/1 gupnp-igd:gupnp-simple-igd FAIL	       8.06s   killed by signal 6 SIGABRT
	Ok:		   0
	Fail:		   1
	Full log written to
	/usr/src/RPM/BUILD/gupnp-igd-1.6.0/i586-alt-linux/meson-logs/testlog.txt
	error: Bad exit status from /usr/src/tmp/rpmb-tmp.X3WLrH (%check)
	RPM build errors:
	Bad exit status from /usr/src/tmp/rpmb-tmp.X3WLrH (%check)

libretro-consoles-20260127-alt2
	Building Dependency Tree...
	E: Couldn't find package gcc13
	hsh-install: Failed to calculate package file list.

libretro-engines-20251012-alt1
	Building Dependency Tree...
	E: Couldn't find package gcc13
	hsh-install: Failed to calculate package file list.

net-snmp40-5.9.4-alt1.3
	chrpath is already the newest version.
	E: Couldn't find package gcc13
	hsh-install: Failed to calculate package file list.

netatalk-4.4.2-alt1
	findutils is already the newest version.
	E: Couldn't find package gcc13
	hsh-install: Failed to calculate package file list.

openmsx-21.0-alt1
	rpm-macros-fedora-compat is already the newest version.
	E: Couldn't find package gcc13-c++
	hsh-install: Failed to calculate package file list.

perl-Net-SIP-0.840-alt1
	# received=169 lost=0 expect ca. 467.5 packets, events='1 2 D # 3 4 B *'
	#   Failed test 'UAS RTP ok'
	#   at t/19_call_with_dtmf.t line 151.
	--
	t/19_call_with_dtmf.t		      (Wstat: 256 (exited 1) Tests: 216 Failed: 1)
	Failed test:  142
	Non-zero exit status: 1
	--
	Result: FAIL
	Failed 1/26 test programs. 1/2000 subtests failed.
	make: *** [Makefile:829: test_dynamic] Error 255

phosphor-pid-control-1.0.0-alt3.git1125042.1
	2042 | typename std::decay<FunctionImpl>::type Invoke(FunctionImpl&& function_impl) {
	../test/dbus_passive_unittest.cpp:760:25: error: ‘typename
	std::decay<_Tp>::type testing::Invoke(FunctionImpl&&) [with FunctionImpl =
	pid_control::{anonymous}::DbusPassiveTestUnaSensorNotAsFailedObj_VerifyAvailableAssert_Test::TestBody()::<lambda(sd_bus_message*,
	char, void*)>; typename std::decay<_Tp>::type =
	pid_control::{anonymous}::DbusPassiveTestUnaSensorNotAsFailedObj_VerifyAvailableAssert_Test::TestBody()::<lambda(sd_bus_message*,
	char, void*)>]’ is deprecated: Actions can now be implicitly
	constructed from callables. No need to create wrapper objects using
	Invoke(). [-Werror=deprecated-declarations]
	760 |	      .WillOnce(Invoke([&]([[maybe_unused]] sd_bus_message* m,
	--
	2042 | typename std::decay<FunctionImpl>::type Invoke(FunctionImpl&& function_impl) {
	../test/dbus_passive_unittest.cpp:797:25: error: ‘typename
	std::decay<_Tp>::type testing::Invoke(FunctionImpl&&) [with FunctionImpl =
	pid_control::{anonymous}::DbusPassiveTestUnaSensorNotAsFailedObj_VerifyAvailableAssert_Test::TestBody()::<lambda(sd_bus_message*,
	char, void*)>; typename std::decay<_Tp>::type =
	pid_control::{anonymous}::DbusPassiveTestUnaSensorNotAsFailedObj_VerifyAvailableAssert_Test::TestBody()::<lambda(sd_bus_message*,
	char, void*)>]’ is deprecated: Actions can now be implicitly
	constructed from callables. No need to create wrapper objects using
	Invoke(). [-Werror=deprecated-declarations]
	797 |	      .WillOnce(Invoke([&]([[maybe_unused]] sd_bus_message* m,
	--
	2042 | typename std::decay<FunctionImpl>::type Invoke(FunctionImpl&& function_impl) {
	cc1plus: all warnings being treated as errors
	[99/108] Compiling C++ object test/sensor_host_unittest.p/sensor_host_unittest.cpp.o
	FAILED: [code=1] test/sensor_host_unittest.p/sensor_host_unittest.cpp.o
	c++ -Itest/sensor_host_unittest.p -Itest -I../test
	-I. -I.. -I/usr/include/phosphor-dbus-interfaces -flto=auto -fdiagnostics-color=always
	-D_GLIBCXX_ASSERTIONS=1 -D_FILE_OFFSET_BITS=64 -Wall -Winvalid-pch -Wextra -Wpedantic
	-Werror -std=c++23 -O2 -g -pipe -frecord-gcc-switches -Wall -g -O2 -flto=auto -march=i586
	-mtune=generic -DBOOST_ASIO_DISABLE_THREADS -DBOOST_ALL_NO_LIB -DBOOST_SYSTEM_NO_DEPRECATED
	-DBOOST_ERROR_CODE_HEADER_ONLY -DBOOST_COROUTINES_NO_DEPRECATION_WARNING
	-DGTEST_HAS_PTHREAD=1 -MD -MQ test/sensor_host_unittest.p/sensor_host_unittest.cpp.o
	-MF test/sensor_host_unittest.p/sensor_host_unittest.cpp.o.d -o
	test/sensor_host_unittest.p/sensor_host_unittest.cpp.o -c ../test/sensor_host_unittest.cpp
	--
	../test/helpers.hpp: In function ‘void
	pid_control::SetupDbusObject(sdbusplus::SdBusMock*, bool, const std::string&, const
	std::string&, const std::vector<std::__cxx11::basic_string<char> >&, double*)’:
	../test/helpers.hpp:61:35: error: ‘typename std::decay<_Tp>::type
	testing::Invoke(FunctionImpl&&) [with FunctionImpl =
	pid_control::SetupDbusObject(sdbusplus::SdBusMock*, bool, const std::string&,
	const std::string&, const std::vector<std::__cxx11::basic_string<char> >&,
	double*)::<lambda(sd_bus*, const char*, const char*, const char**)>; typename
	std::decay<_Tp>::type = pid_control::SetupDbusObject(sdbusplus::SdBusMock*, bool, const
	std::string&, const std::string&, const std::vector<std::__cxx11::basic_string<char> >&,
	double*)::<lambda(sd_bus*, const char*, const char*, const char**)>]’ is deprecated:
	Actions can now be implicitly constructed from callables. No need to create wrapper
	objects using Invoke(). [-Werror=deprecated-declarations]
	61 |		 .WillRepeatedly(Invoke([=]([[maybe_unused]] sd_bus* bus,
	--
	../test/sensor_host_unittest.cpp: In member function ‘virtual void
	pid_control::{anonymous}::HostSensorTest_VerifyWriteThenReadMatches_Test::TestBody()’:
	../test/sensor_host_unittest.cpp:101:25: error: ‘typename
	std::decay<_Tp>::type testing::Invoke(FunctionImpl&&) [with FunctionImpl =
	pid_control::{anonymous}::HostSensorTest_VerifyWriteThenReadMatches_Test::TestBody()::<lambda(sd_bus*,
	const char*, const char*, const char**)>; typename std::decay<_Tp>::type =
	pid_control::{anonymous}::HostSensorTest_VerifyWriteThenReadMatches_Test::TestBody()::<lambda(sd_bus*,
	const char*, const char*, const char**)>]’ is deprecated: Actions can now be
	implicitly constructed from callables. No need to create wrapper objects using
	Invoke(). [-Werror=deprecated-declarations]
	101 |	      .WillOnce(Invoke(
	--
	2042 | typename std::decay<FunctionImpl>::type Invoke(FunctionImpl&& function_impl) {
	cc1plus: all warnings being treated as errors
	[100/108] Compiling C++ object test/sensor_manager_unittest.p/sensor_manager_unittest.cpp.o
	[101/108] Compiling C++ object test/pid_zone_unittest.p/pid_zone_unittest.cpp.o
	FAILED: [code=1] test/pid_zone_unittest.p/pid_zone_unittest.cpp.o
	c++ -Itest/pid_zone_unittest.p -Itest -I../test
	-I. -I.. -I/usr/include/phosphor-dbus-interfaces -flto=auto -fdiagnostics-color=always
	-D_GLIBCXX_ASSERTIONS=1 -D_FILE_OFFSET_BITS=64 -Wall -Winvalid-pch -Wextra -Wpedantic
	-Werror -std=c++23 -O2 -g -pipe -frecord-gcc-switches -Wall -g -O2 -flto=auto -march=i586
	-mtune=generic -DBOOST_ASIO_DISABLE_THREADS -DBOOST_ALL_NO_LIB -DBOOST_SYSTEM_NO_DEPRECATED
	-DBOOST_ERROR_CODE_HEADER_ONLY -DBOOST_COROUTINES_NO_DEPRECATION_WARNING
	-DGTEST_HAS_PTHREAD=1 -MD -MQ test/pid_zone_unittest.p/pid_zone_unittest.cpp.o
	-MF test/pid_zone_unittest.p/pid_zone_unittest.cpp.o.d -o
	test/pid_zone_unittest.p/pid_zone_unittest.cpp.o -c ../test/pid_zone_unittest.cpp
	--
	../test/helpers.hpp: In function ‘void
	pid_control::SetupDbusObject(sdbusplus::SdBusMock*, bool, const std::string&, const
	std::string&, const std::vector<std::__cxx11::basic_string<char> >&, double*)’:
	../test/helpers.hpp:61:35: error: ‘typename std::decay<_Tp>::type
	testing::Invoke(FunctionImpl&&) [with FunctionImpl =
	pid_control::SetupDbusObject(sdbusplus::SdBusMock*, bool, const std::string&,
	const std::string&, const std::vector<std::__cxx11::basic_string<char> >&,
	double*)::<lambda(sd_bus*, const char*, const char*, const char**)>; typename
	std::decay<_Tp>::type = pid_control::SetupDbusObject(sdbusplus::SdBusMock*, bool, const
	std::string&, const std::string&, const std::vector<std::__cxx11::basic_string<char> >&,
	double*)::<lambda(sd_bus*, const char*, const char*, const char**)>]’ is deprecated:
	Actions can now be implicitly constructed from callables. No need to create wrapper
	objects using Invoke(). [-Werror=deprecated-declarations]
	61 |		 .WillRepeatedly(Invoke([=]([[maybe_unused]] sd_bus* bus,
	--
	../test/pid_zone_unittest.cpp: In member function ‘virtual void
	pid_control::{anonymous}::PidZoneTest_AddPidControlProcessGetAndSetEnableTest_BehavesAsExpected_Test::TestBody()’:
	../test/pid_zone_unittest.cpp:192:25: error: ‘typename
	std::decay<_Tp>::type testing::Invoke(FunctionImpl&&) [with FunctionImpl =
	pid_control::{anonymous}::PidZoneTest_AddPidControlProcessGetAndSetEnableTest_BehavesAsExpected_Test::TestBody()::<lambda(sd_bus*,
	const char*, const char*, const char**)>; typename std::decay<_Tp>::type =
	pid_control::{anonymous}::PidZoneTest_AddPidControlProcessGetAndSetEnableTest_BehavesAsExpected_Test::TestBody()::<lambda(sd_bus*,
	const char*, const char*, const char**)>]’ is deprecated: Actions can now be
	implicitly constructed from callables. No need to create wrapper objects using
	Invoke(). [-Werror=deprecated-declarations]
	192 |	      .WillOnce(Invoke(

phosphor-user-manager-0.1-alt3.git19c0883.1
	[25/26] Compiling C++ object test/user_mgr_test.p/user_mgr_test.cpp.o
	FAILED: [code=1] test/user_mgr_test.p/user_mgr_test.cpp.o
	c++ -Itest/user_mgr_test.p -Itest -I../test
	-I. -I.. -I/usr/include/phosphor-dbus-interfaces -fdiagnostics-color=always
	-D_GLIBCXX_ASSERTIONS=1 -D_FILE_OFFSET_BITS=64 -Wall -Winvalid-pch -Wextra -Wpedantic
	-Werror -std=c++23 -O2 -g -DENABLE_ROOT_USER_MGMT -pipe -frecord-gcc-switches
	-Wall -g -O2 -flto=auto -march=i586 -mtune=generic -DBOOST_ASIO_DISABLE_THREADS
	-DBOOST_ALL_NO_LIB -DBOOST_SYSTEM_NO_DEPRECATED -DBOOST_ERROR_CODE_HEADER_ONLY
	-DBOOST_COROUTINES_NO_DEPRECATION_WARNING -DGTEST_HAS_PTHREAD=1 -MD -MQ
	test/user_mgr_test.p/user_mgr_test.cpp.o -MF test/user_mgr_test.p/user_mgr_test.cpp.o.d
	-o test/user_mgr_test.p/user_mgr_test.cpp.o -c ../test/user_mgr_test.cpp
	../test/user_mgr_test.cpp: In member function ‘void
	phosphor::user::TestUserMgr::testPasswordExpirationSet(const
	std::string&, const phosphor::user::{anonymous}::PasswordInfo&, const
	phosphor::user::{anonymous}::PasswordInfo&)’:
	../test/user_mgr_test.cpp:176:29: error: ‘typename
	std::decay<_Tp>::type testing::Invoke(FunctionImpl&&) [with FunctionImpl
	= phosphor::user::TestUserMgr::testPasswordExpirationSet(const
	std::string&, const phosphor::user::{anonymous}::PasswordInfo&, const
	phosphor::user::{anonymous}::PasswordInfo&)::<lambda(auto:82, spwd&)>; typename
	std::decay<_Tp>::type = phosphor::user::TestUserMgr::testPasswordExpirationSet(const
	std::string&, const phosphor::user::{anonymous}::PasswordInfo&, const
	phosphor::user::{anonymous}::PasswordInfo&)::<lambda(auto:82, spwd&)>]’ is deprecated:
	Actions can now be implicitly constructed from callables. No need to create wrapper
	objects using Invoke(). [-Werror=deprecated-declarations]
	176 |		  .WillOnce(Invoke([&oldInfo](auto, struct spwd& spwd) {
	--
	../test/user_mgr_test.cpp: In member function ‘void
	phosphor::user::TestUserMgr::testPasswordExpirationReset(const std::string&, const
	phosphor::user::{anonymous}::PasswordInfo&)’:
	../test/user_mgr_test.cpp:200:29: error: ‘typename
	std::decay<_Tp>::type testing::Invoke(FunctionImpl&&) [with FunctionImpl =
	phosphor::user::TestUserMgr::testPasswordExpirationReset(const std::string&, const
	phosphor::user::{anonymous}::PasswordInfo&)::<lambda(auto:83, spwd&)>; typename
	std::decay<_Tp>::type = phosphor::user::TestUserMgr::testPasswordExpirationReset(const
	std::string&, const phosphor::user::{anonymous}::PasswordInfo&)::<lambda(auto:83,
	spwd&)>]’ is deprecated: Actions can now be implicitly constructed from callables. No
	need to create wrapper objects using Invoke(). [-Werror=deprecated-declarations]
	200 |		  .WillOnce(Invoke([&info](auto, struct spwd& spwd) {
	--
	../test/user_mgr_test.cpp: In member function ‘void
	phosphor::user::TestUserMgr::testPasswordExpirationGet(const std::string&, const
	phosphor::user::{anonymous}::PasswordInfo&, uint64_t)’:
	../test/user_mgr_test.cpp:225:29: error: ‘typename
	std::decay<_Tp>::type testing::Invoke(FunctionImpl&&) [with FunctionImpl =
	phosphor::user::TestUserMgr::testPasswordExpirationGet(const std::string&, const
	phosphor::user::{anonymous}::PasswordInfo&, uint64_t)::<lambda(auto:84, spwd&)>; typename
	std::decay<_Tp>::type = phosphor::user::TestUserMgr::testPasswordExpirationGet(const
	std::string&, const phosphor::user::{anonymous}::PasswordInfo&, uint64_t)::<lambda(auto:84,
	spwd&)>]’ is deprecated: Actions can now be implicitly constructed from callables. No
	need to create wrapper objects using Invoke(). [-Werror=deprecated-declarations]
	225 |		  .WillOnce(Invoke([&info](auto, struct spwd& spwd) {
	--
	../test/user_mgr_test.cpp: In member function ‘virtual void
	phosphor::user::TestUserMgr_PasswordExpirationGetLastChangeZero_Test::TestBody()’:
	../test/user_mgr_test.cpp:415:25: error: ‘typename
	std::decay<_Tp>::type testing::Invoke(FunctionImpl&&) [with FunctionImpl =
	phosphor::user::TestUserMgr_PasswordExpirationGetLastChangeZero_Test::TestBody()::<lambda(auto:85,
	spwd&)>; typename std::decay<_Tp>::type =
	phosphor::user::TestUserMgr_PasswordExpirationGetLastChangeZero_Test::TestBody()::<lambda(auto:85,
	spwd&)>]’ is deprecated: Actions can now be implicitly constructed from callables. No
	need to create wrapper objects using Invoke(). [-Werror=deprecated-declarations]
	415 |	      .WillOnce(Invoke([](auto, struct spwd& spwd) {
	--
	../test/user_mgr_test.cpp: In member function ‘virtual void
	phosphor::user::TestUserMgr_PasswordExpirationInvalidDate_Test::TestBody()’:
	../test/user_mgr_test.cpp:467:25: error: ‘typename
	std::decay<_Tp>::type testing::Invoke(FunctionImpl&&) [with FunctionImpl =
	phosphor::user::TestUserMgr_PasswordExpirationInvalidDate_Test::TestBody()::<lambda(auto:86,
	spwd&)>; typename std::decay<_Tp>::type =
	phosphor::user::TestUserMgr_PasswordExpirationInvalidDate_Test::TestBody()::<lambda(auto:86,
	spwd&)>]’ is deprecated: Actions can now be implicitly constructed from callables. No
	need to create wrapper objects using Invoke(). [-Werror=deprecated-declarations]
	467 |	      .WillOnce(Invoke([](auto, struct spwd& spwd) {
	--
	../test/user_mgr_test.cpp: In member function ‘virtual void
	phosphor::user::TestUserMgr_PasswordExpirationExecFail_Test::TestBody()’:
	../test/user_mgr_test.cpp:491:25: error: ‘typename
	std::decay<_Tp>::type testing::Invoke(FunctionImpl&&) [with FunctionImpl =
	phosphor::user::TestUserMgr_PasswordExpirationExecFail_Test::TestBody()::<lambda(auto:87,
	spwd&)>; typename std::decay<_Tp>::type =
	phosphor::user::TestUserMgr_PasswordExpirationExecFail_Test::TestBody()::<lambda(auto:87,
	spwd&)>]’ is deprecated: Actions can now be implicitly constructed from callables. No
	need to create wrapper objects using Invoke(). [-Werror=deprecated-declarations]
	491 |	      .WillOnce(Invoke([](auto, struct spwd& spwd) {
	--
	../test/user_mgr_test.cpp: In lambda function:
	../test/user_mgr_test.cpp:641:32: error: ignoring returned value of type
	‘testing::PolymorphicAction<testing::internal::ReturnVoidAction>’, declared with
	attribute ‘nodiscard’ [-Werror=unused-result]
	641 |		      testing::Return();
	--
	../test/user_mgr_test.cpp: In lambda function:
	../test/user_mgr_test.cpp:649:32: error: ignoring returned value of type
	‘testing::PolymorphicAction<testing::internal::ReturnVoidAction>’, declared with
	attribute ‘nodiscard’ [-Werror=unused-result]
	649 |		      testing::Return();
	--
	../test/user_mgr_test.cpp: In lambda function:
	../test/user_mgr_test.cpp:669:32: error: ignoring returned value of type
	‘testing::PolymorphicAction<testing::internal::ReturnVoidAction>’, declared with
	attribute ‘nodiscard’ [-Werror=unused-result]
	669 |		      testing::Return();

plumelib-hashmap-util-1.0.0-alt1
	> Task :classes UP-TO-DATE
	> Task :compileTestJava FAILED
	/usr/src/.gradle/caches/xgradle/ivy/f2fe01781741417e1d76027b77b363d2/org.junit.jupiter/junit-jupiter-api/5.14.4/junit-jupiter-api-5.14.4.jar(/org/junit/jupiter/api/Assertions.class):
	warning: Cannot find annotation method 'status()' in type 'API': class file for
	org.apiguardian.api.API not found
	--
	/usr/src/.gradle/caches/xgradle/ivy/f2fe01781741417e1d76027b77b363d2/org.junit.jupiter/junit-jupiter-api/5.14.4/junit-jupiter-api-5.14.4.jar(/org/junit/jupiter/api/Assertions.class):
	warning: Cannot find annotation method 'status()' in type 'API'
	error: warnings found and -Werror specified
	1 error
	--
	warning: unknown enum constant Status.STABLE
	error: warnings found and -Werror specified
	1 error
	--
	For more on this, please refer to
	https://docs.gradle.org/9.7.1/userguide/command_line_interface.html#sec:command_line_warnings
	in the Gradle documentation.
	BUILD FAILED in 3s
	2 actionable tasks: 1 executed, 1 up-to-date

pom1-1.0.0-alt2
	MI2a:	    marked for install (shallow): libImageMagick7-common
	E: Couldn't find package gcc13
	hsh-install: Failed to calculate package file list.

premake5-5.0.0.beta2-alt2
	libcurl-devel is already the newest version.
	E: Couldn't find package gcc13
	hsh-install: Failed to calculate package file list.

python3-module-devpi-server-6.20.3-alt1
	SKIPPED [4] test_devpi_server/test_streaming.py:103: No nginx executable found.
	FAILED test_devpi_server/test_mythread.py::test_run - Failed: Timeout (>60.0s...
	===== 1 failed, 1133 passed, 53 skipped, 26 warnings in 561.67s (0:09:21) ======
	INFO	 : Command's result: FAILURE
	INFO	 : Command's error: Command '['python3', '-m', 'pytest', '-ra']' returned
	non-zero exit status 1.
	error: Bad exit status from /usr/src/tmp/rpmb-tmp.IxQa7A (%check)

python3-module-paho-2.1.0-alt2
	"on_disconnect",
	E	    AssertionError: assert ['on_connect'..._unsubscribe'] ==
	['on_connect'...n_disconnect']
	E
	--
	"on_disconnect",
	E	    AssertionError: assert ['on_connect'..._unsubscribe'] ==
	['on_connect'...n_disconnect']
	E
	--
	=========================== short test summary info ============================
	FAILED tests/test_client.py::TestCompatibility::test_callback_v1_mqtt3[unix]
	FAILED tests/test_client.py::TestCompatibility::test_callback_v2_mqtt3[unix]
	ERROR tests/lib/test_01_unpwd_set.py::test_01_unpwd_set - RuntimeError: Clien...
	ERROR tests/lib/test_01_will_set.py::test_01_will_set - RuntimeError: Client ...
	ERROR tests/lib/test_01_will_unpwd_set.py::test_01_will_unpwd_set - RuntimeEr...
	ERROR tests/lib/test_03_publish_helper_qos0_v5.py::test_03_publish_helper_qos0_v5
	ERROR
	tests/lib/test_03_publish_helper_qos1_disconnect.py::test_03_publish_helper_qos1_disconnect
	ERROR tests/lib/test_08_ssl_fake_cacert.py::test_08_ssl_fake_cacert - Runtime...
	======= 2 failed, 134 passed, 26 skipped, 1 xfailed, 6 errors in 37.75s ========

python3-module-vcrpy-8.1.1-alt2
	>	    self.sock.sendall(data)
	E	    BrokenPipeError: [Errno 32] Broken pipe
	/usr/lib/python3.14/http/client.py:1105: BrokenPipeError
	--
	=========================== short test summary info ============================
	FAILED tests/unit/test_stubs.py::TestVCRConnection::test_body_consumed_once_iterator
	================= 1 failed, 177 passed, 3 deselected in 1.87s ==================
	INFO	 : Command's result: FAILURE
	INFO	 : Command's error: Command '['python3', '-m', 'pytest', '-ra', '-m', 'not online',
	'tests/unit/']' returned non-zero exit status 1.
	error: Bad exit status from /usr/src/tmp/rpmb-tmp.B7PJrC (%check)

python3-module-zict-3.0.0-alt1
	File "/usr/src/RPM/BUILD/python3-module-zict-3.0.0/zict/tests/utils_test.py", line 193,
	in check_different_keys_threadsafe
	f1.result()
	File "/usr/lib/python3.14/concurrent/futures/_base.py", line 449, in result
	self._condition.wait(timeout)
	File "/usr/lib/python3.14/threading.py", line 370, in wait
	waiter.acquire()
	+++++++++++++++++++++++++++++++++++ Timeout ++++++++++++++++++++++++++++++++++++
	error: Bad exit status from /usr/src/tmp/rpmb-tmp.7qH3hV (%check)
	RPM build errors:
	Bad exit status from /usr/src/tmp/rpmb-tmp.7qH3hV (%check)

twelvemonkeys-3.13.1-alt1
	[ERROR] com.twelvemonkeys.util.TimeoutMapTest.testWrapMapContainingValues -- Time elapsed:
	0.009 s <<< FAILURE!
	org.opentest4j.AssertionFailedError: expected: not <null>
	at org.junit.jupiter.api.AssertionFailureBuilder.build(AssertionFailureBuilder.java:152)

twitter4j-4.1.2-alt1
	formats[N_MINUTES_AGO] = new MessageFormat("{0}??? ???");
	/usr/src/RPM/BUILD/twitter4j-4.1.2/twitter4j-core/src/main/java/twitter4j/TimeSpanConverter.java:86:
	error: unmappable character (0xEC) for encoding US-ASCII
	formats[N_MINUTES_AGO] = new MessageFormat("{0}??? ???");
	/usr/src/RPM/BUILD/twitter4j-4.1.2/twitter4j-core/src/main/java/twitter4j/TimeSpanConverter.java:86:
	error: unmappable character (0xA0) for encoding US-ASCII
	formats[N_MINUTES_AGO] = new MessageFormat("{0}??? ???");
	/usr/src/RPM/BUILD/twitter4j-4.1.2/twitter4j-core/src/main/java/twitter4j/TimeSpanConverter.java:86:
	error: unmappable character (0x84) for encoding US-ASCII
	formats[N_MINUTES_AGO] = new MessageFormat("{0}??? ???");
	/usr/src/RPM/BUILD/twitter4j-4.1.2/twitter4j-core/src/main/java/twitter4j/TimeSpanConverter.java:87:
	error: unmappable character (0xEC) for encoding US-ASCII
	formats[AN_HOUR_AGO] = new MessageFormat("1?????? ???");
	/usr/src/RPM/BUILD/twitter4j-4.1.2/twitter4j-core/src/main/java/twitter4j/TimeSpanConverter.java:87:
	error: unmappable character (0x8B) for encoding US-ASCII
	formats[AN_HOUR_AGO] = new MessageFormat("1?????? ???");
	/usr/src/RPM/BUILD/twitter4j-4.1.2/twitter4j-core/src/main/java/twitter4j/TimeSpanConverter.java:87:
	error: unmappable character (0x9C) for encoding US-ASCII
	formats[AN_HOUR_AGO] = new MessageFormat("1?????? ???");
	/usr/src/RPM/BUILD/twitter4j-4.1.2/twitter4j-core/src/main/java/twitter4j/TimeSpanConverter.java:87:
	error: unmappable character (0xEA) for encoding US-ASCII
	formats[AN_HOUR_AGO] = new MessageFormat("1?????? ???");
	/usr/src/RPM/BUILD/twitter4j-4.1.2/twitter4j-core/src/main/java/twitter4j/TimeSpanConverter.java:87:
	error: unmappable character (0xB0) for encoding US-ASCII
	formats[AN_HOUR_AGO] = new MessageFormat("1?????? ???");
	/usr/src/RPM/BUILD/twitter4j-4.1.2/twitter4j-core/src/main/java/twitter4j/TimeSpanConverter.java:87:
	error: unmappable character (0x84) for encoding US-ASCII
	formats[AN_HOUR_AGO] = new MessageFormat("1?????? ???");
	/usr/src/RPM/BUILD/twitter4j-4.1.2/twitter4j-core/src/main/java/twitter4j/TimeSpanConverter.java:87:
	error: unmappable character (0xEC) for encoding US-ASCII
	formats[AN_HOUR_AGO] = new MessageFormat("1?????? ???");

wlmaker-0.8.1-alt1
	workspace							  OK:  11/ 11
	FAILED:									 1/ 29
	primitives.minimize_large
	11/11 Test #11: wlmaker_test .....................   Passed    0.02 sec
	91% tests passed, 1 tests failed out of 11
	Total Test time (real) =   0.02 sec
	The following tests FAILED:
	10 - toolkit_test (Failed)

xjewel-1:1.6-alt7
	MI2a:	 marked for install (shallow): libXext
	E: Couldn't find package gcc13
	hsh-install: Failed to calculate package file list.

xnp21kai-rev.22-alt1.git4b109ea
	Building Dependency Tree...
	E: Couldn't find package gcc13-c++
	hsh-install: Failed to calculate package file list.

	62 error logs REMOVED from the list
alsa-scarlett-gui-0.5.1-alt3
auditd-plugin-clickhouse-lite-0.1.9-alt3
badass-jar-plugin-2.0.0-alt1
compiz-0.9.14.2-alt3.4
cvs-1.11.23-alt9
deadbeef-1.9.6-alt2
drumgizmo-0.9.20-alt3
ee-1.5.2-alt1
felix-gogo-runtime-1.1.6-alt1
freeplane-twemoji-12.1.4-alt2
gawk-5.1.0.0.213.d04f-alt2
gcc10-10.5.0-alt1
gcc12-12.3.1-alt1
gcc13-13.2.1-alt5
gem-acts-as-list-1.2.6-alt1
gem-amazing-print-2.0.0-alt1
gem-autotest-suffix-1.1.0-alt1
gem-benchmark-suite-1.0.0.4-alt0.1
gem-cuprite-0.17-alt1
gem-dbi-dbrc-1.7.0.24-alt0.1
gem-ffi-1.17.0-alt2
gem-fission-0.5.0-alt2.1
gem-friendly-id-5.5.1-alt1
gem-hammer-cli-3.18.0-alt1
gem-hammer-cli-foreman-3.18.1-alt1
gem-importmap-rails-2.1.0-alt1
gem-indexer-0.3.0-alt1
gem-k8s-ruby-0.17.2-alt1
gem-license-finder-7.2.1-alt1.1
gem-memoist3-1.0.0-alt1
gem-mongrel-1.2.0-alt2
gem-mutex-m-0.3.0-alt1
gem-pathspec-1.1.3-alt1
gem-turbo-rails-2.0.5-alt1
gtranslator-50.0-alt1
hamcrest-3.0-alt1
ignition-adw-2.1.2-alt1
jetbrains-annotations-24.1.0-alt2
jsqlparser-5.3-alt1
kf5-kdiagram-2.8.0-alt2
libuv-1.52.1-alt2
linux-pam-1.7.2-alt1
linuxdoc-tools-0.9.69-alt4
m4b-tool-0.5.2-alt1
mlt7-7.36.1-alt1
objectweb-asm-9.9-alt1
picocli-4.7.7-alt1
plumelib-options-2.0.3-alt2
podman-tui-1.11.3-alt1
publican-4.3.2-alt5_22
python3-module-chess-1.11.2-alt1
python3-module-cross-web-0.7.0-alt1
python3-module-gocept.testing-4.0-alt1.1
python3-module-vulture-2.4-alt1.1
reactive-streams-jvm-1.0.4-alt3
sercd-3.0.0-alt1.qa1
sfizz-1.2.3-alt5.g93da04262
spotbugs-4.9.8-alt2
squidmill-2.7.0-alt2
stevia-0.56.0-alt1
television-0.15.9-alt1
u3-tool-0.3-alt1.qa1

Total 306 error logs.


^ permalink raw reply	[flat|nested] only message in thread

only message in thread, other threads:[~2026-09-26 12:05 UTC | newest]

Thread overview: (only message) (download: mbox.gz / follow: Atom feed)
-- links below jump to the message on this page --
2026-09-26 12:05 [cyber] I: Sisyphus-20260926 i586 beehive_status: +33 -62 (306) ALT beekeeper

ALT Linux Sisyphus cybertalk

This inbox may be cloned and mirrored by anyone:

	git clone --mirror http://lore.altlinux.org/sisyphus-cybertalk/0 sisyphus-cybertalk/git/0.git

	# If you have public-inbox 1.1+ installed, you may
	# initialize and index your mirror using the following commands:
	public-inbox-init -V2 sisyphus-cybertalk sisyphus-cybertalk/ http://lore.altlinux.org/sisyphus-cybertalk \
		sisyphus-cybertalk@lists.altlinux.org sisyphus-cybertalk@lists.altlinux.ru sisyphus-cybertalk@lists.altlinux.com
	public-inbox-index sisyphus-cybertalk

Example config snippet for mirrors.
Newsgroup available over NNTP:
	nntp://lore.altlinux.org/org.altlinux.lists.sisyphus-cybertalk


AGPL code for this site: git clone https://public-inbox.org/public-inbox.git