* [cyber] I: Sisyphus-20260926 x86_64 beehive_status: +19 -39 (344)
@ 2026-09-26 7:42 ALT beekeeper
0 siblings, 0 replies; only message in thread
From: ALT beekeeper @ 2026-09-26 7:42 UTC (permalink / raw)
To: sisyphus-cybertalk
19 NEW error logs
bookokrat-0.3.12-alt1
all doctests ran in 1.72s; merged doctests compilation took 1.69s
error: 1 target failed:
`--lib`
compiz-0.9.14.2-alt3.4
[ 1%] Generating /usr/src/RPM/BUILD/compiz-0.9.14.2/po/compiz.pot
cd /usr/src/RPM/BUILD/compiz-0.9.14.2/po && /usr/bin/intltool-update --gettext-package
compiz --pot
make[2]: Leaving directory '/usr/src/RPM/BUILD/compiz-0.9.14.2/x86_64-alt-linux'
make[1]: Entering directory '/usr/src/RPM/BUILD/compiz-0.9.14.2/x86_64-alt-linux'
[ 24%] Built target nls
make[1]: Leaving directory '/usr/src/RPM/BUILD/compiz-0.9.14.2/x86_64-alt-linux'
make: *** [Makefile:169: all] Error 2
error: Bad exit status from /usr/src/tmp/rpmb-tmp.olBpjl (%build)
RPM build errors:
Bad exit status from /usr/src/tmp/rpmb-tmp.olBpjl (%build)
fonts-ttf-IosevkaCurly-34.8.1-alt1
[ACTION] Create TTF 'dist/IosevkaCurly/TTF-Unhinted/IosevkaCurly-Thin.ttf'
[ACTION] Create TTF 'dist/IosevkaCurly/TTF-Unhinted/IosevkaCurly-ExtendedThin.ttf'
[ACTION] Create TTF 'dist/IosevkaCurly/TTF-Unhinted/IosevkaCurly-ThinOblique.ttf'
[ACTION] Create TTF 'dist/IosevkaCurly/TTF-Unhinted/IosevkaCurly-ExtendedThinOblique.ttf'
[ACTION] Hint TTF 'dist/IosevkaCurly/TTF/IosevkaCurly-ExtraLight.ttf' <-
'dist/IosevkaCurly/TTF-Unhinted/IosevkaCurly-ExtraLight.ttf'
[ACTION] Hint TTF 'dist/IosevkaCurly/TTF/IosevkaCurly-ExtendedHeavy.ttf' <-
'dist/IosevkaCurly/TTF-Unhinted/IosevkaCurly-ExtendedHeavy.ttf'
/usr/src/tmp/rpmb-tmp.t7tYG6: line 134: 645785 CPU time limit exceeded npm run build --
ttf::IosevkaCurly
error: Bad exit status from /usr/src/tmp/rpmb-tmp.t7tYG6 (%build)
RPM build errors:
Bad exit status from /usr/src/tmp/rpmb-tmp.t7tYG6 (%build)
gem-redfish-client-0.6.0-alt1
Wrote: /usr/src/in/nosrpm/gem-redfish-client-0.6.0-alt1.nosrc.rpm (w1.gzdio)
error: failed build dependencies:
gem(excon) >= 1 conflicts with gem-redfish-client-0.6.0-alt1
jasmine-gjs-3.10.1-alt1
10/15 jasmine-gjs:optionsSpec OK 0.07s 7 subtests passed
5/15 jasmine-gjs:timerSpec ERROR 0.07s exit status 1
>>> ASAN_OPTIONS=halt_on_error=1:abort_on_error=1:print_summary=1 TEST_JASMINE_MOD=lib
TEST_PKGLIBEXECDIR=/usr/src/RPM/BUILD/jasmine-gjs-3.10.1/noarch-alt-linux
MSAN_OPTIONS=halt_on_error=1:abort_on_error=1:print_summary=1:print_stacktrace=1
UBSAN_OPTIONS=halt_on_error=1:abort_on_error=1:print_summary=1:print_stacktrace=1
MALLOC_PERTURB_=65 TEST_PKGDATADIR=/usr/src/RPM/BUILD/jasmine-gjs-3.10.1/src
MESON_TEST_ITERATION=1 /usr/bin/gjs -m
/usr/src/RPM/BUILD/jasmine-gjs-3.10.1/noarch-alt-linux/jasmine
/usr/src/RPM/BUILD/jasmine-gjs-3.10.1/noarch-alt-linux/../test/timerSpec.js --module
--tap --no-config
--
Summary of Failures:
5/15 jasmine-gjs:timerSpec ERROR 0.07s exit status 1
Ok: 14
lore-0.8.6-alt1
test lore-server/src/hooks/traits.rs - hooks::traits (line 43) ... ok
test lore-server/src/hooks/traits.rs - hooks::traits::HookError::rejected_default
(line 294) ... ok
test lore-server/src/hooks/traits.rs - hooks::traits::Hook (line 420) ... ok
--
test lore-server/src/server_config.rs - server_config::ServerConfig (line 30) ... ok
test lore-server/src/hooks/traits.rs - hooks::traits::HookError::rejected (line 267) ... ok
test lore-server/src/hooks/context.rs - hooks::context::HookContext (line 53) ... ok
--
test result: ok. 0 passed; 0 failed; 0 ignored; 0 measured; 0 filtered out; finished
in 0.00s
error: 1 target failed:
`-p lore-revision --test clone`
mockito-errorprone-1:5.20.0-alt1
> Task :mockito-extensions:mockito-errorprone:generatePomFileForMavenJavaPublication
> Task :mockito-extensions:mockito-errorprone:compileJava FAILED
> Task :mockito-bom:generateMetadataFileForMavenJavaPublication
--
For more on this, please refer to
https://docs.gradle.org/9.7.1/userguide/command_line_interface.html#sec:command_line_warnings
in the Gradle documentation.
BUILD FAILED in 13s
10 actionable tasks: 10 executed
ollama-0.34.4-alt2
Wrote: /usr/src/in/nosrpm/ollama-0.34.4-alt2.nosrc.rpm (w1.gzdio)
error: Macro %_priority_distbranch not found
6< (empty)
--
2< /(libcudart\.so\.
error: Macro %__find_requires_filter failed to expand
warning: Macro %_priority_distbranch not found
error: Macro %_priority_distbranch not found
3< (empty)
--
0< /usr/lib/ollama/cuda_v
error: line 215: /usr/lib/ollama/cuda_v
Installing ollama-0.34.4-alt2.src.rpm
plumelib-hashmap-util-1.0.0-alt1
> Task :classes UP-TO-DATE
> Task :compileTestJava FAILED
/usr/src/.gradle/caches/xgradle/ivy/5ca71dbe1403e4bd3282da6e82db59ca/org.junit.jupiter/junit-jupiter-api/5.14.4/junit-jupiter-api-5.14.4.jar(/org/junit/jupiter/api/Assertions.class):
warning: Cannot find annotation method 'status()' in type 'API': class file for
org.apiguardian.api.API not found
--
/usr/src/.gradle/caches/xgradle/ivy/5ca71dbe1403e4bd3282da6e82db59ca/org.junit.jupiter/junit-jupiter-api/5.14.4/junit-jupiter-api-5.14.4.jar(/org/junit/jupiter/api/Assertions.class):
warning: Cannot find annotation method 'status()' in type 'API'
error: warnings found and -Werror specified
1 error
--
warning: unknown enum constant Status.STABLE
error: warnings found and -Werror specified
1 error
--
For more on this, please refer to
https://docs.gradle.org/9.7.1/userguide/command_line_interface.html#sec:command_line_warnings
in the Gradle documentation.
BUILD FAILED in 5s
2 actionable tasks: 1 executed, 1 up-to-date
postgresql17-17.11-alt1
1..225
# 70 of 225 tests failed.
# The differences that caused some tests to fail can be viewed in the file
"/usr/src/RPM/BUILD/postgresql17-17.11/src/test/regress/regression.diffs".
python3-module-crosshair-tool-0.0.110-alt1
To see why this happens see 'Known limitations' in documentation for pytest-xdist
____________________________ ERROR collecting gw27 _____________________________
Different tests were collected between gw4 and gw27. The difference is:
--
To see why this happens see 'Known limitations' in documentation for pytest-xdist
____________________________ ERROR collecting gw30 _____________________________
Different tests were collected between gw4 and gw30. The difference is:
--
To see why this happens see 'Known limitations' in documentation for pytest-xdist
____________________________ ERROR collecting gw31 _____________________________
Different tests were collected between gw4 and gw31. The difference is:
--
To see why this happens see 'Known limitations' in documentation for pytest-xdist
____________________________ ERROR collecting gw29 _____________________________
Different tests were collected between gw4 and gw29. The difference is:
--
=========================== short test summary info ============================
ERROR gw3 - Different tests were collected between gw4 and gw3. The differenc...
ERROR gw0 - Different tests were collected between gw4 and gw0. The differenc...
ERROR gw2 - Different tests were collected between gw4 and gw2. The differenc...
ERROR gw20 - Different tests were collected between gw4 and gw20. The differe...
ERROR gw1 - Different tests were collected between gw4 and gw1. The differenc...
ERROR gw17 - Different tests were collected between gw4 and gw17. The differe...
ERROR gw19 - Different tests were collected between gw4 and gw19. The differe...
python3-module-devpi-server-6.20.3-alt1
SKIPPED [4] test_devpi_server/test_streaming.py:103: No nginx executable found.
FAILED test_devpi_server/test_model.py::TestStage::test_doczip_uploaded_hook
FAILED test_devpi_server/test_replica.py::TestFileReplication::test_fetch_later_deleted
===== 2 failed, 1132 passed, 53 skipped, 26 warnings in 337.10s (0:05:37) ======
INFO : Command's result: FAILURE
INFO : Command's error: Command '['python3', '-m', 'pytest', '-ra']' returned
non-zero exit status 1.
error: Bad exit status from /usr/src/tmp/rpmb-tmp.Lv89VT (%check)
python3-module-fabio-2025.10.0-alt1
+ cd /usr/src/RPM/BUILD
+ cd python3-module-fabio-2025.10.0
+ env
PYTHONPATH=/usr/src/tmp/python3-module-fabio-buildroot/usr/lib64/python3/site-packages
python3 run_tests.py --installed
WARNING:py.warnings:/usr/lib64/python3/site-packages/h5py/__init__.py:36: UserWarning:
h5py is running against HDF5 2.2.0 when it was built against 2.1.1, this may cause problems
_warn(("h5py is running against HDF5 {0} when it was built against {1}, "
WARNING:run_tests:Test fabio 2025.10.0 from
/usr/src/tmp/python3-module-fabio-buildroot/usr/lib64/python3/site-packages/fabio
.........................................................sssssssssssssssssss...............................s........ssssssssss.........sssssssssss.....s..................sss....ssssssssssssssssssssss...sss...sssssss...ss.ssssss.sssssssssssssssssssssssssss...sssss/usr/src/tmp/rpmb-tmp.QJcmVG:
line 138: 3662263 Illegal instruction env
PYTHONPATH=/usr/src/tmp/python3-module-fabio-buildroot/usr/lib64/python3/site-packages
python3 run_tests.py --installed
error: Bad exit status from /usr/src/tmp/rpmb-tmp.QJcmVG (%check)
RPM build errors:
Bad exit status from /usr/src/tmp/rpmb-tmp.QJcmVG (%check)
python3-module-opcua-asyncio-2.0.1-alt1
INFO asyncua.client.client:client.py:543 disconnect
ERROR asyncua.client.ua_session.UaSession:ua_session.py:453 Publish iteration crashed;
retrying in 1s
Traceback (most recent call last):
--
raise ConnectionError("Connection is closed") from None
ConnectionError: Connection is closed
INFO asyncua.server.uaprocessor:uaprocessor.py:341 Read request
(User(role=<UserRole.User: 3>, name=None))
--
=========================== short test summary info ============================
FAILED
tests/test_ha_client.py::TestReconciliator::test_transport_drop_recovered_by_auto_reconnect
= 1 failed, 771 passed, 6 skipped, 3 deselected, 2487 warnings in 313.92s (0:05:13) =
python3-module-oscrypto-1.3.0-alt1.1
test_dump_certificate (tests.test_asymmetric.AsymmetricTests.test_dump_certificate) ... ok
test_dump_private (tests.test_asymmetric.AsymmetricTests.test_dump_private) ... ERROR
test_dump_private_openssl (tests.test_asymmetric.AsymmetricTests.test_dump_private_openssl)
... ok
--
test_load_order (tests.test_init.InitTests.test_load_order) ... ok
ERROR: test_dump_private (tests.test_asymmetric.AsymmetricTests.test_dump_private)
Traceback (most recent call last):
--
iterations = int(iterations / fraction / 2.0)
ZeroDivisionError: division by zero
Ran 141 tests in 0.278s
FAILED (errors=1)
error: Bad exit status from /usr/src/tmp/rpmb-tmp.oGSTnh (%check)
python3-module-rapidfuzz-3.14.6-alt1
=========================== short test summary info ============================
FAILED tests/test_hypothesis.py::test_jaro_winkler_random - AssertionError
======================== 1 failed, 420 passed in 11.81s ========================
python3-module-zict-3.0.0-alt1
File "/usr/src/RPM/BUILD/python3-module-zict-3.0.0/zict/tests/utils_test.py", line 193,
in check_different_keys_threadsafe
f1.result()
File "/usr/lib64/python3.14/concurrent/futures/_base.py", line 449, in result
self._condition.wait(timeout)
File "/usr/lib64/python3.14/threading.py", line 370, in wait
waiter.acquire()
+++++++++++++++++++++++++++++++++++ Timeout ++++++++++++++++++++++++++++++++++++
error: Bad exit status from /usr/src/tmp/rpmb-tmp.oWHyZa (%check)
RPM build errors:
Bad exit status from /usr/src/tmp/rpmb-tmp.oWHyZa (%check)
srt-1.5.7-alt1
[ RUN ] TestConnectionAPI.Listen
Listen after close error: Connection setup failure: socket closed during operation
[ OK ] TestConnectionAPI.Listen (1001 ms)
--
[ PASSED ] 271 tests.
[ FAILED ] 1 test, listed below:
[ FAILED ] SyncEvent.WaitForTwoNotifyOne
1 FAILED TEST
YOU HAVE 6 DISABLED TESTS
twitter4j-4.1.2-alt1
formats[N_MINUTES_AGO] = new MessageFormat("{0}??? ???");
/usr/src/RPM/BUILD/twitter4j-4.1.2/twitter4j-core/src/main/java/twitter4j/TimeSpanConverter.java:86:
error: unmappable character (0xEC) for encoding US-ASCII
formats[N_MINUTES_AGO] = new MessageFormat("{0}??? ???");
/usr/src/RPM/BUILD/twitter4j-4.1.2/twitter4j-core/src/main/java/twitter4j/TimeSpanConverter.java:86:
error: unmappable character (0xA0) for encoding US-ASCII
formats[N_MINUTES_AGO] = new MessageFormat("{0}??? ???");
/usr/src/RPM/BUILD/twitter4j-4.1.2/twitter4j-core/src/main/java/twitter4j/TimeSpanConverter.java:86:
error: unmappable character (0x84) for encoding US-ASCII
formats[N_MINUTES_AGO] = new MessageFormat("{0}??? ???");
/usr/src/RPM/BUILD/twitter4j-4.1.2/twitter4j-core/src/main/java/twitter4j/TimeSpanConverter.java:87:
error: unmappable character (0xEC) for encoding US-ASCII
formats[AN_HOUR_AGO] = new MessageFormat("1?????? ???");
/usr/src/RPM/BUILD/twitter4j-4.1.2/twitter4j-core/src/main/java/twitter4j/TimeSpanConverter.java:87:
error: unmappable character (0x8B) for encoding US-ASCII
formats[AN_HOUR_AGO] = new MessageFormat("1?????? ???");
/usr/src/RPM/BUILD/twitter4j-4.1.2/twitter4j-core/src/main/java/twitter4j/TimeSpanConverter.java:87:
error: unmappable character (0x9C) for encoding US-ASCII
formats[AN_HOUR_AGO] = new MessageFormat("1?????? ???");
/usr/src/RPM/BUILD/twitter4j-4.1.2/twitter4j-core/src/main/java/twitter4j/TimeSpanConverter.java:87:
error: unmappable character (0xEA) for encoding US-ASCII
formats[AN_HOUR_AGO] = new MessageFormat("1?????? ???");
/usr/src/RPM/BUILD/twitter4j-4.1.2/twitter4j-core/src/main/java/twitter4j/TimeSpanConverter.java:87:
error: unmappable character (0xB0) for encoding US-ASCII
formats[AN_HOUR_AGO] = new MessageFormat("1?????? ???");
/usr/src/RPM/BUILD/twitter4j-4.1.2/twitter4j-core/src/main/java/twitter4j/TimeSpanConverter.java:87:
error: unmappable character (0x84) for encoding US-ASCII
formats[AN_HOUR_AGO] = new MessageFormat("1?????? ???");
/usr/src/RPM/BUILD/twitter4j-4.1.2/twitter4j-core/src/main/java/twitter4j/TimeSpanConverter.java:87:
error: unmappable character (0xEC) for encoding US-ASCII
formats[AN_HOUR_AGO] = new MessageFormat("1?????? ???");
39 error logs REMOVED from the list
auditd-plugin-clickhouse-lite-0.1.9-alt3
badass-jar-plugin-2.0.0-alt1
calibre-8.16.2-alt1
dotnet-runtime-11.0-11.0.0~rc1-alt1
edk2-20260201-alt1
fonts-ttf-IosevkaCurlySlab-34.8.1-alt1
freeplane-1.13.2-alt4
freeplane-twemoji-12.1.4-alt2
gem-k8s-ruby-0.17.2-alt1
gem-mongrel-1.2.0-alt2
gem-mutex-m-0.3.0-alt1
gem-pathspec-1.1.3-alt1
gz-sim-10.5.0-alt1
hamcrest-3.0-alt1
jetbrains-annotations-24.1.0-alt2
jsqlparser-5.3-alt1
libabigail-2.8-alt1
libfprint2-1.94.100-alt1
ncdu-2.9.2-alt1
objectweb-asm-9.9-alt1
ollama-0.34.4-alt1
perl-Gearman-2.004.015-alt1_5
picocli-4.7.7-alt1
plumelib-options-2.0.3-alt2
python3-module-aioquic-1.3.0-alt1
python3-module-easyprocess-1.1-alt2
python3-module-gocept.testing-4.0-alt1.1
python3-module-paho-2.1.0-alt2
python3-module-python-lsp-server-1.15.0-alt1
python3-module-pythran-0.19.0-alt1
python3-module-textdistance-4.6.3-alt1
python3-module-vulture-2.4-alt1.1
reactive-streams-jvm-1.0.4-alt3
rumdl-0.2.77-alt1
shepherd-1.0.9-alt1
spotbugs-4.9.8-alt2
webapp-manager-1.4.6-alt1
xapian-core-1.4.31-alt1
xd-torrent-0.4.8-alt1
Total 344 error logs.
^ permalink raw reply [flat|nested] only message in thread
only message in thread, other threads:[~2026-09-26 7:42 UTC | newest]
Thread overview: (only message) (download: mbox.gz / follow: Atom feed)
-- links below jump to the message on this page --
2026-09-26 7:42 [cyber] I: Sisyphus-20260926 x86_64 beehive_status: +19 -39 (344) ALT beekeeper
ALT Linux Sisyphus cybertalk
This inbox may be cloned and mirrored by anyone:
git clone --mirror http://lore.altlinux.org/sisyphus-cybertalk/0 sisyphus-cybertalk/git/0.git
# If you have public-inbox 1.1+ installed, you may
# initialize and index your mirror using the following commands:
public-inbox-init -V2 sisyphus-cybertalk sisyphus-cybertalk/ http://lore.altlinux.org/sisyphus-cybertalk \
sisyphus-cybertalk@lists.altlinux.org sisyphus-cybertalk@lists.altlinux.ru sisyphus-cybertalk@lists.altlinux.com
public-inbox-index sisyphus-cybertalk
Example config snippet for mirrors.
Newsgroup available over NNTP:
nntp://lore.altlinux.org/org.altlinux.lists.sisyphus-cybertalk
AGPL code for this site: git clone https://public-inbox.org/public-inbox.git