* [cyber] I: Sisyphus-20260925 x86_64 beehive_status: +23 -18 (364)
@ 2026-09-25 7:33 ALT beekeeper
0 siblings, 0 replies; only message in thread
From: ALT beekeeper @ 2026-09-25 7:33 UTC (permalink / raw)
To: sisyphus-cybertalk
[-- Warning: decoded text below may be mangled, UTF-8 assumed --]
[-- Attachment #1: Type: text/plain; charset=unknown-8bit, Size: 13177 bytes --]
23 NEW error logs
auditd-plugin-clickhouse-lite-0.1.9-alt3
=========================== short test summary info ============================
FAILED ../test/dbtest/plugin_test.py::test_export - AssertionError: assert 'E...
=================== 1 failed, 13 passed in 73.13s (0:01:13) ====================
0% tests passed, 1 tests failed out of 1
Total Test time (real) = 144.90 sec
The following tests FAILED:
1 - main_test (Failed)
bpftrace-0.27.0-alt1
^[[94m[ SKIP ]^[[0m probe.kprobe_offset_module_error (unmet condition: 'lsmod | grep
'^nf_tables'')\r
^[[91m[ FAILED ]^[[0m 3 tests, listed below:\r
^[[91m[ FAILED ]^[[0m call.tseries zigzag\r
^[[91m[ FAILED ]^[[0m call.tseries_min\r
^[[91m[ FAILED ]^[[0m probe.attach_to_bpf_program\r
1094.96user 975.74system 28:08.34elapsed 122%CPU (0avgtext+0avgdata 14611416maxresident)k
casr-2.13.1-alt2
test test_safe_func32 ... ignored
test test_casr_ubsan ... FAILED
test test_casr_lua ... ok
--
thread 'test_casr_ubsan' (2785929) panicked at casr/tests/tests.rs:3961:43:
called `Result::unwrap()` on an `Err` value: Os { code: 2, kind: NotFound, message:
"No such file or directory" }
note: run with `RUST_BACKTRACE=1` environment variable to display a backtrace
--
test_casr_ubsan
test result: FAILED. 22 passed; 1 failed; 4 ignored; 0 measured; 76 filtered out;
finished in 52.66s
error: test failed, to rerun pass `-p casr --test tests`
Running unittests src/lib.rs (target/release/deps/libcasr-cd0206c960f194c9)
--
test result: ok. 0 passed; 0 failed; 0 ignored; 0 measured; 0 filtered out; finished
in 0.00s
error: 1 target failed:
`-p casr --test tests`
gz-rendering-10.0.2-alt1
126/126 Test #126: check_UNIT_WireBox_TEST_ogre2_gl3plus ................. Passed
0.01 sec
99% tests passed, 1 tests failed out of 126
Total Test time (real) = 29.41 sec
The following tests FAILED:
15 - INTEGRATION_gpu_rays_ogre2_gl3plus (SEGFAULT)
gz-sim-10.5.0-alt1
296/296 Test #296: world_TEST ...................................................
Passed 2.35 sec
99% tests passed, 2 tests failed out of 296
Total Test time (real) = 798.34 sec
The following tests FAILED:
101 - INTEGRATION_contact_system (Failed)
libabigail-2.8-alt1
reading sources... [100%] suppression-specifications
/usr/src/RPM/BUILD/libabigail-2.8/doc/manuals/abi-artifacts.rst:18: ERROR: Unexpected
indentation. [docutils]
/usr/src/RPM/BUILD/libabigail-2.8/doc/manuals/abidb.rst:168: WARNING: Title underline
too short.
--
doctree = pickle.loads(serialised)
UnicodeDecodeError: 'utf-8' codec can't decode byte 0x95 in position 357: invalid
start byte
The full traceback has been saved in:
--
reading sources... [100%] suppression-specifications
/usr/src/RPM/BUILD/libabigail-2.8/doc/manuals/abi-artifacts.rst:18: ERROR: Unexpected
indentation. [docutils]
/usr/src/RPM/BUILD/libabigail-2.8/doc/manuals/abidb.rst:168: WARNING: Title underline
too short.
libfprint2-1.94.100-alt1
raise CalledProcessError(retcode, cmd)
subprocess.CalledProcessError: Command '['umockdev-run', '-d',
'/usr/src/RPM/BUILD/libfprint2-1.94.100/tests/egis_etu905/device', '-p',
'/sys/devices/pci0000:00/0000:00:14.0/usb3/3-4=/usr/src/RPM/BUILD/libfprint2-1.94.100/tests/egis_etu905/custom.pcapng',
'--', '/usr/bin/python3',
'/usr/src/RPM/BUILD/libfprint2-1.94.100/tests/egis_etu905/custom.py']' returned non-zero
exit status 6.
127/129 drivers+custom - libfprint:mafpmoc
OK 5.24s
libgmime3.0-3.2.15-alt2
done; \
echo "Results: ${passed} tests passed; ${failed} tests failed."; \
if [ ${failed} -ne 0 ]; then \
echo -e "Failed tests: ${failed_tests}"; \
exit 255; \
--
Testing PGP/MIME implementation: passed
Results: 12 tests passed; 1 tests failed.
Failed tests:
test-streams
ollama-0.34.4-alt1
Wrote: /usr/src/in/nosrpm/ollama-0.34.4-alt1.nosrc.rpm (w1.gzdio)
error: Macro %_priority_distbranch not found
6< (empty)
--
2< /(libcudart\.so\.
error: Macro %__find_requires_filter failed to expand
warning: Macro %_priority_distbranch not found
error: Macro %_priority_distbranch not found
3< (empty)
--
0< /usr/lib/ollama/cuda_v
error: line 213: /usr/lib/ollama/cuda_v
Installing ollama-0.34.4-alt1.src.rpm
perl-Gearman-2.004.015-alt1_5
t/40-prefix.t ................... ok
# Failed test 'timeout'
# at /usr/share/perl5/Test/Timer.pm line 31.
--
# Looks like you failed 1 test of 10.
# Failed test 'wait with timeout'
# at t/50-wait_timeout.t line 65.
--
t/50-wait_timeout.t (Wstat: 256 (exited 1) Tests: 4 Failed: 1)
Failed test: 3
Non-zero exit status: 1
--
Result: FAIL
Failed 1/24 test programs. 1/337 subtests failed.
make: *** [Makefile:782: test_dynamic] Error 255
perl-Tie-DBI-1.08-alt1
Result: FAIL
Failed 1/2 test programs. 0/46 subtests failed.
make: *** [Makefile:781: test_dynamic] Error 255
podman-tui-1.11.3-alt1
^[[38;5;243m------------------------------^[[0m
^[[38;5;9m• [FAILED] [0.001 seconds]^[[0m
^[[0mprogress bar dialog ^[[38;5;9m^[[1m[It] progress value^[[0m
^[[38;5;243m/usr/src/RPM/BUILD/podman-tui-1.11.3/ui/dialogs/progress_test.go:74^[[0m
^[[38;5;9m[FAILED] Expected
<int>: 1
--
^[[38;5;9m^[[1mFAIL!^[[0m -- ^[[38;5;10m^[[1m51 Passed^[[0m | ^[[38;5;9m^[[1m1 Failed^[[0m |
^[[38;5;11m^[[1m0 Pending^[[0m | ^[[38;5;14m^[[1m1 Skipped^[[0m
--- FAIL: TestDialogs (0.01s)
FAIL
python3-module-aioquic-1.3.0-alt1
warnings.warn(f"unclosed {self!r}", ResourceWarning)
F.[8be76d312ecda26d] Error: 8, reason: original_destination_connection_id does not match,
frame_type: 6
.[71c70efdab5a95b3] Error: 8, reason: retry_source_connection_id does not match,
frame_type: 6
.....[e583affb982631d3] Error: 298, reason: unable to get local issuer certificate,
frame_type: 6
........................................[3df17399c80c7e0d] Error: 10, reason: Invalid
max_early_data value 12345, frame_type: 6
................[ea961b8c182aec9b] Error: 10, reason: Packet contains no CRYPTO frame,
frame_type: 0
.[d377dea3ed4d3dc2] Error: 365, reason: No QUIC transport parameters received,
frame_type: 6
.....................................................................................................[75fecfcfecf8cae5]
Error: 326, reason: No supported protocol version, frame_type: 6
.[c2df7a54766e6d7f] Could not find a common protocol version
.[f4ebfa1b060a6741] Version negotiation packet contains protocol version 0x00000001
(VERSION_1)
FAIL: test_connect_and_serve_with_packet_loss
(tests.test_asyncio.HighLevelTest.test_connect_and_serve_with_packet_loss)
This test ensures handshake success and stream data is successfully sent
--
self.assertEqual(response, data)
AssertionError: b'' != b'ZZZZZZZZZZZZZZZZZZZZZZZZZZZZZZZZZZZZZZZZZ[65491 chars]ZZZZ'
Ran 470 tests in 89.595s
FAILED (failures=1)
INFO : Command's result: FAILURE
python3-module-easyprocess-1.1-alt2
tests/test_fast/test_proc.py::test_wrap PASSED [ 26%]
tests/test_fast/test_proc.py::test_with FAILED [ 28%]
tests/test_fast/test_proc.py::test_parse PASSED [ 31%]
--
=========================== short test summary info ============================
FAILED tests/test_fast/test_proc.py::test_with - assert False
=================== 1 failed, 37 passed in 76.46s (0:01:16) ====================
python3-module-paho-2.1.0-alt2
==================================== ERRORS ====================================
____________________ ERROR at teardown of test_01_unpwd_set ____________________
def fin():
--
> raise RuntimeError(f"Client {name} exited with code {proc.returncode},
expected {expected_returncode}")
E RuntimeError: Client 01-unpwd-set.py exited with code -2, expected 0
tests/lib/conftest.py:75: RuntimeError
--
=========================== short test summary info ============================
ERROR tests/lib/test_01_unpwd_set.py::test_01_unpwd_set - RuntimeError: Clien...
============= 136 passed, 26 skipped, 1 xfailed, 1 error in 36.58s =============
INFO : Command's result: FAILURE
INFO : Command's error: Command '['python3', '-m', 'pytest', '-o', 'addopts=',
'tests']' returned non-zero exit status 1.
error: Bad exit status from /usr/src/tmp/rpmb-tmp.bUDZjz (%check)
python3-module-python-lsp-server-1.15.0-alt1
stream.write(msg + self.terminator)
ValueError: I/O operation on closed file.
Call stack:
--
stream.write(msg + self.terminator)
ValueError: I/O operation on closed file.
Call stack:
--
stream.write(msg + self.terminator)
ValueError: I/O operation on closed file.
Call stack:
--
stream.write(msg + self.terminator)
ValueError: I/O operation on closed file.
Call stack:
--
stream.write(msg + self.terminator)
ValueError: I/O operation on closed file.
Call stack:
--
INFO : Command's result: FAILURE
INFO : Command's error: Command '['python3', '-m',
'pytest', '-ra', '-o=addopts=-Wignore', 'test', '--deselect',
'test/plugins/test_completion.py::test_jedi_completion_environment', '--deselect',
'test/plugins/test_symbols.py::test_symbols_all_scopes_with_jedi_environment']' returned
non-zero exit status 1.
error: Bad exit status from /usr/src/tmp/rpmb-tmp.zRh1w1 (%check)
python3-module-pythran-0.19.0-alt1
INFO : Running command: ['python3', '-m', 'pytest', '-n', 'auto', '--dist',
'worksteal', '-v', '-ra', '--tb=short', '-k', 'not test_setup_build and not
test_setup_build2 and not benchmark']
hasher-privd: parent: handle_io: idle time limit (3600 seconds) exceeded
qt5-pim-5.15-alt1
make[3]: Leaving directory '/usr/src/RPM/BUILD/qt5-pim-5.15/build/tests/auto/contacts'
make[2]: *** [Makefile:581: sub-contacts-check] Error 2
make[2]: Leaving directory '/usr/src/RPM/BUILD/qt5-pim-5.15/build/tests/auto'
make[1]: *** [Makefile:369: sub-auto-check] Error 2
make[1]: Leaving directory '/usr/src/RPM/BUILD/qt5-pim-5.15/build/tests'
make: *** [Makefile:438: sub-tests-check] Error 2
make: Leaving directory '/usr/src/RPM/BUILD/qt5-pim-5.15/build'
error: Bad exit status from /usr/src/tmp/rpmb-tmp.l8tlLL (%check)
RPM build errors:
Bad exit status from /usr/src/tmp/rpmb-tmp.l8tlLL (%check)
shepherd-1.0.9-alt1
make[4]: Entering directory '/usr/src/RPM/BUILD/shepherd-1.0.9'
FAIL: tests/daemonize.sh
make[4]: Leaving directory '/usr/src/RPM/BUILD/shepherd-1.0.9'
--
# SKIP: 1
# XFAIL: 0
# FAIL: 1
# XPASS: 0
# ERROR: 0
See ./test-suite.log
stockfish-18-alt1
+ umask 022
+ /bin/mkdir -p /usr/src/RPM/BUILD
+ cd /usr/src/RPM/BUILD
+ cd stockfish-18
+ ./src/stockfish bench
Stockfish 18 by the Stockfish developers (see AUTHORS file)
/usr/src/tmp/rpmb-tmp.dwEEpA: line 137: 549152 Segmentation fault ./src/stockfish
bench
error: Bad exit status from /usr/src/tmp/rpmb-tmp.dwEEpA (%check)
RPM build errors:
Bad exit status from /usr/src/tmp/rpmb-tmp.dwEEpA (%check)
webapp-manager-1.4.6-alt1
file /usr/share/applications/defaults.list conflicts between attempted installs of
altlinux-menus-0.6.0-alt1.noarch and altlinux-mime-defaults-0.444.1-alt1.noarch
hsh-install: Packages installation failed.
xapian-core-1.4.31-alt1
Running test: nomoredocids1... ok
Running test: termtoolong1... XFAIL (Chert fails to clear pending changes after
InvalidArgumentError - fix too invasive): InvalidArgumentError: REMOTE:Key too long: length
was 254 bytes, maximum length of a key is 252 bytes (context: remote:tcp(127.0.0.1:1239))
Term length 245
--
./apitest total: 4255 tests passed, 1 failed, 13 expected failures, 50 skipped.
FAIL: apitest
Running test: exception1... ok
--
PASS: unittest
1 of 4 tests failed
Please report to https://xapian.org/bugs
xd-torrent-0.4.8-alt1
cp: cannot create regular file
'/usr/src/RPM/BUILD/xd-torrent-0.4.8/lib/rpc/assets/xd.min.js': File exists
make: *** [Makefile:79: contrib/webui/docroot/xd.min.js] Error 1
make: Leaving directory '/usr/src/RPM/BUILD/xd-torrent-0.4.8'
make: *** Waiting for unfinished jobs....
make: Entering directory '/usr/src/RPM/BUILD/xd-torrent-0.4.8'
cp ./contrib/webui/docroot/index.html ./contrib/webui/docroot/xd.min.js
./contrib/webui/docroot/xd.css ./contrib/webui/docroot/favicon.png
/usr/src/RPM/BUILD/xd-torrent-0.4.8/lib/rpc/assets/
make: Leaving directory '/usr/src/RPM/BUILD/xd-torrent-0.4.8'
error: Bad exit status from /usr/src/tmp/rpmb-tmp.PRNBdT (%build)
RPM build errors:
Bad exit status from /usr/src/tmp/rpmb-tmp.PRNBdT (%build)
18 error logs REMOVED from the list
felix-gogo-runtime-1.1.6-alt1
fonts-ttf-IosevkaCurly-34.8.1-alt1
gem-ffi-1.17.0-alt2
gem-friendly-id-5.5.1-alt1
gem-hammer-cli-3.18.0-alt1
gem-hammer-cli-foreman-3.18.1-alt1
gz-gui-10.0.0-alt3
libboca-1.0.7-alt3.git5d0de9f4
libgupnp-igd-1.6.0-alt1
linux-pam-1.7.2-alt1
lore-0.8.6-alt1
mauikit-calendar-4.0.2-alt1
perl-Net-SIP-0.840-alt1
python3-module-fabio-2025.10.0-alt1
python3-module-rapidfuzz-3.14.6-alt1
python3-module-telnetlib3-3.0.1-alt1
rng-tools-6.17-alt1.1
unixODBC-2.3.14-alt1
Total 364 error logs.
^ permalink raw reply [flat|nested] only message in thread
only message in thread, other threads:[~2026-09-25 7:33 UTC | newest]
Thread overview: (only message) (download: mbox.gz / follow: Atom feed)
-- links below jump to the message on this page --
2026-09-25 7:33 [cyber] I: Sisyphus-20260925 x86_64 beehive_status: +23 -18 (364) ALT beekeeper
ALT Linux Sisyphus cybertalk
This inbox may be cloned and mirrored by anyone:
git clone --mirror http://lore.altlinux.org/sisyphus-cybertalk/0 sisyphus-cybertalk/git/0.git
# If you have public-inbox 1.1+ installed, you may
# initialize and index your mirror using the following commands:
public-inbox-init -V2 sisyphus-cybertalk sisyphus-cybertalk/ http://lore.altlinux.org/sisyphus-cybertalk \
sisyphus-cybertalk@lists.altlinux.org sisyphus-cybertalk@lists.altlinux.ru sisyphus-cybertalk@lists.altlinux.com
public-inbox-index sisyphus-cybertalk
Example config snippet for mirrors.
Newsgroup available over NNTP:
nntp://lore.altlinux.org/org.altlinux.lists.sisyphus-cybertalk
AGPL code for this site: git clone https://public-inbox.org/public-inbox.git