* [cyber] I: Sisyphus-20260924 x86_64 beehive_status: +14 -32 (359)
@ 2026-09-24 5:52 ALT beekeeper
0 siblings, 0 replies; only message in thread
From: ALT beekeeper @ 2026-09-24 5:52 UTC (permalink / raw)
To: sisyphus-cybertalk
14 NEW error logs
calligra-26.04.3-alt1
/usr/bin/c++ -fPIC -DKDE_NO_DEBUG_OUTPUT -fno-operator-names -fno-exceptions -Wall -Wextra
-Wcast-align -Wchar-subscripts -Wformat-security -Wno-long-long -Wpointer-arith -Wundef
-Wnon-virtual-dtor -Woverloaded-virtual -Werror=return-type -Werror=init-self -Wvla
-Wdate-time -Wsuggest-override -Wlogical-op -O2 -DNDEBUG -shared -Wl,--no-undefined
-Wl,--fatal-warnings -Wl,--enable-new-dtags -L/usr/lib64 -L/usr/lib64/kf6/devel
-Wl,-soname,libcalligrastageprivate.so.41 -o ../../bin/libcalligrastageprivate.so.26.04.3
CMakeFiles/calligrastageprivate.dir/calligrastageprivate_autogen/mocs_compilation.cpp.o
CMakeFiles/calligrastageprivate.dir/StageDebug.cpp.o
CMakeFiles/calligrastageprivate.dir/KPrFactory.cpp.o
CMakeFiles/calligrastageprivate.dir/KPrDocument.cpp.o
CMakeFiles/calligrastageprivate.dir/KPrDeclarations.cpp.o
CMakeFiles/calligrastageprivate.dir/KPrPart.cpp.o
CMakeFiles/calligrastageprivate.dir/KPrView.cpp.o
CMakeFiles/calligrastageprivate.dir/KPrViewModePresentation.cpp.o
CMakeFiles/calligrastageprivate.dir/KPrViewModeNotes.cpp.o
CMakeFiles/calligrastageprivate.dir/KPrViewModeSlidesSorter.cpp.o
CMakeFiles/calligrastageprivate.dir/KPrViewModePreviewPageEffect.cpp.o
CMakeFiles/calligrastageprivate.dir/KPrViewModePreviewShapeAnimations.cpp.o
CMakeFiles/calligrastageprivate.dir/KPrPresentationTool.cpp.o
CMakeFiles/calligrastageprivate.dir/KPrAnimationDirector.cpp.o
CMakeFiles/calligrastageprivate.dir/KPrShapeAnimations.cpp.o
CMakeFiles/calligrastageprivate.dir/KPrShapeManagerAnimationStrategy.cpp.o
CMakeFiles/calligrastageprivate.dir/KPrShapeManagerDisplayMasterStrategy.cpp.o
CMakeFiles/calligrastageprivate.dir/KPrPageData.cpp.o
CMakeFiles/calligrastageprivate.dir/KPrPage.cpp.o
CMakeFiles/calligrastageprivate.dir/KPrMasterPage.cpp.o
CMakeFiles/calligrastageprivate.dir/KPrNotes.cpp.o
CMakeFiles/calligrastageprivate.dir/KPrSoundData.cpp.o
CMakeFiles/calligrastageprivate.dir/KPrSoundCollection.cpp.o
CMakeFiles/calligrastageprivate.dir/KPrEventActionData.cpp.o
CMakeFiles/calligrastageprivate.dir/KPrEventActionWidget.cpp.o
CMakeFiles/calligrastageprivate.dir/KPrPageApplicationData.cpp.o
CMakeFiles/calligrastageprivate.dir/KPrShapeApplicationData.cpp.o
CMakeFiles/calligrastageprivate.dir/KPrCustomSlideShows.cpp.o
CMakeFiles/calligrastageprivate.dir/KPrPresenterViewBaseInterface.cpp.o
CMakeFiles/calligrastageprivate.dir/KPrPresenterViewInterface.cpp.o
CMakeFiles/calligrastageprivate.dir/KPrPresenterViewSlidesInterface.cpp.o
CMakeFiles/calligrastageprivate.dir/KPrPresenterViewToolWidget.cpp.o
CMakeFiles/calligrastageprivate.dir/KPrPresenterViewWidget.cpp.o
CMakeFiles/calligrastageprivate.dir/KPrEndOfSlideShowPage.cpp.o
CMakeFiles/calligrastageprivate.dir/KPrPlaceholderShape.cpp.o
CMakeFiles/calligrastageprivate.dir/KPrPlaceholderShapeFactory.cpp.o
CMakeFiles/calligrastageprivate.dir/KPrPlaceholderStrategy.cpp.o
CMakeFiles/calligrastageprivate.dir/KPrPlaceholderPictureStrategy.cpp.o
CMakeFiles/calligrastageprivate.dir/KPrPlaceholderTextStrategy.cpp.o
CMakeFiles/calligrastageprivate.dir/KPrPresentationHighlightWidget.cpp.o
CMakeFiles/calligrastageprivate.dir/KPrPresentationDrawWidget.cpp.o
CMakeFiles/calligrastageprivate.dir/KPrPresentationBlackWidget.cpp.o
CMakeFiles/calligrastageprivate.dir/KPrPresentationStrategy.cpp.o
CMakeFiles/calligrastageprivate.dir/KPrPresentationHighlightStrategy.cpp.o
CMakeFiles/calligrastageprivate.dir/KPrPresentationBlackStrategy.cpp.o
CMakeFiles/calligrastageprivate.dir/KPrPresentationStrategyBase.cpp.o
CMakeFiles/calligrastageprivate.dir/KPrPresentationToolEventForwarder.cpp.o
CMakeFiles/calligrastageprivate.dir/KPrPresentationDrawStrategy.cpp.o
CMakeFiles/calligrastageprivate.dir/KPrPageSelectStrategyBase.cpp.o
CMakeFiles/calligrastageprivate.dir/KPrPageSelectStrategyFixed.cpp.o
CMakeFiles/calligrastageprivate.dir/KPrPageSelectStrategyActive.cpp.o
CMakeFiles/calligrastageprivate.dir/KPrDurationParser.cpp.o
CMakeFiles/calligrastageprivate.dir/KPrHtmlExport.cpp.o
CMakeFiles/calligrastageprivate.dir/KPrPicturesImport.cpp.o
CMakeFiles/calligrastageprivate.dir/KPrPdfPrintJob.cpp.o CMakeFiles/calligrastage
cd /usr/src/RPM/BUILD/calligra-26.04.3/BUILD/stage/part && /usr/bin/cmake
-E cmake_symlink_library ../../bin/libcalligrastageprivate.so.26.04.3
../../bin/libcalligrastageprivate.so.41 ../../bin/libcalligrastageprivate.so
make[2]: Leaving directory '/usr/src/RPM/BUILD/calligra-26.04.3/BUILD'
make[1]: Entering directory '/usr/src/RPM/BUILD/calligra-26.04.3/BUILD'
[ 85%] Built target calligrastageprivate
make[1]: Leaving directory '/usr/src/RPM/BUILD/calligra-26.04.3/BUILD'
make: *** [Makefile:139: all] Error 2
error: Bad exit status from /usr/src/tmp/rpmb-tmp.ueATKo (%build)
RPM build errors:
Bad exit status from /usr/src/tmp/rpmb-tmp.ueATKo (%build)
gz-gui-10.0.0-alt3
54/54 Test #54: check_INTEGRATION_transport_scene_manager ... Passed 0.01 sec
96% tests passed, 2 tests failed out of 54
Total Test time (real) = 126.03 sec
The following tests FAILED:
21 - UNIT_ImageDisplay_TEST (Subprocess aborted)
libboca-1.0.7-alt3.git5d0de9f4
g++ --shared -o ../../../bin/boca_decoder_cdio.1.0.so
cdio.o config.o info/cdinfo.o info/cdtext.o -L../../../lib64
-L"/usr/src/RPM/BUILD/libboca-1.0.7/components/decoder/cdio"/../../../lib64 -lcdio
-lcdio_cdda -lcdio_paranoia -L/usr/lib64 -lsmooth-0.9 -lboca-1.0
make[3]: Leaving directory '/usr/src/RPM/BUILD/libboca-1.0.7/components/decoder/cdio'
make[3]: Entering directory '/usr/src/RPM/BUILD/libboca-1.0.7/components/tagger/id3v2'
mkdir -p ../../../bin
g++ --shared -o ../../../bin/boca_tagger_id3v2.1.0.so id3v2.o -L../../../lib64
-L"/usr/src/RPM/BUILD/libboca-1.0.7/components/tagger/id3v2"/../../../lib64 id3/libid3.a
-lz -L/usr/lib64 -lsmooth-0.9 -lboca-1.0
make[3]: Leaving directory '/usr/src/RPM/BUILD/libboca-1.0.7/components/tagger/id3v2'
make: *** [Makefile:10: all] Error 2
error: Bad exit status from /usr/src/tmp/rpmb-tmp.M5fXa3 (%build)
RPM build errors:
Bad exit status from /usr/src/tmp/rpmb-tmp.M5fXa3 (%build)
libgupnp-igd-1.6.0-alt1
Bail out!
1/1 gupnp-igd:gupnp-simple-igd FAIL 7.50s killed by signal 6 SIGABRT
Summary of Failures:
1/1 gupnp-igd:gupnp-simple-igd FAIL 7.50s killed by signal 6 SIGABRT
Ok: 0
Fail: 1
Full log written to
/usr/src/RPM/BUILD/gupnp-igd-1.6.0/x86_64-alt-linux/meson-logs/testlog.txt
error: Bad exit status from /usr/src/tmp/rpmb-tmp.uGG038 (%check)
RPM build errors:
Bad exit status from /usr/src/tmp/rpmb-tmp.uGG038 (%check)
lore-0.8.6-alt1
test lore-server/src/hooks/traits.rs - hooks::traits::StatusCode (line 157) ... ok
test lore-server/src/hooks/traits.rs - hooks::traits::HookError::rejected_default
(line 294) ... ok
test lore-server/src/plugins/mod.rs - plugins::register_all_plugins (line 116) ... ok
--
test lore-server/src/hooks/traits.rs - hooks::traits (line 43) ... ok
test lore-server/src/hooks/traits.rs - hooks::traits::HookError::rejected (line 267) ... ok
test lore-server/src/telemetry/resource_provider.rs -
telemetry::resource_provider::ResourceDetectorProvider (line 22) ... ok
--
test result: ok. 0 passed; 0 failed; 0 ignored; 0 measured; 0 filtered out; finished
in 0.00s
error: 1 target failed:
`-p lore-revision --test clone`
mauikit-calendar-4.0.2-alt1
"KF6Mime" provides a separate development package or SDK, be sure it has
been installed.
Call Stack (most recent call first):
/usr/share/cmake/Modules/CMakeFindDependencyMacro.cmake:125 (__find_dependency_common)
/usr/lib64/cmake/KPim6AkonadiMime/KPim6AkonadiMimeConfig.cmake:42 (find_dependency)
CMakeLists.txt:72 (find_package)
-- Configuring incomplete, errors occurred!
error: Bad exit status from /usr/src/tmp/rpmb-tmp.zzjkHl (%build)
RPM build errors:
Bad exit status from /usr/src/tmp/rpmb-tmp.zzjkHl (%build)
perl-Net-SIP-0.840-alt1
# received=178 lost=0 expect ca. 467.5 packets, events='1 2 D # 3 4 B *'
# Failed test 'UAS RTP ok'
# at t/19_call_with_dtmf.t line 151.
--
t/19_call_with_dtmf.t (Wstat: 256 (exited 1) Tests: 216 Failed: 1)
Failed test: 97
Non-zero exit status: 1
--
Result: FAIL
Failed 1/26 test programs. 1/2000 subtests failed.
make: *** [Makefile:829: test_dynamic] Error 255
python3-module-chess-1.11.2-alt1
return await command.result
chess.engine.EngineTerminatedError: engine process died unexpectedly (exit code: -11)
ERROR: test_sf_multipv (__main__.EngineTestCase.test_sf_multipv)
Traceback (most recent call last):
--
return await command.result
chess.engine.EngineTerminatedError: engine process died unexpectedly (exit code: -11)
ERROR: test_sf_options (__main__.EngineTestCase.test_sf_options)
Traceback (most recent call last):
--
return await command.result
chess.engine.EngineTerminatedError: engine process died unexpectedly (exit code: -11)
ERROR: test_sf_quit (__main__.EngineTestCase.test_sf_quit)
Traceback (most recent call last):
--
return await command.result
chess.engine.EngineTerminatedError: engine process died unexpectedly (exit code: -11)
Ran 288 tests in 0.907s
FAILED (errors=4, skipped=17)
py3: exit 1 (1.06 seconds) /usr/src/RPM/BUILD/python3-module-chess-1.11.2> python
test.py --verbose pid=2966839
python3-module-fabio-2025.10.0-alt1
+ cd /usr/src/RPM/BUILD
+ cd python3-module-fabio-2025.10.0
+ env
PYTHONPATH=/usr/src/tmp/python3-module-fabio-buildroot/usr/lib64/python3/site-packages
python3 run_tests.py --installed
WARNING:py.warnings:/usr/lib64/python3/site-packages/h5py/__init__.py:36: UserWarning:
h5py is running against HDF5 2.2.0 when it was built against 2.1.1, this may cause problems
_warn(("h5py is running against HDF5 {0} when it was built against {1}, "
WARNING:run_tests:Test fabio 2025.10.0 from
/usr/src/tmp/python3-module-fabio-buildroot/usr/lib64/python3/site-packages/fabio
.........................................................sssssssssssssssssss...............................s........ssssssssss.........sssssssssss.....s..................sss....ssssssssssssssssssssss...sss...sssssss...ss.ssssss.sssssssssssssssssssssssssss...sssss/usr/src/tmp/rpmb-tmp.5ag8jZ:
line 138: 3743855 Illegal instruction env
PYTHONPATH=/usr/src/tmp/python3-module-fabio-buildroot/usr/lib64/python3/site-packages
python3 run_tests.py --installed
error: Bad exit status from /usr/src/tmp/rpmb-tmp.5ag8jZ (%check)
RPM build errors:
Bad exit status from /usr/src/tmp/rpmb-tmp.5ag8jZ (%check)
python3-module-rapidfuzz-3.14.6-alt1
=========================== short test summary info ============================
FAILED tests/test_hypothesis.py::test_jaro_winkler_word - AssertionError
======================== 1 failed, 420 passed in 19.64s ========================
python3-module-textdistance-4.6.3-alt1
XFAIL tests/test_external.py::test_list_of_numbers[Levenshtein] - module not installed:
distance.levenshtein
FAILED tests/test_compression/test_common.py::test_is_normalized[alg0] - Dead...
============ 1 failed, 417 passed, 12 xfailed in 117.83s (0:01:57) =============
INFO : Command's result: FAILURE
INFO : Command's error: Command '['python3', '-m', 'pytest', '-vra']' returned
non-zero exit status 1.
error: Bad exit status from /usr/src/tmp/rpmb-tmp.Quxhbh (%check)
rng-tools-6.17-alt1.1
PASS: rngtestzero.sh
FAIL: rngtestjitter.sh
Testsuite summary for rng-tools 6.17
--
# SKIP: 1
# XFAIL: 0
# FAIL: 1
# XPASS: 0
# ERROR: 0
See tests/test-suite.log
rumdl-0.2.77-alt1
perf::perf_check::test_optimized_rules_performance
test result: FAILED. 6225 passed; 1 failed; 4 ignored; 0 measured; 0 filtered out;
finished in 38.02s
error: test failed, to rerun pass `--test lib`
Doc-tests rumdl_lib
--
all doctests ran in 17.37s; merged doctests compilation took 17.29s
error: 1 target failed:
`--test lib`
wlmaker-0.8.1-alt1
workspace OK: 11/ 11
FAILED: 1/ 29
primitives.minimize_large
12/12 Test #12: wlmaker_test ..................... Passed 0.02 sec
92% tests passed, 1 tests failed out of 12
Total Test time (real) = 0.02 sec
The following tests FAILED:
11 - toolkit_test (Failed)
32 error logs REMOVED from the list
auditd-plugin-clickhouse-lite-0.1.9-alt3
bpftrace-0.27.0-alt1
dvdauthor-0.7.2-alt5.1
gem-acts-as-list-1.2.6-alt1
gem-amazing-print-2.0.0-alt1
gem-autotest-suffix-1.1.0-alt1
gem-benchmark-suite-1.0.0.4-alt0.1
gem-cuprite-0.17-alt1
gem-dbi-dbrc-1.7.0.24-alt0.1
gem-fission-0.5.0-alt2.1
gem-importmap-rails-2.1.0-alt1
gem-indexer-0.3.0-alt1
gem-license-finder-7.2.1-alt1.1
gem-memoist3-1.0.0-alt1
gem-turbo-rails-2.0.5-alt1
hysteria-2.12.3-alt1
icingaweb2-2.12.5-alt3
jasmine-gjs-3.10.1-alt1
libfprint2-1.94.100-alt1
perl-Starlet-0.31-alt1_22
python3-module-cross-web-0.7.0-alt1
python3-module-crosshair-tool-0.0.110-alt1
python3-module-graphene-django-3.2.3-alt2
python3-module-opcua-asyncio-2.0.1-alt1
python3-module-pythran-0.19.0-alt1
python3-module-qtconsole-5.7.2-alt1.1
python3-module-swiftclient-4.8.0-alt1
python3-module-zict-3.0.0-alt1
shepherd-1.0.9-alt1
stevia-0.56.0-alt1
stockfish-18-alt1
uutils-coreutils-0.9.0-alt1
Total 359 error logs.
^ permalink raw reply [flat|nested] only message in thread
only message in thread, other threads:[~2026-09-24 5:52 UTC | newest]
Thread overview: (only message) (download: mbox.gz / follow: Atom feed)
-- links below jump to the message on this page --
2026-09-24 5:52 [cyber] I: Sisyphus-20260924 x86_64 beehive_status: +14 -32 (359) ALT beekeeper
ALT Linux Sisyphus cybertalk
This inbox may be cloned and mirrored by anyone:
git clone --mirror http://lore.altlinux.org/sisyphus-cybertalk/0 sisyphus-cybertalk/git/0.git
# If you have public-inbox 1.1+ installed, you may
# initialize and index your mirror using the following commands:
public-inbox-init -V2 sisyphus-cybertalk sisyphus-cybertalk/ http://lore.altlinux.org/sisyphus-cybertalk \
sisyphus-cybertalk@lists.altlinux.org sisyphus-cybertalk@lists.altlinux.ru sisyphus-cybertalk@lists.altlinux.com
public-inbox-index sisyphus-cybertalk
Example config snippet for mirrors.
Newsgroup available over NNTP:
nntp://lore.altlinux.org/org.altlinux.lists.sisyphus-cybertalk
AGPL code for this site: git clone https://public-inbox.org/public-inbox.git