* [cyber] I: Sisyphus-20260923 x86_64 beehive_status: +17 -23 (377)
@ 2026-09-23 7:57 ALT beekeeper
0 siblings, 0 replies; only message in thread
From: ALT beekeeper @ 2026-09-23 7:57 UTC (permalink / raw)
To: sisyphus-cybertalk
17 NEW error logs
edk2-20260201-alt1
68 | ParserBlackBox<CVfrDLGLexer, EfiVfrParser, ANTLRToken> VfrParser(File);
Pccts/h/PBlackBox.h:88:14: error: no matching function for call to
'ANTLRTokenBuffer::ANTLRTokenBuffer(CVfrDLGLexer*&)'
88 | pipe = new ANTLRTokenBuffer(scan);
--
Pccts/h/ATokenBuffer.h:55:22: note: no known conversion for argument 1 from 'CVfrDLGLexer*'
to 'const ANTLRTokenBuffer&'
Pccts/h/PBlackBox.h:90:13: error: 'class CVfrDLGLexer' has no member named 'setToken'
90 | scan->setToken(tok);
hysteria-2.12.3-alt1
ok github.com/apernet/hysteria/core/v2/internal/frag 0.004s
--- FAIL: TestClientServerTrafficLoggerTCP (1.01s)
mock_TrafficLogger.go:181: FAIL: UntraceStream(string)
at:
[/usr/src/RPM/BUILD/hysteria-2.12.3/core/internal/integration_tests/mocks/mock_TrafficLogger.go:152
/usr/src/RPM/BUILD/hysteria-2.12.3/core/internal/integration_tests/trafficlogger_test.go:88]
mock_TrafficLogger.go:181: FAIL: 6 out of 7 expectation(s) were met.
The code you are testing needs to make 1 more call(s).
jasmine-gjs-3.10.1-alt1
8/15 jasmine-gjs:importerSpec OK 0.08s 2 subtests passed
3/15 jasmine-gjs:timerSpec ERROR 0.07s exit status 1
>>> MALLOC_PERTURB_=123
ASAN_OPTIONS=halt_on_error=1:abort_on_error=1:print_summary=1 MESON_TEST_ITERATION=1
MSAN_OPTIONS=halt_on_error=1:abort_on_error=1:print_summary=1:print_stacktrace=1
TEST_JASMINE_MOD=lib TEST_PKGDATADIR=/usr/src/RPM/BUILD/jasmine-gjs-3.10.1/src
TEST_PKGLIBEXECDIR=/usr/src/RPM/BUILD/jasmine-gjs-3.10.1/noarch-alt-linux
UBSAN_OPTIONS=halt_on_error=1:abort_on_error=1:print_summary=1:print_stacktrace=1
/usr/bin/gjs -m /usr/src/RPM/BUILD/jasmine-gjs-3.10.1/noarch-alt-linux/jasmine
/usr/src/RPM/BUILD/jasmine-gjs-3.10.1/noarch-alt-linux/../test/timerSpec.js --module
--tap --no-config
--
Summary of Failures:
3/15 jasmine-gjs:timerSpec ERROR 0.07s exit status 1
Ok: 14
kernel-modules-aic8800-6.12-0.0.95.bef3-alt1.396399.1
kernel-headers-modules-6.12 is already the newest version.
E: Version ='0.0.95.bef3' for 'kernel-source-aic8800' was not found
hsh-install: Failed to calculate package file list.
kernel-modules-aic8800-6.18-0.0.95.bef3-alt1.397877.1
kernel-headers-modules-6.18 is already the newest version.
E: Version ='0.0.95.bef3' for 'kernel-source-aic8800' was not found
hsh-install: Failed to calculate package file list.
libfprint2-1.94.100-alt1
(process:2601171): libfprint-device-DEBUG: 03:10:25.563: Device reported finger status
change: FP_FINGER_STATUS_NEEDED -> FP_FINGER_STATUS_PRESENT
(process:2601171): libfprint-SSM-DEBUG: 03:10:25.563: [egis_etu905] SSM IDENTIFY_STATES
failed in state 4 with error: Operation was cancelled
(process:2601171): libfprint-SSM-DEBUG: 03:10:25.563: [egis_etu905] IDENTIFY_STATES
completed with error: Operation was cancelled
(process:2601171): libfprint-egis_etu905-DEBUG: 03:10:25.563: Task SSM done
--
(process:2601171): libfprint-SSM-DEBUG: 03:10:25.563: [egis_etu905] CMD_STATES entering
state 0
(process:2601171): libfprint-SSM-DEBUG: 03:10:30.563: [egis_etu905] SSM CMD_STATES
failed in state 0 with error: transfer timed out
(process:2601171): libfprint-SSM-DEBUG: 03:10:30.563: [egis_etu905] CMD_STATES completed
with error: transfer timed out
(process:2601171): libfprint-SSM-DEBUG: 03:10:30.564: [egis_etu905] SSM CANCEL_STATES
failed in state 0 with error: transfer timed out
(process:2601171): libfprint-SSM-DEBUG: 03:10:30.564: [egis_etu905] CANCEL_STATES
completed with error: transfer timed out
** (umockdev-run:2601024): DEBUG: 03:10:30.567: umockdev.vala:154: Removing test bed
/usr/src/tmp/umockdev.I5Z5V3
--
stderr:
ERROR: uevent_sender_send: Failed
udev_device_new_from_syspath(/sys/devices/pci0000:00/0000:00:14.0/usb3/3-4): No such device
ERROR: uevent_sender_send: Failed
udev_device_new_from_syspath(/sys/devices/pci0000:00/0000:00:14.0/usb3/3-4) after retry:
No such device
ERROR: uevent_sender_send: Failed
udev_device_new_from_syspath(/sys/devices/pci0000:00/0000:00:14.0/usb3): No such device
ERROR: uevent_sender_send: Failed
udev_device_new_from_syspath(/sys/devices/pci0000:00/0000:00:14.0/usb3) after retry:
No such device
ERROR: uevent_sender_send: Failed
udev_device_new_from_syspath(/sys/devices/pci0000:00/0000:00:14.0): No such device
perl-Starlet-0.31-alt1_22
t/11multi-sockets.t ........ ok
# Failed test 'No warnings'
# at t/12bad_request_line.t line 24.
--
t/12bad_request_line.t (Wstat: 256 (exited 1) Tests: 2 Failed: 1)
Failed test: 2
Non-zero exit status: 1
--
Result: FAIL
Failed 1/15 test programs. 1/146 subtests failed.
make: *** [Makefile:753: test_dynamic] Error 255
python3-module-graphene-django-3.2.3-alt2
> assert not result.errors
E AssertionError: assert not [GraphQLError('Type Reporter must define one or
more fields.')]
E + where [GraphQLError('Type Reporter must define one or more fields.')] =
ExecutionResult(data=None, errors=[GraphQLError('Type Reporter must define one or more
fields.')]).errors
--
> assert result.errors is None
E AssertionError: assert [GraphQLError('Type Reporter must define one or more
fields.')] is None
E + where [GraphQLError('Type Reporter must define one or more fields.')] =
ExecutionResult(data=None, errors=[GraphQLError('Type Reporter must define one or more
fields.')]).errors
--
=========================== short test summary info ============================
FAILED graphene_django/filter/tests/test_fields.py::test_filter_shortcut_filterset_context
FAILED
graphene_django/forms/tests/test_djangoinputobject.py::test_mutation_with_modelform_djangoforminputtype
================= 2 failed, 401 passed, 2 deselected in 2.65s ==================
INFO : Command's result: FAILURE
INFO : Command's error: Command '['python3', '-m', 'pytest', '-k', 'not
test_global_id_field_explicit and not test_global_id_field_implicit']' returned non-zero
exit status 1.
error: Bad exit status from /usr/src/tmp/rpmb-tmp.ZkB1rz (%check)
python3-module-opcua-asyncio-2.0.1-alt1
INFO asyncua.client.client:client.py:543 disconnect
ERROR asyncua.client.ua_session.UaSession:ua_session.py:453 Publish iteration crashed;
retrying in 1s
Traceback (most recent call last):
--
raise ConnectionError("Connection is closed") from None
ConnectionError: Connection is closed
INFO asyncua.server.uaprocessor:uaprocessor.py:341 Read request
(User(role=<UserRole.User: 3>, name=None))
--
=========================== short test summary info ============================
FAILED
tests/test_ha_client.py::TestReconciliator::test_transport_drop_recovered_by_auto_reconnect
= 1 failed, 771 passed, 6 skipped, 3 deselected, 2487 warnings in 314.24s (0:05:14) =
python3-module-pythran-0.19.0-alt1
INFO : Running command: ['python3', '-m', 'pytest', '-n', 'auto', '--dist',
'worksteal', '-v', '-ra', '--tb=short', '-k', 'not test_setup_build and not
test_setup_build2 and not benchmark']
hasher-privd: parent: handle_io: idle time limit (3600 seconds) exceeded
python3-module-qtconsole-5.7.2-alt1.1
INFO : Running command: ['xvfb-run', '-s', '-nolisten local', 'pytest', '-v',
'qtconsole', '--ignore', 'qtconsole/tests/test_inprocess_kernel.py']
_XSERVTransmkdir: ERROR: euid != 0,directory /tmp/.X11-unix will not be created.
============================= test session starts ==============================
--
qtconsole/tests/test_00_console_widget.py::test_input PASSED [ 6%]
qtconsole/tests/test_00_console_widget.py::test_debug FAILED [ 8%]
qtconsole/tests/test_00_console_widget.py::test_input_and_print PASSED [ 10%]
--
timeout=SHELL_TIMEOUT)
E pytestqt.exceptions.TimeoutError: waitUntil timed out in 20000 milliseconds
qtconsole/tests/test_00_console_widget.py:188: TimeoutError
--
=========================== short test summary info ============================
FAILED qtconsole/tests/test_00_console_widget.py::test_debug - pytestqt.excep...
============= 1 failed, 46 passed, 1 skipped in 151.08s (0:02:31) ==============
INFO : Command's result: FAILURE
INFO : Command's error: Command '['xvfb-run', '-s', '-nolisten local', 'pytest',
'-v', 'qtconsole', '--ignore', 'qtconsole/tests/test_inprocess_kernel.py']' returned
non-zero exit status 1.
error: Bad exit status from /usr/src/tmp/rpmb-tmp.SLlPiI (%check)
python3-module-swiftclient-4.8.0-alt1
raise self.failureException(msg)
AssertionError: [call[71 chars]ken: ..."'), call('RESP STATUS: %s %s', 500, '[105
chars]"}')] != [call[71 chars]ken: asdf"'),
call('RESP STATUS: %s %s', 500,[109 chars]"}')]
python3-module-telnetlib3-3.0.1-alt1
[gw0] ^[[32mPASSED^[[0m
telnetlib3/tests/test_tls.py::test_cli_run_client[127.0.0.1-ascii-eol-ansi-keys]
[gw3] ^[[31mFAILED^[[0m telnetlib3/tests/test_sync.py::test_client_read_eof[127.0.0.1-read]
telnetlib3/tests/test_sync.py::test_client_read_eof[127.0.0.1-readline]
--
> ^[[94mraise^[[39;49;00m ^[[96mOSError^[[39;49;00m(err,
^[[33mf^[[39;49;00m^[[33m'^[[39;49;00m^[[33mConnect call failed
^[[39;49;00m^[[33m{^[[39;49;00maddress^[[33m}^[[39;49;00m^[[33m'^[[39;49;00m)^[[90m^[[39;49;00m
^[[1m^[[31mE ConnectionRefusedError: [Errno 111] Connect call failed
('127.0.0.1', 40551)^[[0m
^[[1m^[[31m/usr/lib64/python3.14/asyncio/selector_events.py^[[0m:683: ConnectionRefusedError
--
^[[36m^[[1m=========================== short test summary info
============================^[[0m
^[[31mFAILED^[[0m telnetlib3/tests/test_sync.py::^[[1mtest_client_read_eof[127.0.0.1-read]^[[0m
- ConnectionRefusedError: [Errno 111] Connect call failed ('127.0.0.1', 40551)
^[[31m============ ^[[31m^[[1m1 failed^[[0m, ^[[32m1694 passed^[[0m, ^[[33m3 skipped^[[0m,
^[[33m8 warnings^[[0m^[[31m in 14.45s^[[0m^[[31m ============^[[0m
INFO : Command's result: FAILURE
INFO : Command's error: Command '['python3', '-m', 'pytest', 'telnetlib3/tests']'
returned non-zero exit status 1.
error: Bad exit status from /usr/src/tmp/rpmb-tmp.AoBcMD (%check)
python3-module-zict-3.0.0-alt1
File "/usr/src/RPM/BUILD/python3-module-zict-3.0.0/zict/tests/utils_test.py", line 193,
in check_different_keys_threadsafe
f1.result()
File "/usr/lib64/python3.14/concurrent/futures/_base.py", line 449, in result
self._condition.wait(timeout)
File "/usr/lib64/python3.14/threading.py", line 370, in wait
waiter.acquire()
+++++++++++++++++++++++++++++++++++ Timeout ++++++++++++++++++++++++++++++++++++
error: Bad exit status from /usr/src/tmp/rpmb-tmp.u1cGcN (%check)
RPM build errors:
Bad exit status from /usr/src/tmp/rpmb-tmp.u1cGcN (%check)
shepherd-1.0.9-alt1
make[4]: Entering directory '/usr/src/RPM/BUILD/shepherd-1.0.9'
FAIL: tests/system-star.sh
make[4]: Leaving directory '/usr/src/RPM/BUILD/shepherd-1.0.9'
--
# SKIP: 1
# XFAIL: 0
# FAIL: 1
# XPASS: 0
# ERROR: 0
See ./test-suite.log
stevia-0.56.0-alt1
+ xvfb-run /usr/bin/meson test --no-rebuild --print-errorlogs -C x86_64-alt-linux
_XSERVTransmkdir: ERROR: euid != 0,directory /tmp/.X11-unix will not be created.
1/71 phosh-osk-stevia:Validate schema file OK 0.14s
--
# random seed: R02S32f3e6e8a600a91e4565212c23d62c61
# Gdk-DEBUG: error: XDG_RUNTIME_DIR is invalid or not set in the environment.
stderr:
stockfish-18-alt1
+ umask 022
+ /bin/mkdir -p /usr/src/RPM/BUILD
+ cd /usr/src/RPM/BUILD
+ cd stockfish-18
+ ./src/stockfish bench
Stockfish 18 by the Stockfish developers (see AUTHORS file)
/usr/src/tmp/rpmb-tmp.hthSAD: line 137: 3558307 Segmentation fault ./src/stockfish
bench
error: Bad exit status from /usr/src/tmp/rpmb-tmp.hthSAD (%check)
RPM build errors:
Bad exit status from /usr/src/tmp/rpmb-tmp.hthSAD (%check)
23 error logs REMOVED from the list
apache-commons-dbutils-1.8.1-alt1
apache-commons-math-0:3.6.1-alt1_8jpp11
cvs-1.11.23-alt9
fooyin-0.11.1-alt1
gtranslator-50.0-alt1
gz-sim-10.5.0-alt1
ignition-adw-2.1.2-alt1
imhex-1.37.4-alt2.1
java-1.8.0-openjdk-0:1.8.0.504.b01-alt1
libgeopmd-3.2.2-alt1
libgupnp-igd-1.6.0-alt1
lightdm-1.32.0-alt15
linstor-csi-1.11.2-alt1
mlt7-7.36.1-alt1
mongo5.0-5.0.34-alt2
mongo6.0-6.0.29-alt1
mongo7.0-7.0.43-alt1
mongo8.0-8.0.12-alt3
python3-module-chess-1.11.2-alt1
python3-module-kafka-3.0.11-alt1
python3-module-oscrypto-1.3.0-alt1.1
qemu-10.2.4-alt1
zipios++-0.1.5.9-alt2_35
Total 377 error logs.
^ permalink raw reply [flat|nested] only message in thread
only message in thread, other threads:[~2026-09-23 7:57 UTC | newest]
Thread overview: (only message) (download: mbox.gz / follow: Atom feed)
-- links below jump to the message on this page --
2026-09-23 7:57 [cyber] I: Sisyphus-20260923 x86_64 beehive_status: +17 -23 (377) ALT beekeeper
ALT Linux Sisyphus cybertalk
This inbox may be cloned and mirrored by anyone:
git clone --mirror http://lore.altlinux.org/sisyphus-cybertalk/0 sisyphus-cybertalk/git/0.git
# If you have public-inbox 1.1+ installed, you may
# initialize and index your mirror using the following commands:
public-inbox-init -V2 sisyphus-cybertalk sisyphus-cybertalk/ http://lore.altlinux.org/sisyphus-cybertalk \
sisyphus-cybertalk@lists.altlinux.org sisyphus-cybertalk@lists.altlinux.ru sisyphus-cybertalk@lists.altlinux.com
public-inbox-index sisyphus-cybertalk
Example config snippet for mirrors.
Newsgroup available over NNTP:
nntp://lore.altlinux.org/org.altlinux.lists.sisyphus-cybertalk
AGPL code for this site: git clone https://public-inbox.org/public-inbox.git