* [cyber] I: Sisyphus-20260922 x86_64 beehive_status: +14 -23 (383)
@ 2026-09-22 3:27 ALT beekeeper
0 siblings, 0 replies; only message in thread
From: ALT beekeeper @ 2026-09-22 3:27 UTC (permalink / raw)
To: sisyphus-cybertalk
[-- Warning: decoded text below may be mangled, UTF-8 assumed --]
[-- Attachment #1: Type: text/plain; charset=unknown-8bit, Size: 12748 bytes --]
14 NEW error logs
apache-commons-dbutils-1.8.1-alt1
[ERROR] -> [Help 1]
[ERROR]
[ERROR] To see the full stack trace of the errors, re-run Maven with the -e switch.
[ERROR] Re-run Maven using the -X switch to enable full debug logging.
[ERROR]
[ERROR] For more information about the errors and possible solutions, please read the
following articles:
[ERROR] [Help 1] http://cwiki.apache.org/confluence/display/MAVEN/MojoFailureException
error: Bad exit status from /usr/src/tmp/rpmb-tmp.o46A6z (%build)
RPM build errors:
Bad exit status from /usr/src/tmp/rpmb-tmp.o46A6z (%build)
apache-commons-math-0:3.6.1-alt1_8jpp11
[ERROR] -> [Help 1]
[ERROR]
[ERROR] To see the full stack trace of the errors, re-run Maven with the -e switch.
[ERROR] Re-run Maven using the -X switch to enable full debug logging.
[ERROR]
[ERROR] For more information about the errors and possible solutions, please read the
following articles:
[ERROR] [Help 1] http://cwiki.apache.org/confluence/display/MAVEN/MojoFailureException
error: Bad exit status from /usr/src/tmp/rpmb-tmp.fOzE9j (%build)
RPM build errors:
Bad exit status from /usr/src/tmp/rpmb-tmp.fOzE9j (%build)
dvdauthor-0.7.2-alt5.1
x86_64-alt-linux-gcc -DHAVE_CONFIG_H -I. -DSYSCONFDIR="\"/etc\"" -I/usr/include/libxml2
-I/usr/include/GraphicsMagick -I/usr/include/freetype2 -I/usr/include/libpng16
-I/usr/include/harfbuzz -I/usr/include/glib-2.0 -I/usr/lib64/glib-2.0/include
-I/usr/include/fribidi -I/usr/include/freetype2 -I/usr/include/libpng16
-I/usr/include/harfbuzz -I/usr/include/glib-2.0 -I/usr/lib64/glib-2.0/include -Wall
-pipe -frecord-gcc-switches -Wall -g -O2 -flto=auto -c -o dvdvob.o dvdvob.c
dvdvob.c: In function 'transpose_ts':
dvdvob.c:366:59: warning: suggest parentheses around '&&' within '||' [-Wparentheses]
366 | buf[17 + sysoffs] >= MPID_AUDIO_FIRST && buf[17 + sysoffs]
<= MPID_VIDEO_LAST
make[2]: Leaving directory '/usr/src/RPM/BUILD/dvdauthor-0.7.2/src'
make[1]: *** [Makefile:431: all] Error 2
make: *** [Makefile:423: all-recursive] Error 1
error: Bad exit status from /usr/src/tmp/rpmb-tmp.glgD6G (%build)
RPM build errors:
Bad exit status from /usr/src/tmp/rpmb-tmp.glgD6G (%build)
fooyin-0.11.1-alt1
431/431 Test #353: TagWriterTest.FlacCoverWrite
..................................................................... Passed 1.35 sec
99% tests passed, 1 tests failed out of 431
Total Test time (real) = 2.80 sec
The following tests FAILED:
10 - AudioLoaderTest.ProbesAllReadersForConfiguredExtensionsAndChoosesHighestSubsongCount
(Failed)
gz-sim-10.5.0-alt1
296/296 Test #296: world_TEST ...................................................
Passed 2.38 sec
99% tests passed, 2 tests failed out of 296
Total Test time (real) = 558.23 sec
The following tests FAILED:
91 - INTEGRATION_battery_plugin (Failed)
java-1.8.0-openjdk-0:1.8.0.504.b01-alt1
Unparseable macro: % by %%)
Macro %z not found
ignored self-provides: java-1.8.0-openjdk = 0:1.8.0.504.b01-alt1
ignored self-provides: java-1.8.0-openjdk-headless = 0:1.8.0.504.b01-alt1
ignored self-provides: java-1.8.0-openjdk-devel = 0:1.8.0.504.b01
ignored self-provides: java-1.8.0-openjdk-demo = 0:1.8.0.504.b01-alt1
ignored self-provides: java-1.8.0-openjdk-src = 0:1.8.0.504.b01-alt1
ignored self-provides: java-1.8.0-openjdk-javadoc = 0:1.8.0.504.b01-alt1
Unparseable macro: %.*}"
Bad exit status from /usr/src/tmp/rpmb-tmp.mjsgnU (%build)
libgupnp-igd-1.6.0-alt1
Bail out!
1/1 gupnp-igd:gupnp-simple-igd FAIL 8.09s killed by signal 6 SIGABRT
Summary of Failures:
1/1 gupnp-igd:gupnp-simple-igd FAIL 8.09s killed by signal 6 SIGABRT
Ok: 0
Fail: 1
Full log written to
/usr/src/RPM/BUILD/gupnp-igd-1.6.0/x86_64-alt-linux/meson-logs/testlog.txt
error: Bad exit status from /usr/src/tmp/rpmb-tmp.OtCDbc (%check)
RPM build errors:
Bad exit status from /usr/src/tmp/rpmb-tmp.OtCDbc (%check)
lightdm-1.32.0-alt15
# SKIP: 0
# XFAIL: 0
# FAIL: 1
# XPASS: 0
# ERROR: 0
See tests/test-suite.log
--
# SKIP: 0
# XFAIL: 0
# FAIL: 1
# XPASS: 0
# ERROR: 0
.. contents:: :depth: 2
FAIL: test-autologin-unknown
** (process:1685163): WARNING **: 02:51:08.756: Error loading passwd file: Failed to
open file “/tmp/.r0/etc/passwd”: No such file or directory
** (process:1685169): WARNING **: 02:51:08.760: Error loading passwd file: Failed to
open file “/tmp/.r0/etc/passwd”: No such file or directory
** (process:1685176): WARNING **: 02:51:08.763: Error loading passwd file: Failed to
open file “/tmp/.r0/etc/passwd”: No such file or directory
** (process:1685189): WARNING **: 02:51:08.767: Error loading passwd file: Failed to
open file “/tmp/.r0/etc/passwd”: No such file or directory
linstor-csi-1.11.2-alt1
^[[38;5;243m------------------------------^[[0m
^[[38;5;9m• [FAILED] [60.101 seconds]^[[0m
^[[38;5;9m^[[1mNode Service [BeforeEach] ^[[38;5;243mNodeGetCapabilities ^[[0mshould return
appropriate capabilities^[[0m
--
^[[1mSTEP:^[[0m connecting to CSI driver ^[[38;5;243m@ 09/22/26 02:38:23.105^[[0m
^[[38;5;9m[FAILED]^[[0m in [BeforeEach] -
/usr/src/RPM/BUILD/linstor-csi-1.11.2/vendor/github.com/kubernetes-csi/csi-test/v5/pkg/sanity/sanity.go:272
^[[38;5;243m@ 09/22/26 02:39:23.205^[[0m
^[[38;5;13m[PANICKED]^[[0m in [AfterEach] - /usr/lib/golang/src/runtime/panic.go:336
^[[38;5;243m@ 09/22/26 02:39:23.205^[[0m
^[[38;5;243m<< Timeline^[[0m
^[[38;5;9m[FAILED] Unexpected error:
<*errors.errorString | 0x2f9e16080bb0>:
--
^[[38;5;9m^[[1mFAIL!^[[0m -- ^[[38;5;10m^[[1m75 Passed^[[0m | ^[[38;5;9m^[[1m1 Failed^[[0m |
^[[38;5;11m^[[1m1 Pending^[[0m | ^[[38;5;14m^[[1m15 Skipped^[[0m
--- FAIL: TestDriver (60.28s)
FAIL
python3-module-crosshair-tool-0.0.110-alt1
==================================== ERRORS ====================================
____________________________ ERROR collecting gw18 _____________________________
Different tests were collected between gw1 and gw18. The difference is:
--
To see why this happens see 'Known limitations' in documentation for pytest-xdist
_____________________________ ERROR collecting gw9 _____________________________
Different tests were collected between gw1 and gw9. The difference is:
--
=========================== short test summary info ============================
ERROR gw18 - Different tests were collected between gw1 and gw18. The differe...
ERROR gw9 - Different tests were collected between gw1 and gw9. The differenc...
======================== 32 warnings, 2 errors in 9.81s ========================
INFO : Command's result: FAILURE
INFO : Command's error: Command '['python3',
'-m', 'pytest', '-vra', '-n', '32', '--deselect',
'crosshair/libimpl/datetimelib_ch_test.py::test_builtin[check_timedelta_new]',
'--deselect', 'crosshair/libimpl/datetimelib_test.py::test_leap_year']' returned non-zero
exit status 1.
error: Bad exit status from /usr/src/tmp/rpmb-tmp.xP6RJn (%check)
python3-module-kafka-3.0.11-alt1
02:19:45.652 DEBUG 139984219104960:kafka-io-kafka-python-3.0.11 test.mock_broker
<MockTransport [localhost:9092<-mock]>: Request api_key=21 version=2 correlation_id=43
02:19:45.652 ERROR 139984219104960:kafka-io-kafka-python-3.0.11 kafka.net.selector
Unhandled exception in task <kafka.net.selector.Task object at 0x7f509e3d8280>:
Traceback (most recent call last):
--
[(k, type(r).__name__) for k, r in self._response_queue]))
ValueError: MockBroker: no handler for api_key=21 version=2 (correlation_id=43). Scripted
queue has 0 entries: []
02:19:45.853 WARNING 139984219104960:kafka-io-kafka-python-3.0.11 kafka.net.connection
<KafkaConnection node_id=0 host=[localhost:9092<-mock] broker_version=(4, 2) (connected)>:
Request timed out after 199 ms. Closing connection.
02:19:45.853 ERROR 139984219104960:kafka-io-kafka-python-3.0.11 kafka.net.connection
<KafkaConnection node_id=0 broker_version=(4, 2) (disconnected)>: Connection lost:
[Error 7] RequestTimedOutError: Request timed out after 199 ms
02:19:45.854 DEBUG 139984219104960:kafka-io-kafka-python-3.0.11 kafka.cluster
Sending metadata request MetadataRequest(topics=[], allow_auto_topic_creation=True,
include_cluster_authorized_operations=False, include_topic_authorized_operations=False)
to node 0
--
02:19:45.854 DEBUG 139984219104960:kafka-io-kafka-python-3.0.11 kafka.net.connection
<KafkaConnection node_id=0 broker_version=(4, 2) (disconnected)> Request
1: ApiVersionsRequest(version=4, client_software_name='kafka-python',
client_software_version='3.0.11')
02:19:45.854 ERROR 139984219104960:kafka-io-kafka-python-3.0.11 kafka.net.connection
<KafkaConnection node_id=0 broker_version=(4, 2) (disconnected)>: Connection lost:
'NoneType' object has no attribute 'write'
02:19:45.855 ERROR 139984219104960:kafka-io-kafka-python-3.0.11 kafka.cluster
Metadata refresh: failed KafkaConnectionError
02:19:45.855 DEBUG 139984219104960:kafka-io-kafka-python-3.0.11 kafka.cluster
Metadata refresh failed
--
raise self.exception
kafka.errors.KafkaConnectionError: KafkaConnectionError
02:19:45.855 DEBUG 139984219104960:kafka-io-kafka-python-3.0.11 kafka.cluster
Sleeping 0.09948916721343994 for next Metadata refresh
02:19:45.855 DEBUG 139984219104960:kafka-io-kafka-python-3.0.11 kafka.cluster
Sleeping 0.0994293270111084 for next Metadata refresh
02:19:45.854 ERROR 139984297531200:MainThread kafka.net.connection <KafkaConnection
node_id=0 broker_version=(4, 2) (disconnected)>: Connection lost: KafkaConnectionError
02:19:45.855 INFO 139984219104960:kafka-io-kafka-python-3.0.11 kafka.cluster
Stopping metadata refresh loop
02:19:45.855 INFO 139984219104960:kafka-io-kafka-python-3.0.11 kafka.net.selector
IO loop exited cleanly (client_id=kafka-python-3.0.11, stop=True)
02:19:45.855 DEBUG 139984297531200:MainThread kafka.admin.client KafkaAdminClient
is now closed.ERROR:kafka.cluster:Metadata refresh loop error: weakly-referenced object
no longer exists
INFO:kafka.cluster:Stopping metadata refresh loop
--
SKIPPED [2] test/integration/test_ssl_integration.py: SSL support requires broker >=0.9
FAILED
test/admin/test_admin_partitions.py::TestDeleteRecordsMockBroker::test_persistent_not_leader_reports_error_after_timeout
================= 1 failed, 2626 passed, 67 skipped in 18.10s ==================
INFO : Command's result: FAILURE
INFO : Command's error: Command '['python3', '-m', 'pytest', '-ra', '-Wignore']'
returned non-zero exit status 1.
error: Bad exit status from /usr/src/tmp/rpmb-tmp.PMMF5u (%check)
python3-module-oscrypto-1.3.0-alt1.1
test_dump_certificate (tests.test_asymmetric.AsymmetricTests.test_dump_certificate) ... ok
test_dump_private (tests.test_asymmetric.AsymmetricTests.test_dump_private) ... ERROR
test_dump_private_openssl (tests.test_asymmetric.AsymmetricTests.test_dump_private_openssl)
... ok
--
test_load_order (tests.test_init.InitTests.test_load_order) ... ok
ERROR: test_dump_private (tests.test_asymmetric.AsymmetricTests.test_dump_private)
Traceback (most recent call last):
--
iterations = int(iterations / fraction / 2.0)
ZeroDivisionError: division by zero
Ran 141 tests in 0.276s
FAILED (errors=1)
error: Bad exit status from /usr/src/tmp/rpmb-tmp.7Qx5ML (%check)
qemu-10.2.4-alt1
stderr:
TAP parsing error: Too few tests run (expected 5, got 2)
Summary of Failures:
uutils-coreutils-0.9.0-alt1
test_uptime::test_uptime_pretty_print
test result: FAILED. 5127 passed; 4 failed; 85 ignored; 0 measured; 48 filtered out;
finished in 19.80s
error: test failed, to rerun pass `--test tests`
Doc-tests coreutils
--
test result: ok. 0 passed; 0 failed; 0 ignored; 0 measured; 0 filtered out; finished
in 0.00s
error: 1 target failed:
`--test tests`
23 error logs REMOVED from the list
apache2-mod_perl-2.0.13-alt1
binwalk3-3.1.0-alt1
cyrus-sasl2-2.1.28-alt5
gnuplot-1:6.0.4-alt1
gz-gui-10.0.0-alt3
javassist-0:3.30.2-alt1
perl-Badger-0.16-alt1
postgresql14-pgpool-II-4.7.2-alt1
postgresql15-pgpool-II-4.7.2-alt1
postgresql16-pgpool-II-4.7.2-alt1
postgresql17-pgpool-II-4.7.2-alt1
python3-module-paho-2.1.0-alt2
python3-module-pythran-0.19.0-alt1
python3-module-qtconsole-5.7.2-alt1.1
python3-module-rapidfuzz-3.14.6-alt1
python3-module-retrying-1.4.2-alt1
python3-module-websockets-16.1-alt1
python3-module-zict-3.0.0-alt1
qt5-qtsystems-5.4.0_git20230712.81e08ee-alt1
shepherd-1.0.9-alt1
stockfish-18-alt1
vector-0.58.0-alt1
whisper.cpp-1.9.1-alt4
Total 383 error logs.
^ permalink raw reply [flat|nested] only message in thread
only message in thread, other threads:[~2026-09-22 3:27 UTC | newest]
Thread overview: (only message) (download: mbox.gz / follow: Atom feed)
-- links below jump to the message on this page --
2026-09-22 3:27 [cyber] I: Sisyphus-20260922 x86_64 beehive_status: +14 -23 (383) ALT beekeeper
ALT Linux Sisyphus cybertalk
This inbox may be cloned and mirrored by anyone:
git clone --mirror http://lore.altlinux.org/sisyphus-cybertalk/0 sisyphus-cybertalk/git/0.git
# If you have public-inbox 1.1+ installed, you may
# initialize and index your mirror using the following commands:
public-inbox-init -V2 sisyphus-cybertalk sisyphus-cybertalk/ http://lore.altlinux.org/sisyphus-cybertalk \
sisyphus-cybertalk@lists.altlinux.org sisyphus-cybertalk@lists.altlinux.ru sisyphus-cybertalk@lists.altlinux.com
public-inbox-index sisyphus-cybertalk
Example config snippet for mirrors.
Newsgroup available over NNTP:
nntp://lore.altlinux.org/org.altlinux.lists.sisyphus-cybertalk
AGPL code for this site: git clone https://public-inbox.org/public-inbox.git