ALT Linux Sisyphus cybertalk
 help / color / mirror / Atom feed
* [cyber] I: Sisyphus-20260921 x86_64 beehive_status: +19 -16 (392)
@ 2026-09-21  7:34 ALT beekeeper
  0 siblings, 0 replies; only message in thread
From: ALT beekeeper @ 2026-09-21  7:34 UTC (permalink / raw)
  To: sisyphus-cybertalk

	19 NEW error logs

apache2-mod_perl-2.0.13-alt1
	[   info] adding source lib
	/usr/src/RPM/BUILD/mod_perl-2.0.13/Apache-Reload/../Apache-Test/lib to @INC
	# Failed test 2 in t/reload.t at line 47
	t/reload.t ..
	--
	t/reload.t (Wstat: 0 Tests: 3 Failed: 1)
	Failed test:  2
	Files=1, Tests=3,  0 wallclock secs ( 0.01 usr	0.01 sys +  0.18 cusr  0.05 csys =
	0.25 CPU)
	Result: FAIL
	Failed 1/1 test programs. 1/3 subtests failed.
	[warning] server localhost.localdomain:8529 shutdown

auditd-plugin-clickhouse-lite-0.1.9-alt3
	ok 13 auditd-plugin-clickhouse other-error nothrow
	0% tests passed, 1 tests failed out of 1
	Total Test time (real) = 1500.05 sec
	The following tests FAILED:
	1 - main_test (Timeout)

binwalk3-3.1.0-alt1
	test src/extractors/common.rs - extractors::common::Chroot::append_to_file (line 429)
	... ok
	test src/extractors/common.rs - extractors::common::Chroot::create_socket (line 404)
	... FAILED
	test src/binwalk.rs - binwalk::Binwalk::new (line 80) ... ok
	--
	src/extractors/common.rs - extractors::common::Chroot::create_socket (line 404)
	test result: FAILED. 28 passed; 1 failed; 3 ignored; 0 measured; 0 filtered out;
	finished in 0.23s
	error: doctest failed, to rerun pass `--doc`
	error: Bad exit status from /usr/src/tmp/rpmb-tmp.X3mHAu (%check)

bpftrace-0.27.0-alt1
	^[[94m[	 SKIP	]^[[0m probe.kprobe_offset_module_error (unmet condition: 'lsmod | grep
	'^nf_tables'')\r
	^[[91m[	FAILED	]^[[0m 2 tests, listed below:\r
	^[[91m[	FAILED	]^[[0m call.tseries\r
	^[[91m[	FAILED	]^[[0m probe.attach_to_bpf_program\r
	1304.17user 1045.39system 33:41.98elapsed 116%CPU (0avgtext+0avgdata 14552112maxresident)k

fonts-ttf-IosevkaTermSlab-34.8.1-alt1
	[ACTION] Create TTF 'dist/IosevkaSlab/TTF-Unhinted/IosevkaSlab-HeavyItalic.ttf'
	[ACTION] Create TTF 'dist/IosevkaSlab/TTF-Unhinted/IosevkaSlab-ExtendedHeavyItalic.ttf'
	[ACTION] Create TTF 'dist/IosevkaSlab/TTF-Unhinted/IosevkaSlab-Thin.ttf'
	[ACTION] Create TTF 'dist/IosevkaSlab/TTF-Unhinted/IosevkaSlab-ExtendedThin.ttf'
	[ACTION] Create TTF 'dist/IosevkaSlab/TTF-Unhinted/IosevkaSlab-ThinOblique.ttf'
	[ACTION] Create TTF 'dist/IosevkaSlab/TTF-Unhinted/IosevkaSlab-ExtendedThinOblique.ttf'
	/usr/src/tmp/rpmb-tmp.l55Mp9: line 134: 1216308 CPU time limit exceeded npm run build
	-- ttf::IosevkaTermSlab
	error: Bad exit status from /usr/src/tmp/rpmb-tmp.l55Mp9 (%build)
	RPM build errors:
	Bad exit status from /usr/src/tmp/rpmb-tmp.l55Mp9 (%build)

gnuplot-1:6.0.4-alt1
	make[1]: Leaving directory '/usr/src/RPM/BUILD/gnuplot-6.0.4/docs'
	make[1]: *** Deleting file 'gnuplot.tex'
	make[1]: Entering directory '/usr/src/RPM/BUILD/gnuplot-6.0.4/docs'
	./doc2tex -figures ./gnuplot.doc gnuplot.tex
	make[1]: *** [Makefile:1101: gnuplot.tex] Segmentation fault
	make[1]: Leaving directory '/usr/src/RPM/BUILD/gnuplot-6.0.4/docs'
	make: *** [Makefile:1104: pdf] Error 2
	error: Bad exit status from /usr/src/tmp/rpmb-tmp.c0ds5S (%build)
	RPM build errors:
	Bad exit status from /usr/src/tmp/rpmb-tmp.c0ds5S (%build)

gz-gui-10.0.0-alt3
	(2026-09-21 01:46:39.239) [debug] [InteractiveViewControl.cc:177] [GUI]
	InteractiveViewControl plugin is moving camera [banana::Camera(65527)]
	Mesa: error: GL_INVALID_ENUM in glBindTexture(target = GL_NONE)
	Mesa: error: GL_INVALID_ENUM in glTexParameteri(target)
	Start 52: check_INTEGRATION_minimal_scene
	--
	54/54 Test #54: check_INTEGRATION_transport_scene_manager ...	Passed	  0.01 sec
	96% tests passed, 2 tests failed out of 54
	Total Test time (real) = 375.83 sec
	The following tests FAILED:
	41 - UNIT_WorldStats_TEST (Subprocess aborted)

icingaweb2-2.12.5-alt3
	file /usr/lib/tmpfiles.d/php.conf conflicts between attempted installs of
	php8.5-libs-8.5.10-alt1.x86_64 and php8.4-libs-8.4.24-alt1.x86_64
	hsh-install: Packages installation failed.

javassist-0:3.30.2-alt1
	[ERROR] javassist.JvstTest4.testJIRA150 -- Time elapsed: 0.717 s <<< FAILURE!
	junit.framework.AssertionFailedError: performance test (the next try may succeed):
	455 < 6 * 68
	at junit.framework.Assert.fail(Assert.java:57)

perl-Badger-0.16-alt1
	Result: FAIL
	Failed 1/70 test programs. 0/1739 subtests failed.
	make: *** [Makefile:866: test_dynamic] Error 255

python3-module-chess-1.11.2-alt1
	return await command.result
	chess.engine.EngineTerminatedError: engine process died unexpectedly (exit code: -11)
	ERROR: test_sf_multipv (__main__.EngineTestCase.test_sf_multipv)
	Traceback (most recent call last):
	--
	return await command.result
	chess.engine.EngineTerminatedError: engine process died unexpectedly (exit code: -11)
	ERROR: test_sf_options (__main__.EngineTestCase.test_sf_options)
	Traceback (most recent call last):
	--
	return await command.result
	chess.engine.EngineTerminatedError: engine process died unexpectedly (exit code: -11)
	ERROR: test_sf_quit (__main__.EngineTestCase.test_sf_quit)
	Traceback (most recent call last):
	--
	return await command.result
	chess.engine.EngineTerminatedError: engine process died unexpectedly (exit code: -11)
	Ran 288 tests in 0.895s
	FAILED (errors=4, skipped=17)
	py3: exit 1 (1.05 seconds) /usr/src/RPM/BUILD/python3-module-chess-1.11.2> python
	test.py --verbose pid=2568381

python3-module-paho-2.1.0-alt2
	"on_disconnect",
	E	    AssertionError: assert ['on_connect'..._unsubscribe'] ==
	['on_connect'...n_disconnect']
	E
	--
	"on_disconnect",
	E	    AssertionError: assert ['on_connect'..._unsubscribe'] ==
	['on_connect'...n_disconnect']
	E
	--
	=========================== short test summary info ============================
	FAILED tests/test_client.py::TestCompatibility::test_callback_v1_mqtt3[tcp]
	FAILED tests/test_client.py::TestCompatibility::test_callback_v1_mqtt3[unix]
	FAILED tests/test_client.py::TestCompatibility::test_callback_v2_mqtt3[tcp]
	FAILED tests/test_client.py::TestCompatibility::test_callback_v2_mqtt3[unix]
	============ 4 failed, 132 passed, 26 skipped, 1 xfailed in 34.24s =============
	INFO	 : Command's result: FAILURE
	INFO	 : Command's error: Command '['python3', '-m', 'pytest', '-o', 'addopts=',
	'tests']' returned non-zero exit status 1.
	error: Bad exit status from /usr/src/tmp/rpmb-tmp.VGuq23 (%check)

python3-module-pythran-0.19.0-alt1
	INFO	 : Running command: ['python3', '-m', 'pytest', '-n', 'auto', '--dist',
	'worksteal', '-v', '-ra', '--tb=short', '-k', 'not test_setup_build and not
	test_setup_build2 and not benchmark']
	hasher-privd: parent: handle_io: idle time limit (3600 seconds) exceeded

python3-module-rapidfuzz-3.14.6-alt1
	=========================== short test summary info ============================
	FAILED tests/test_hypothesis.py::test_jaro_winkler_word - AssertionError
	======================== 1 failed, 420 passed in 9.32s =========================

python3-module-retrying-1.4.2-alt1
	"msg": "calls_per_second_final was not within +/-20% of calls_per_second_initial"
	E	AssertionError: False is not true : {'calls_per_second_initial':
	24306.705112642143, 'calls_per_second_final': 29319.807764360066, 'msg':
	'calls_per_second_final was not within +/-20% of calls_per_second_initial'}
	test_retrying.py:530: AssertionError
	=========================== short test summary info ============================
	FAILED test_retrying.py::LoadTest::test_load - AssertionError: False is not t...
	======================== 1 failed, 26 passed in 24.50s =========================
	INFO	 : Command's result: FAILURE
	INFO	 : Command's error: Command '['python3', '-m', 'pytest', 'test_retrying.py']'
	returned non-zero exit status 1.
	error: Bad exit status from /usr/src/tmp/rpmb-tmp.8vt0jt (%check)

python3-module-websockets-16.1-alt1
	.........................................sssssssssssssss.......ssssssss...........................................................................................................................................................................s....s.s...........................................................................................................................................................................................................................................................................................................................................................................................................................................................................................ss...........................................................................................................................................................................................................................................................................................................................................................................................sssssssssssssss.....ssssssss...................................................................................................EF................s.s............................................................................EF.......................................................................................................................................................................................................................................................................................................................................................................................................................................................................................................................................................................................................................................................................
	ERROR: test_writing_in_recv_events_fails
	(tests.sync.test_connection.ClientConnectionTests.test_writing_in_recv_events_fails)
	Error when responding to incoming frames is correctly reported.
	--
	raise self.protocol.close_exc from original_exc
	websockets.exceptions.ConnectionClosedError: no close frame received or sent
	ERROR: test_writing_in_recv_events_fails
	(tests.sync.test_connection.ServerConnectionTests.test_writing_in_recv_events_fails)
	Error when responding to incoming frames is correctly reported.
	--
	raise self.protocol.close_exc from original_exc
	websockets.exceptions.ConnectionClosedError: no close frame received or sent
	FAIL: test_writing_in_send_context_fails
	(tests.sync.test_connection.ClientConnectionTests.test_writing_in_send_context_fails)
	Error when sending outgoing frame is correctly reported.
	--
	self.assertIsInstance(raised.exception.__cause__, BrokenPipeError)
	AssertionError: None is not an instance of <class 'BrokenPipeError'>
	FAIL: test_writing_in_send_context_fails
	(tests.sync.test_connection.ServerConnectionTests.test_writing_in_send_context_fails)
	Error when sending outgoing frame is correctly reported.
	--
	self.assertIsInstance(raised.exception.__cause__, BrokenPipeError)
	AssertionError: None is not an instance of <class 'BrokenPipeError'>
	Ran 1979 tests in 72.480s
	FAILED (failures=2, errors=2, skipped=53)
	INFO	 : Command's result: FAILURE
	INFO	 : Command's error: Command '['python3', '-m', 'unittest']' returned non-zero
	exit status 1.
	error: Bad exit status from /usr/src/tmp/rpmb-tmp.EAeRBr (%check)

qt5-qtsystems-5.4.0_git20230712.81e08ee-alt1
	make[2]: *** [Makefile:452: sub-serviceframework-check] Error 2
	make[2]: Leaving directory
	'/usr/src/RPM/BUILD/qt5-qtsystems-5.4.0_git20230712.81e08ee/tests/auto'
	make[1]: *** [Makefile:396: sub-auto-check] Error 2
	make[1]: Leaving directory
	'/usr/src/RPM/BUILD/qt5-qtsystems-5.4.0_git20230712.81e08ee/tests'
	make: *** [Makefile:514: sub-tests-check_ordered] Error 2
	make: Leaving directory '/usr/src/RPM/BUILD/qt5-qtsystems-5.4.0_git20230712.81e08ee'
	error: Bad exit status from /usr/src/tmp/rpmb-tmp.IeLwcN (%check)
	RPM build errors:
	File /usr/src/RPM/SOURCES/qt5-qtsystems-5.4.0_git20230712.81e08ee-alt1.patch is smaller
	than 8 bytes
	Bad exit status from /usr/src/tmp/rpmb-tmp.IeLwcN (%check)

shepherd-1.0.9-alt1
	make[4]: Entering directory '/usr/src/RPM/BUILD/shepherd-1.0.9'
	FAIL: tests/services/timer-at.sh
	make[4]: Leaving directory '/usr/src/RPM/BUILD/shepherd-1.0.9'
	--
	# SKIP:  1
	# XFAIL: 0
	# FAIL:  1
	# XPASS: 0
	# ERROR: 0
	See ./test-suite.log

vector-0.58.0-alt1
	Compiling vector-lib v0.1.0 (/usr/src/RPM/BUILD/vector-0.58.0/lib/vector-lib)
	hasher-privd: parent: handle_io: idle time limit (3600 seconds) exceeded

	16 error logs REMOVED from the list
Perlbal-1.80-alt1
altlinux-freedesktop-menu-0.70-alt2
babel-2.0.0-alt9
bird-3.3.2-alt1
klevernotes-1.3.1-alt4
libpjsip-2.17-alt1
libuser-0.64-alt1.1
m4b-tool-0.5.2-alt1
perl-Tie-DBI-1.08-alt1
python3-module-crosshair-tool-0.0.110-alt1
python3-module-pytest-xprocess-1.0.2-alt1.1
python3-module-serialx-1.9.0-alt1
squid-7.7-alt1
ulogd-2.0.9-alt1
unpaper-7.0.0-alt1.1
urlview-1:0.9-alt3

Total 392 error logs.


^ permalink raw reply	[flat|nested] only message in thread

only message in thread, other threads:[~2026-09-21  7:34 UTC | newest]

Thread overview: (only message) (download: mbox.gz / follow: Atom feed)
-- links below jump to the message on this page --
2026-09-21  7:34 [cyber] I: Sisyphus-20260921 x86_64 beehive_status: +19 -16 (392) ALT beekeeper

ALT Linux Sisyphus cybertalk

This inbox may be cloned and mirrored by anyone:

	git clone --mirror http://lore.altlinux.org/sisyphus-cybertalk/0 sisyphus-cybertalk/git/0.git

	# If you have public-inbox 1.1+ installed, you may
	# initialize and index your mirror using the following commands:
	public-inbox-init -V2 sisyphus-cybertalk sisyphus-cybertalk/ http://lore.altlinux.org/sisyphus-cybertalk \
		sisyphus-cybertalk@lists.altlinux.org sisyphus-cybertalk@lists.altlinux.ru sisyphus-cybertalk@lists.altlinux.com
	public-inbox-index sisyphus-cybertalk

Example config snippet for mirrors.
Newsgroup available over NNTP:
	nntp://lore.altlinux.org/org.altlinux.lists.sisyphus-cybertalk


AGPL code for this site: git clone https://public-inbox.org/public-inbox.git