ALT Linux Sisyphus cybertalk
 help / color / mirror / Atom feed
* [cyber] I: Sisyphus-20261002 x86_64 beehive_status: +10 -15 (337)
@ 2026-10-02  7:46 ALT beekeeper
  0 siblings, 0 replies; only message in thread
From: ALT beekeeper @ 2026-10-02  7:46 UTC (permalink / raw)
  To: sisyphus-cybertalk

[-- Warning: decoded text below may be mangled, UTF-8 assumed --]
[-- Attachment #1: Type: text/plain; charset=unknown-8bit, Size: 7264 bytes --]

	10 NEW error logs

casr-2.13.1-alt2
	test test_safe_func32 ... ignored
	test test_casr_ubsan ... FAILED
	test test_casr_lua ... ok
	--
	thread 'test_casr_ubsan' (1449774) panicked at casr/tests/tests.rs:3961:43:
	called `Result::unwrap()` on an `Err` value: Os { code: 2, kind: NotFound, message:
	"No such file or directory" }
	note: run with `RUST_BACKTRACE=1` environment variable to display a backtrace
	--
	test_casr_ubsan
	test result: FAILED. 22 passed; 1 failed; 4 ignored; 0 measured; 76 filtered out;
	finished in 78.36s
	error: test failed, to rerun pass `-p casr --test tests`
	Running unittests src/lib.rs (target/release/deps/libcasr-cd0206c960f194c9)
	--
	test result: ok. 0 passed; 0 failed; 0 ignored; 0 measured; 0 filtered out; finished
	in 0.00s
	error: 1 target failed:
	`-p casr --test tests`

cov-analysis-1.2-alt1
	[PASS] copies that differ print different hashes
	[PASS] every subcommand agrees on -V
	[PASS] test_version_identity
	Results: 42 passed, 1 failed
	Failed: tests/test_documentation.sh
	make: *** [Makefile:20: test] Error 1
	make: Leaving directory '/usr/src/RPM/BUILD/cov-analysis-1.2'
	error: Bad exit status from /usr/src/tmp/rpmb-tmp.NkI1iU (%check)
	RPM build errors:
	Bad exit status from /usr/src/tmp/rpmb-tmp.NkI1iU (%check)

gem-digest-crc-0.6.5-alt1
	Wrote: /usr/src/in/nosrpm/gem-digest-crc-0.6.5-alt1.nosrc.rpm (w1.gzdio)
	error: failed build dependencies:
	gem(github-markup) >= 5 conflicts with gem-digest-crc-0.6.5-alt1

gnuplot-1:6.0.5-alt1
	make[1]: Leaving directory '/usr/src/RPM/BUILD/gnuplot-6.0.5/docs'
	make[1]: *** Deleting file 'gnuplot.tex'
	make[1]: Entering directory '/usr/src/RPM/BUILD/gnuplot-6.0.5/docs'
	./doc2tex -figures ./gnuplot.doc gnuplot.tex
	make[1]: *** [Makefile:1101: gnuplot.tex] Segmentation fault
	make[1]: Leaving directory '/usr/src/RPM/BUILD/gnuplot-6.0.5/docs'
	make: *** [Makefile:1104: pdf] Error 2
	error: Bad exit status from /usr/src/tmp/rpmb-tmp.2vZJbw (%build)
	RPM build errors:
	Bad exit status from /usr/src/tmp/rpmb-tmp.2vZJbw (%build)

libdqlite-1.18.2-alt2
	make[2]: Entering directory '/usr/src/RPM/BUILD/libdqlite-1.18.2'
	FAIL: integration-test
	make[2]: Leaving directory '/usr/src/RPM/BUILD/libdqlite-1.18.2'
	--
	# SKIP:  0
	# XFAIL: 0
	# FAIL:  1
	# XPASS: 0
	# ERROR: 0
	See ./test-suite.log

libfprint2-1.94.100-alt1
	(process:2416466): libfprint-device-DEBUG: 03:16:26.861: Device reported finger status
	change: FP_FINGER_STATUS_NEEDED -> FP_FINGER_STATUS_PRESENT
	(process:2416466): libfprint-SSM-DEBUG: 03:16:26.861: [egis_etu905] SSM IDENTIFY_STATES
	failed in state 4 with error: Operation was cancelled
	(process:2416466): libfprint-SSM-DEBUG: 03:16:26.861: [egis_etu905] IDENTIFY_STATES
	completed with error: Operation was cancelled
	(process:2416466): libfprint-egis_etu905-DEBUG: 03:16:26.861: Task SSM done
	--
	(process:2416466): libfprint-SSM-DEBUG: 03:16:26.861: [egis_etu905] CMD_STATES entering
	state 0
	(process:2416466): libfprint-SSM-DEBUG: 03:16:31.861: [egis_etu905] SSM CMD_STATES
	failed in state 0 with error: transfer timed out
	(process:2416466): libfprint-SSM-DEBUG: 03:16:31.861: [egis_etu905] CMD_STATES completed
	with error: transfer timed out
	(process:2416466): libfprint-SSM-DEBUG: 03:16:31.861: [egis_etu905] SSM CANCEL_STATES
	failed in state 0 with error: transfer timed out
	(process:2416466): libfprint-SSM-DEBUG: 03:16:31.861: [egis_etu905] CANCEL_STATES
	completed with error: transfer timed out
	** (umockdev-run:2416285): DEBUG: 03:16:31.863: umockdev.vala:154: Removing test bed
	/usr/src/tmp/umockdev.2575V3
	--
	stderr:
	ERROR: uevent_sender_send: Failed
	udev_device_new_from_syspath(/sys/devices/pci0000:00/0000:00:14.0/usb3/3-4): No such device
	ERROR: uevent_sender_send: Failed
	udev_device_new_from_syspath(/sys/devices/pci0000:00/0000:00:14.0/usb3/3-4) after retry:
	No such device
	ERROR: uevent_sender_send: Failed
	udev_device_new_from_syspath(/sys/devices/pci0000:00/0000:00:14.0/usb3): No such device
	ERROR: uevent_sender_send: Failed
	udev_device_new_from_syspath(/sys/devices/pci0000:00/0000:00:14.0/usb3) after retry:
	No such device
	ERROR: uevent_sender_send: Failed
	udev_device_new_from_syspath(/sys/devices/pci0000:00/0000:00:14.0): No such device

podman-tui-1.11.3-alt1
	^[[38;5;243m------------------------------^[[0m
	^[[38;5;9m• [FAILED] [0.002 seconds]^[[0m
	^[[0mimage import ^[[38;5;9m^[[1m[It] import options^[[0m
	^[[38;5;243m/usr/src/RPM/BUILD/podman-tui-1.11.3/ui/images/imgdialogs/import_test.go:81^[[0m
	^[[38;5;9m[FAILED] Expected
	<*errors.errorString | 0x20ecad0>:
	--
	^[[38;5;9m^[[1mFAIL!^[[0m -- ^[[38;5;10m^[[1m35 Passed^[[0m | ^[[38;5;9m^[[1m1 Failed^[[0m |
	^[[38;5;11m^[[1m0 Pending^[[0m | ^[[38;5;14m^[[1m1 Skipped^[[0m
	--- FAIL: TestImgdialogs (0.16s)
	FAIL

python3-module-cyclonedx-bom-7.3.0-alt1
	raise ValueError(err_msg) from None
	ValueError: metadata: invalid core metadata: 'cyclonedx-python-lib[validation]
	(>=8.0,<9.0 || >=9.0,<10.0 || >=10,<11 || >=11,<12)' is invalid for 'requires-dist'
	+ rc=1

python3-module-devpi-server-6.20.3-alt1
	>	    assert not pypistage.cache_retrieve_times.is_expired("pkg",
	pypistage.cache_expiry)
	E	    AssertionError: assert not True
	E	     +	where True = is_expired('pkg', 1800)
	--
	SKIPPED [4] test_devpi_server/test_streaming.py:103: No nginx executable found.
	FAILED
	test_devpi_server/test_keyfs.py::TestSubscriber::test_notifications_retried_after_exception
	FAILED test_devpi_server/test_mirror.py::TestMirrorStageprojects::test_simplelinks_timeout
	===== 2 failed, 1132 passed, 53 skipped, 26 warnings in 266.43s (0:04:26) ======
	INFO	 : Command's result: FAILURE
	INFO	 : Command's error: Command '['python3', '-m', 'pytest', '-ra']' returned
	non-zero exit status 1.
	error: Bad exit status from /usr/src/tmp/rpmb-tmp.OpNcuw (%check)

python3-module-pytest-xprocess-1.0.2-alt1.1
	tests/test_interruption_clean_up.py::test_interruption_cleanup PASSED	 [ 15%]
	tests/test_interruption_clean_up.py::test_interruption_does_not_cleanup FAILED [ 17%]
	tests/test_process_initialization.py::test_servers_start[s1] PASSED	 [ 19%]
	--
	pidfd = os.pidfd_open(pid, 0)
	OSError: [Errno 22] Invalid argument
	=========================== short test summary info ============================
	FAILED tests/test_interruption_clean_up.py::test_interruption_does_not_cleanup
	======================== 1 failed, 50 passed in 34.07s =========================
	--
	INFO	 : Command's result: FAILURE
	INFO	 : Command's error: Command '['pytest', '-vra']' returned non-zero exit status 1.
	error: Bad exit status from /usr/src/tmp/rpmb-tmp.13rquK (%check)

	15 error logs REMOVED from the list
altlinux-freedesktop-menu-0.70-alt2
auditd-plugin-clickhouse-lite-0.1.9-alt3
bore-0.6.0-alt2
fonts-ttf-IosevkaCurly-34.8.1-alt1
fonts-ttf-IosevkaTermSlab-34.8.1-alt1
gem-github-markup-4.0.0-alt1
gz-gui-10.0.0-alt3
json-0:20080425-alt7_2jpp6
libgupnp-igd-1.6.0-alt1
mysql-workbench-community-8.0.47-alt8
perl-HTML-Widget-1.11-alt3
python3-module-chess-1.11.2-alt1
python3-module-fabio-2025.10.0-alt1
python3-module-oscrypto-1.3.0-alt1.1
vector-0.58.0-alt1

Total 337 error logs.


^ permalink raw reply	[flat|nested] only message in thread

only message in thread, other threads:[~2026-10-02  7:46 UTC | newest]

Thread overview: (only message) (download: mbox.gz / follow: Atom feed)
-- links below jump to the message on this page --
2026-10-02  7:46 [cyber] I: Sisyphus-20261002 x86_64 beehive_status: +10 -15 (337) ALT beekeeper

ALT Linux Sisyphus cybertalk

This inbox may be cloned and mirrored by anyone:

	git clone --mirror http://lore.altlinux.org/sisyphus-cybertalk/0 sisyphus-cybertalk/git/0.git

	# If you have public-inbox 1.1+ installed, you may
	# initialize and index your mirror using the following commands:
	public-inbox-init -V2 sisyphus-cybertalk sisyphus-cybertalk/ http://lore.altlinux.org/sisyphus-cybertalk \
		sisyphus-cybertalk@lists.altlinux.org sisyphus-cybertalk@lists.altlinux.ru sisyphus-cybertalk@lists.altlinux.com
	public-inbox-index sisyphus-cybertalk

Example config snippet for mirrors.
Newsgroup available over NNTP:
	nntp://lore.altlinux.org/org.altlinux.lists.sisyphus-cybertalk


AGPL code for this site: git clone https://public-inbox.org/public-inbox.git