ALT Linux Sisyphus cybertalk
 help / color / mirror / Atom feed
* [cyber] I: Sisyphus-20261001 x86_64 beehive_status: +18 -14 (342)
@ 2026-10-01  7:39 ALT beekeeper
  0 siblings, 0 replies; only message in thread
From: ALT beekeeper @ 2026-10-01  7:39 UTC (permalink / raw)
  To: sisyphus-cybertalk

	18 NEW error logs

altlinux-freedesktop-menu-0.70-alt2
	+ for i in desktop-directories/*.directory
	++ basename desktop-directories/altlinux-xfce.directory
	+ j=altlinux-xfce.directory
	+ grep altlinux-xfce.directory ignore.list
	+ rm ignore.list
	+ '[' 0 -gt 0 ']'
	+ exit 1
	error: Bad exit status from /usr/src/tmp/rpmb-tmp.n5Kizf (%check)
	RPM build errors:
	Bad exit status from /usr/src/tmp/rpmb-tmp.n5Kizf (%check)

auditd-plugin-clickhouse-lite-0.1.9-alt3
	ok 3 auditd-plugin-clickhouse min-threads timeout
	0% tests passed, 1 tests failed out of 1
	Total Test time (real) = 1500.12 sec
	The following tests FAILED:
	1 - main_test (Timeout)

bore-0.6.0-alt2
	test basic_proxy::secret_3 ... ok
	test basic_proxy::secret_2 ... FAILED
	test mismatched_secret::case_2 ... ok
	--
	-------------- TEST START --------------
	Error: could not connect to localhost:7835
	Caused by:
	--
	basic_proxy::secret_2
	test result: FAILED. 8 passed; 1 failed; 0 ignored; 0 measured; 0 filtered out; finished
	in 0.42s
	error: test failed, to rerun pass `--test e2e_test`
	Doc-tests bore_cli
	--
	test result: ok. 1 passed; 0 failed; 0 ignored; 0 measured; 0 filtered out; finished
	in 0.14s
	error: 1 target failed:
	`--test e2e_test`

fonts-ttf-Iosevka-34.8.1-alt1
	[ACTION] Create TTF 'dist/Iosevka/TTF-Unhinted/Iosevka-HeavyItalic.ttf'
	[ACTION] Create TTF 'dist/Iosevka/TTF-Unhinted/Iosevka-ExtendedHeavyItalic.ttf'
	[ACTION] Create TTF 'dist/Iosevka/TTF-Unhinted/Iosevka-Thin.ttf'
	[ACTION] Create TTF 'dist/Iosevka/TTF-Unhinted/Iosevka-ExtendedThin.ttf'
	[ACTION] Create TTF 'dist/Iosevka/TTF-Unhinted/Iosevka-ThinOblique.ttf'
	[ACTION] Create TTF 'dist/Iosevka/TTF-Unhinted/Iosevka-ExtendedThinOblique.ttf'
	/usr/src/tmp/rpmb-tmp.jjPHCp: line 134: 86351 CPU time limit exceeded npm run build --
	ttf::Iosevka
	error: Bad exit status from /usr/src/tmp/rpmb-tmp.jjPHCp (%build)
	RPM build errors:
	Bad exit status from /usr/src/tmp/rpmb-tmp.jjPHCp (%build)

fonts-ttf-IosevkaSlab-34.8.1-alt1
	[ACTION] Create TTF 'dist/IosevkaSlab/TTF-Unhinted/IosevkaSlab-HeavyItalic.ttf'
	[ACTION] Create TTF 'dist/IosevkaSlab/TTF-Unhinted/IosevkaSlab-ExtendedHeavyItalic.ttf'
	[ACTION] Create TTF 'dist/IosevkaSlab/TTF-Unhinted/IosevkaSlab-Thin.ttf'
	[ACTION] Create TTF 'dist/IosevkaSlab/TTF-Unhinted/IosevkaSlab-ExtendedThin.ttf'
	[ACTION] Create TTF 'dist/IosevkaSlab/TTF-Unhinted/IosevkaSlab-ThinOblique.ttf'
	[ACTION] Create TTF 'dist/IosevkaSlab/TTF-Unhinted/IosevkaSlab-ExtendedThinOblique.ttf'
	/usr/src/tmp/rpmb-tmp.ykXzww: line 134: 2474810 CPU time limit exceeded npm run build
	-- ttf::IosevkaSlab
	error: Bad exit status from /usr/src/tmp/rpmb-tmp.ykXzww (%build)
	RPM build errors:
	Bad exit status from /usr/src/tmp/rpmb-tmp.ykXzww (%build)

fonts-ttf-IosevkaTermSlab-34.8.1-alt1
	[ACTION] Create TTF 'dist/IosevkaSlab/TTF-Unhinted/IosevkaSlab-Thin.ttf'
	[ACTION] Create TTF 'dist/IosevkaSlab/TTF-Unhinted/IosevkaSlab-ExtendedThin.ttf'
	[ACTION] Create TTF 'dist/IosevkaSlab/TTF-Unhinted/IosevkaSlab-ThinOblique.ttf'
	[ACTION] Create TTF 'dist/IosevkaSlab/TTF-Unhinted/IosevkaSlab-ExtendedThinOblique.ttf'
	[ACTION] Hint TTF 'dist/IosevkaSlab/TTF/IosevkaSlab-ExtendedLight.ttf' <-
	'dist/IosevkaSlab/TTF-Unhinted/IosevkaSlab-ExtendedLight.ttf'
	[ACTION] Hint TTF 'dist/IosevkaTermSlab/TTF/IosevkaTermSlab-ExtendedLight.ttf'
	/usr/src/tmp/rpmb-tmp.52mo1l: line 134: 1694079 CPU time limit exceeded npm run build
	-- ttf::IosevkaTermSlab
	error: Bad exit status from /usr/src/tmp/rpmb-tmp.52mo1l (%build)
	RPM build errors:
	Bad exit status from /usr/src/tmp/rpmb-tmp.52mo1l (%build)

gz-rendering-10.0.2-alt1
	126/126 Test #126: check_UNIT_WireBox_TEST_ogre2_gl3plus .................   Passed
	0.01 sec
	98% tests passed, 2 tests failed out of 126
	Total Test time (real) =  26.59 sec
	The following tests FAILED:
	43 - REGRESSION_reload_engine_ogre2_gl3plus (SEGFAULT)

libgupnp-igd-1.6.0-alt1
	Bail out!
	1/1 gupnp-igd:gupnp-simple-igd FAIL	       7.89s   killed by signal 6 SIGABRT
	Summary of Failures:
	1/1 gupnp-igd:gupnp-simple-igd FAIL	       7.89s   killed by signal 6 SIGABRT
	Ok:		   0
	Fail:		   1
	Full log written to
	/usr/src/RPM/BUILD/gupnp-igd-1.6.0/x86_64-alt-linux/meson-logs/testlog.txt
	error: Bad exit status from /usr/src/tmp/rpmb-tmp.AJkFdq (%check)
	RPM build errors:
	Bad exit status from /usr/src/tmp/rpmb-tmp.AJkFdq (%check)

perl-HTML-Widget-1.11-alt3
	Compilation failed in require at t/filter_uppercase.t line 6.
	BEGIN failed--compilation aborted at t/filter_uppercase.t line 6.
	# Looks like your test exited with 2 before it could output anything.
	--
	Compilation failed in require at t/filter_whitespace.t line 6.
	BEGIN failed--compilation aborted at t/filter_whitespace.t line 6.
	# Looks like your test exited with 20 before it could output anything.
	--
	Compilation failed in require at t/get_constraints.t line 6.
	BEGIN failed--compilation aborted at t/get_constraints.t line 6.
	# Looks like your test exited with 2 before it could output anything.
	--
	Compilation failed in require at t/get_element.t line 6.
	BEGIN failed--compilation aborted at t/get_element.t line 6.
	# Looks like your test exited with 2 before it could output anything.
	--
	Compilation failed in require at t/get_elements.t line 6.
	BEGIN failed--compilation aborted at t/get_elements.t line 6.
	# Looks like your test exited with 2 before it could output anything.
	--
	Result: FAIL
	Failed 43/90 test programs. 0/280 subtests failed.
	make: *** [Makefile:834: test_dynamic] Error 255

python3-module-fabio-2025.10.0-alt1
	+ cd /usr/src/RPM/BUILD
	+ cd python3-module-fabio-2025.10.0
	+ env
	PYTHONPATH=/usr/src/tmp/python3-module-fabio-buildroot/usr/lib64/python3/site-packages
	python3 run_tests.py --installed
	WARNING:py.warnings:/usr/lib64/python3/site-packages/h5py/__init__.py:36: UserWarning:
	h5py is running against HDF5 2.2.0 when it was built against 2.1.1, this may cause problems
	_warn(("h5py is running against HDF5 {0} when it was built against {1}, "
	WARNING:run_tests:Test fabio 2025.10.0 from
	/usr/src/tmp/python3-module-fabio-buildroot/usr/lib64/python3/site-packages/fabio
	.........................................................sssssssssssssssssss...............................s........ssssssssss.........sssssssssss.....s..................sss....ssssssssssssssssssssss...sss...sssssss...ss.ssssss.sssssssssssssssssssssssssss...sssss/usr/src/tmp/rpmb-tmp.4qV6TD:
	line 138: 2918282 Illegal instruction	  env
	PYTHONPATH=/usr/src/tmp/python3-module-fabio-buildroot/usr/lib64/python3/site-packages
	python3 run_tests.py --installed
	error: Bad exit status from /usr/src/tmp/rpmb-tmp.4qV6TD (%check)
	RPM build errors:
	Bad exit status from /usr/src/tmp/rpmb-tmp.4qV6TD (%check)

python3-module-paho-2.1.0-alt2
	"on_disconnect",
	E	    AssertionError: assert ['on_connect'..._unsubscribe'] ==
	['on_connect'...n_disconnect']
	E
	--
	"on_disconnect",
	E	    AssertionError: assert ['on_connect'..._unsubscribe'] ==
	['on_connect'...n_disconnect']
	E
	--
	=========================== short test summary info ============================
	FAILED tests/test_client.py::TestCompatibility::test_callback_v1_mqtt3[tcp]
	FAILED tests/test_client.py::TestCompatibility::test_callback_v2_mqtt3[unix]
	ERROR tests/lib/test_03_publish_helper_qos0_v5.py::test_03_publish_helper_qos0_v5
	ERROR
	tests/lib/test_03_publish_helper_qos1_disconnect.py::test_03_publish_helper_qos1_disconnect
	======= 2 failed, 134 passed, 26 skipped, 1 xfailed, 2 errors in 37.62s ========
	INFO	 : Command's result: FAILURE
	INFO	 : Command's error: Command '['python3', '-m', 'pytest', '-o', 'addopts=',
	'tests']' returned non-zero exit status 1.
	error: Bad exit status from /usr/src/tmp/rpmb-tmp.soH9wJ (%check)

python3-module-python-lsp-server-1.15.0-alt1
	stream.write(msg + self.terminator)
	ValueError: I/O operation on closed file.
	Call stack:
	--
	stream.write(msg + self.terminator)
	ValueError: I/O operation on closed file.
	Call stack:
	--
	stream.write(msg + self.terminator)
	ValueError: I/O operation on closed file.
	Call stack:
	--
	stream.write(msg + self.terminator)
	ValueError: I/O operation on closed file.
	Call stack:
	--
	stream.write(msg + self.terminator)
	ValueError: I/O operation on closed file.
	Call stack:
	--
	INFO	 : Command's result: FAILURE
	INFO	 : Command's error: Command '['python3', '-m',
	'pytest', '-ra', '-o=addopts=-Wignore', 'test', '--deselect',
	'test/plugins/test_completion.py::test_jedi_completion_environment', '--deselect',
	'test/plugins/test_symbols.py::test_symbols_all_scopes_with_jedi_environment']' returned
	non-zero exit status 1.
	error: Bad exit status from /usr/src/tmp/rpmb-tmp.kh4Avr (%check)

python3-module-qtconsole-5.7.2-alt1.1
	INFO	 : Running command: ['xvfb-run', '-s', '-nolisten local', 'pytest', '-v',
	'qtconsole', '--ignore', 'qtconsole/tests/test_inprocess_kernel.py']
	_XSERVTransmkdir: ERROR: euid != 0,directory /tmp/.X11-unix will not be created.
	============================= test session starts ==============================
	--
	qtconsole/tests/test_00_console_widget.py::test_scroll[False] PASSED	 [  4%]
	qtconsole/tests/test_00_console_widget.py::test_input FAILED		 [  6%]
	qtconsole/tests/test_00_console_widget.py::test_debug PASSED		 [  8%]
	--
	timeout=SHELL_TIMEOUT)
	E	pytestqt.exceptions.TimeoutError: waitUntil timed out in 20000 milliseconds
	qtconsole/tests/test_00_console_widget.py:153: TimeoutError
	--
	=========================== short test summary info ============================
	FAILED qtconsole/tests/test_00_console_widget.py::test_input - pytestqt.excep...
	============= 1 failed, 46 passed, 1 skipped in 222.91s (0:03:42) ==============
	INFO	 : Command's result: FAILURE
	INFO	 : Command's error: Command '['xvfb-run', '-s', '-nolisten local', 'pytest',
	'-v', 'qtconsole', '--ignore', 'qtconsole/tests/test_inprocess_kernel.py']' returned
	non-zero exit status 1.
	error: Bad exit status from /usr/src/tmp/rpmb-tmp.6hdgzX (%check)

python3-module-zict-3.0.0-alt1
	File "/usr/src/RPM/BUILD/python3-module-zict-3.0.0/zict/tests/utils_test.py", line 193,
	in check_different_keys_threadsafe
	f1.result()
	File "/usr/lib64/python3.14/concurrent/futures/_base.py", line 449, in result
	self._condition.wait(timeout)
	File "/usr/lib64/python3.14/threading.py", line 370, in wait
	waiter.acquire()
	+++++++++++++++++++++++++++++++++++ Timeout ++++++++++++++++++++++++++++++++++++
	error: Bad exit status from /usr/src/tmp/rpmb-tmp.u1qDbL (%check)
	RPM build errors:
	Bad exit status from /usr/src/tmp/rpmb-tmp.u1qDbL (%check)

savedesktop-4.1-alt1
	Full log written to
	/usr/src/RPM/BUILD/savedesktop-4.1/noarch-alt-linux/meson-logs/testlog.txt
	FAILED: [code=1] meson-internal__test
	/usr/bin/meson test --no-rebuild --print-errorlogs

stockfish-18-alt1
	+ umask 022
	+ /bin/mkdir -p /usr/src/RPM/BUILD
	+ cd /usr/src/RPM/BUILD
	+ cd stockfish-18
	+ ./src/stockfish bench
	Stockfish 18 by the Stockfish developers (see AUTHORS file)
	/usr/src/tmp/rpmb-tmp.8VlT3J: line 137: 3025219 Segmentation fault	./src/stockfish
	bench
	error: Bad exit status from /usr/src/tmp/rpmb-tmp.8VlT3J (%check)
	RPM build errors:
	Bad exit status from /usr/src/tmp/rpmb-tmp.8VlT3J (%check)

tbb-2023.1.0-alt1
	143/143 Test #143: test_malloc_new_handler ..................	Passed	  0.01 sec
	99% tests passed, 1 tests failed out of 143
	Total Test time (real) =  86.19 sec
	The following tests FAILED:
	131 - test_malloc_pools (SEGFAULT)

vector-0.58.0-alt1
	Compiling vector-lib v0.1.0 (/usr/src/RPM/BUILD/vector-0.58.0/lib/vector-lib)
	hasher-privd: parent: handle_io: idle time limit (3600 seconds) exceeded

	14 error logs REMOVED from the list
binwalk3-3.1.0-alt1
bpftrace-0.27.0-alt1
gem-librarianp-1.1.2-alt1
gem-minitest-bonus-assertions-3.0.2-alt1
gem-nokogiri-1.18.9-alt1
gnucash-5.16-alt1
greetd-tuigreet-0.11.1-alt2
gz-sim-10.5.0-alt1
lightdm-1.32.0-alt15
python3-module-crosshair-tool-0.0.110-alt1
python3-module-haversine-2.9.0-alt1
python3-module-trimesh-4.11.0-alt1
wine-1:11.7.1-alt1
wine-vanilla-1:11.12-alt1

Total 342 error logs.


^ permalink raw reply	[flat|nested] only message in thread

only message in thread, other threads:[~2026-10-01  7:39 UTC | newest]

Thread overview: (only message) (download: mbox.gz / follow: Atom feed)
-- links below jump to the message on this page --
2026-10-01  7:39 [cyber] I: Sisyphus-20261001 x86_64 beehive_status: +18 -14 (342) ALT beekeeper

ALT Linux Sisyphus cybertalk

This inbox may be cloned and mirrored by anyone:

	git clone --mirror http://lore.altlinux.org/sisyphus-cybertalk/0 sisyphus-cybertalk/git/0.git

	# If you have public-inbox 1.1+ installed, you may
	# initialize and index your mirror using the following commands:
	public-inbox-init -V2 sisyphus-cybertalk sisyphus-cybertalk/ http://lore.altlinux.org/sisyphus-cybertalk \
		sisyphus-cybertalk@lists.altlinux.org sisyphus-cybertalk@lists.altlinux.ru sisyphus-cybertalk@lists.altlinux.com
	public-inbox-index sisyphus-cybertalk

Example config snippet for mirrors.
Newsgroup available over NNTP:
	nntp://lore.altlinux.org/org.altlinux.lists.sisyphus-cybertalk


AGPL code for this site: git clone https://public-inbox.org/public-inbox.git