ALT Linux Sisyphus cybertalk
 help / color / mirror / Atom feed
* [cyber] I: Sisyphus-20260918 x86_64 beehive_status: +21 -17 (368)
@ 2026-09-18  4:24 ALT beekeeper
  0 siblings, 0 replies; only message in thread
From: ALT beekeeper @ 2026-09-18  4:24 UTC (permalink / raw)
  To: sisyphus-cybertalk

[-- Warning: decoded text below may be mangled, UTF-8 assumed --]
[-- Attachment #1: Type: text/plain; charset=unknown-8bit, Size: 9839 bytes --]

	21 NEW error logs

counters-1.0.4-alt1
	[11/12] Generating src/typescript-compile with a custom command
	FAILED: [code=2] src/tsc-output
	/usr/bin/tsc --strict --outDir src

decibels-49.6.1-alt1
	[59/60] Generating src/typescript-compile with a custom command
	FAILED: [code=2] src/application.js src/drag-overlay.js src/empty.js src/error.js
	src/header.js src/main.js src/mpris.js src/playback-rate-button.js src/player.js
	src/stream.js src/volume-button.js src/waveform-bar-chart.js src/waveform-generator.js
	src/waveform-scale.js src/window.js
	/usr/bin/tsc --project ../tsconfig.json --outDir src

fonts-ttf-IosevkaTermCurlySlab-34.8.1-alt1
	[ACTION] Create TTF 'dist/IosevkaCurlySlab/TTF-Unhinted/IosevkaCurlySlab-Thin.ttf'
	[ACTION] Create TTF 'dist/IosevkaCurlySlab/TTF-Unhinted/IosevkaCurlySlab-ExtendedThin.ttf'
	[ACTION] Create TTF 'dist/IosevkaCurlySlab/TTF-Unhinted/IosevkaCurlySlab-ThinOblique.ttf'
	[ACTION] Create TTF
	'dist/IosevkaCurlySlab/TTF-Unhinted/IosevkaCurlySlab-ExtendedThinOblique.ttf'
	[ACTION] Hint TTF 'dist/IosevkaCurlySlab/TTF/IosevkaCurlySlab-ExtendedHeavy.ttf' <-
	'dist/IosevkaCurlySlab/TTF-Unhinted/IosevkaCurlySlab-ExtendedHeavy.ttf'
	[ACTION] Hint TTF 'dist/IosevkaTermCurlySlab/TTF/IosevkaTermCurlySlab-ExtendedHeavy.ttf'
	/usr/src/tmp/rpmb-tmp.yQObR5: line 134: 1285925 CPU time limit exceeded npm run build
	-- ttf::IosevkaTermCurlySlab
	error: Bad exit status from /usr/src/tmp/rpmb-tmp.yQObR5 (%build)
	RPM build errors:
	Bad exit status from /usr/src/tmp/rpmb-tmp.yQObR5 (%build)

gambit-4.9.7-alt5
	make[4]: Leaving directory '/usr/src/RPM/BUILD/gambit-4.9.7/lib/_irregex'
	make[4]: Entering directory '/usr/src/RPM/BUILD/gambit-4.9.7/lib'
	LD_LIBRARY_PATH=../lib:../gsi:../gsc:
	../gsc/gsc -:~~bin=../bin,~~lib=../lib,~~include=../include -f -target js  -prelude
	"(define-cond-expand-feature|enable-type-checking|)(define-cond-expand-feature|disable-auto-forcing|)(define-cond-expand-feature|enable-sharp-dot|)(define-cond-expand-feature|enable-bignum|)(define-cond-expand-feature|enable-ratnum|)(define-cond-expand-feature|enable-cpxnum|)(define-cond-expand-feature|enable-s8vector|)(define-cond-expand-feature|enable-u16vector|)(define-cond-expand-feature|enable-s16vector|)(define-cond-expand-feature|enable-u32vector|)(define-cond-expand-feature|enable-s32vector|)(define-cond-expand-feature|enable-u64vector|)(define-cond-expand-feature|enable-s64vector|)(define-cond-expand-feature|enable-f32vector|)(define-cond-expand-feature|disable-smp|)(##include\"../lib/header.scm\")"
	-label-namespace "" -c -o _gambit.js ../lib/_univlib.scm
	make[4]: Leaving directory '/usr/src/RPM/BUILD/gambit-4.9.7/lib'
	make[2]: *** [makefile:546: modules-recursive] Error 2
	make[1]: *** [makefile:373: modules] Error 2
	make: *** [makefile:107: all] Error 2
	error: Bad exit status from /usr/src/tmp/rpmb-tmp.Q3byrp (%build)
	RPM build errors:
	Bad exit status from /usr/src/tmp/rpmb-tmp.Q3byrp (%build)

gnome-sound-recorder-43-alt0.7.beta
	[67/68] Generating src/typescript-compile with a custom command
	FAILED: [code=2] src/tsc-output
	/usr/bin/tsc --outDir
	/usr/src/RPM/BUILD/gnome-sound-recorder-43.beta/noarch-alt-linux/tsc-out

gnome-weather-50.0-alt1
	[89/91] Generating src/typescript-compile with a custom command
	FAILED: [code=2] src/tsc-output
	/usr/bin/tsc --project ../tsconfig.json --outDir
	/usr/src/RPM/BUILD/gnome-weather-50.0/noarch-alt-linux/tsc-out

gz-gui-10.0.0-alt3
	54/54 Test #54: check_INTEGRATION_transport_scene_manager ...	Passed	  0.01 sec
	98% tests passed, 1 tests failed out of 54
	Total Test time (real) = 172.66 sec
	The following tests FAILED:
	27 - UNIT_Publisher_TEST (Subprocess aborted)

gz-rendering-10.0.2-alt1
	126/126 Test #126: check_UNIT_WireBox_TEST_ogre2_gl3plus .................   Passed
	0.01 sec
	98% tests passed, 2 tests failed out of 126
	Total Test time (real) =  31.78 sec
	The following tests FAILED:
	19 - INTEGRATION_lidar_visual_ogre2_gl3plus (SEGFAULT)

ignition-adw-2.1.2-alt1
	[17/18] Generating src/typescript-compile with a custom command
	FAILED: [code=2] src/tsc-output
	/usr/bin/tsc -p /usr/src/RPM/BUILD/ignition-adw-2.1.2/tsconfig.json --outDir
	/usr/src/RPM/BUILD/ignition-adw-2.1.2/noarch-alt-linux/tsc-out

libgupnp-igd-1.6.0-alt1
	Bail out!
	1/1 gupnp-igd:gupnp-simple-igd FAIL	       7.97s   killed by signal 6 SIGABRT
	Summary of Failures:
	1/1 gupnp-igd:gupnp-simple-igd FAIL	       7.97s   killed by signal 6 SIGABRT
	Ok:		   0
	Fail:		   1
	Full log written to
	/usr/src/RPM/BUILD/gupnp-igd-1.6.0/x86_64-alt-linux/meson-logs/testlog.txt
	error: Bad exit status from /usr/src/tmp/rpmb-tmp.glRZ5g (%check)
	RPM build errors:
	Bad exit status from /usr/src/tmp/rpmb-tmp.glRZ5g (%check)

lightdm-webkit2-greeter-3.5.2-alt1.3
	✔ Dist directory created at /usr/src/RPM/BUILD/lightdm-webkit2-greeter-3.5.2/build/dist
	✔ Dist files copied
	✔ Config copied
	themes/themes/gruvbox/tsconfig.json(47,25): error TS5107: Option 'moduleResolution=node10'
	is deprecated and will stop functioning in TypeScript 7.0. Specify compilerOption
	'"ignoreDeprecations": "6.0"' to silence this error.
	Visit https://aka.ms/ts6 for migration information.
	make: *** [Makefile:121:
	/usr/src/RPM/BUILD/lightdm-webkit2-greeter-3.5.2/themes/themes/gruvbox/js] Error 1
	make: Leaving directory '/usr/src/RPM/BUILD/lightdm-webkit2-greeter-3.5.2'
	error: Bad exit status from /usr/src/tmp/rpmb-tmp.ttkaG9 (%build)
	RPM build errors:
	Bad exit status from /usr/src/tmp/rpmb-tmp.ttkaG9 (%build)

lomiri-ui-extras-0.8.2-alt1
	17/17 Test #17: tst_printerdevicemodel ..............	Passed	  0.02 sec
	94% tests passed, 1 tests failed out of 17
	Total Test time (real) =  27.82 sec
	The following tests FAILED:
	2 - tst_BusyIndicator (Failed)

perl-Net-SIP-0.840-alt1
	# received=13 lost=0 expect ca. 467.5 packets, events='1 2 D # 3 4 B *'
	#   Failed test 'UAS RTP ok'
	#   at t/19_call_with_dtmf.t line 151.
	--
	t/19_call_with_dtmf.t		      (Wstat: 256 (exited 1) Tests: 216 Failed: 1)
	Failed test:  106
	Non-zero exit status: 1
	--
	Result: FAIL
	Failed 1/26 test programs. 1/2000 subtests failed.
	make: *** [Makefile:829: test_dynamic] Error 255

perl-Sane-0.05-alt3.2
	t/enums.t ......... ok
	hasher-privd: parent: handle_io: idle time limit (3600 seconds) exceeded

perl-Server-Starter-0.35-alt1.1
	received TERM, sending TERM to all workers:211656
	hasher-privd: parent: handle_io: idle time limit (3600 seconds) exceeded

perl-Starlet-0.31-alt1_22
	t/11multi-sockets.t ........ ok
	#   Failed test 'No warnings'
	#   at t/12bad_request_line.t line 24.
	--
	t/12bad_request_line.t	 (Wstat: 256 (exited 1) Tests: 2 Failed: 1)
	Failed test:  2
	Non-zero exit status: 1
	--
	Result: FAIL
	Failed 1/15 test programs. 1/146 subtests failed.
	make: *** [Makefile:753: test_dynamic] Error 255

perl-Tie-DBI-1.08-alt1
	Result: FAIL
	Failed 1/2 test programs. 0/46 subtests failed.
	make: *** [Makefile:781: test_dynamic] Error 255

python3-module-filelock-3.25.2-alt1.1
	>	    raise RuntimeError(msg)
	E	    RuntimeError: Cannot acquire write lock on
	/usr/src/tmp/pytest-of-builder/pytest-0/test_release_force0/test_lock.db (lock id:
	140467796750992) from thread 140467710719680 while it is held by thread 140467787204288
	.run_venv/lib64/python3/site-packages/filelock/_read_write.py:183: RuntimeError
	--
	SKIPPED [20] tests/test_filelock.py:108: Windows only
	FAILED tests/test_async_read_write.py::test_release_force - RuntimeError: Can...
	============ 1 failed, 353 passed, 20 skipped, 6 warnings in 49.72s ============
	INFO	 : Command's result: FAILURE
	INFO	 : Command's error: Command '['python3', '-m', 'pytest', '-vra', 'tests']'
	returned non-zero exit status 1.
	error: Bad exit status from /usr/src/tmp/rpmb-tmp.TJaFWg (%check)

python3-module-mdp-3.6.0.15.g64f14eee-alt7
	>	assert_array_almost_equal(abs(unsfa.sf), abs(sfa.sf), decimal-6)
	E	AssertionError:
	E	Arrays are not almost equal to 1 decimals
	--
	=========================== short test summary info ============================
	FAILED mdp/test/test_VartimeSFANode.py::test_VartimeSFANode1 - AssertionError:
	============ 1 failed, 730 passed, 26 skipped, 3 warnings in 26.78s ============

python3-module-paho-2.1.0-alt2
	"on_disconnect",
	E	    AssertionError: assert ['on_connect'..._unsubscribe'] ==
	['on_connect'...n_disconnect']
	E
	--
	=========================== short test summary info ============================
	FAILED tests/test_client.py::TestCompatibility::test_callback_v2_mqtt3[tcp]
	ERROR tests/lib/test_01_unpwd_empty_password_set.py::test_01_unpwd_empty_password_set
	ERROR tests/lib/test_01_unpwd_set.py::test_01_unpwd_set - RuntimeError: Clien...
	ERROR tests/lib/test_03_publish_helper_qos0_v5.py::test_03_publish_helper_qos0_v5
	ERROR
	tests/lib/test_03_publish_helper_qos1_disconnect.py::test_03_publish_helper_qos1_disconnect
	======= 1 failed, 135 passed, 26 skipped, 1 xfailed, 4 errors in 34.76s ========
	INFO	 : Command's result: FAILURE
	INFO	 : Command's error: Command '['python3', '-m', 'pytest', '-o', 'addopts=',
	'tests']' returned non-zero exit status 1.
	error: Bad exit status from /usr/src/tmp/rpmb-tmp.k6sOGW (%check)

rng-tools-6.17-alt1.1
	PASS: rngtestzero.sh
	FAIL: rngtestjitter.sh
	Testsuite summary for rng-tools 6.17
	--
	# SKIP:  0
	# XFAIL: 0
	# FAIL:  1
	# XPASS: 0
	# ERROR: 0
	See tests/test-suite.log

	17 error logs REMOVED from the list
casr-2.13.1-alt2
erlang-proper-1.5.0-alt1
fonts-ttf-Iosevka-34.8.1-alt1
gz-sim-10.5.0-alt1
jss-5.8.0-alt1
kopia-0.23.1-alt1
libltc-1.3.2-alt1
libpjsip-2.17-alt1
postgresql18-18.6-alt1
python3-module-crosshair-tool-0.0.110-alt1
python3-module-fabio-2025.10.0-alt1
python3-module-ollmcp-0.30.0-alt1
python3-module-pytest-xprocess-1.0.2-alt1.1
python3-module-trimesh-4.11.0-alt1
shader-slang-2026.13.1-alt1
stockfish-18-alt1
wiredpanda-5.2.2-alt1

Total 368 error logs.


^ permalink raw reply	[flat|nested] only message in thread

only message in thread, other threads:[~2026-09-18  4:24 UTC | newest]

Thread overview: (only message) (download: mbox.gz / follow: Atom feed)
-- links below jump to the message on this page --
2026-09-18  4:24 [cyber] I: Sisyphus-20260918 x86_64 beehive_status: +21 -17 (368) ALT beekeeper

ALT Linux Sisyphus cybertalk

This inbox may be cloned and mirrored by anyone:

	git clone --mirror http://lore.altlinux.org/sisyphus-cybertalk/0 sisyphus-cybertalk/git/0.git

	# If you have public-inbox 1.1+ installed, you may
	# initialize and index your mirror using the following commands:
	public-inbox-init -V2 sisyphus-cybertalk sisyphus-cybertalk/ http://lore.altlinux.org/sisyphus-cybertalk \
		sisyphus-cybertalk@lists.altlinux.org sisyphus-cybertalk@lists.altlinux.ru sisyphus-cybertalk@lists.altlinux.com
	public-inbox-index sisyphus-cybertalk

Example config snippet for mirrors.
Newsgroup available over NNTP:
	nntp://lore.altlinux.org/org.altlinux.lists.sisyphus-cybertalk


AGPL code for this site: git clone https://public-inbox.org/public-inbox.git