ALT Linux Sisyphus cybertalk
 help / color / mirror / Atom feed
* [cyber] I: Sisyphus-20260917 x86_64 beehive_status: +14 -10 (364)
@ 2026-09-17  7:40 ALT beekeeper
  0 siblings, 0 replies; only message in thread
From: ALT beekeeper @ 2026-09-17  7:40 UTC (permalink / raw)
  To: sisyphus-cybertalk

	14 NEW error logs

casr-2.13.1-alt2
	test test_safe_func32 ... ignored
	test test_casr_ubsan ... FAILED
	test test_casr_lua ... ok
	--
	thread 'test_casr_ubsan' (1148563) panicked at casr/tests/tests.rs:3961:43:
	called `Result::unwrap()` on an `Err` value: Os { code: 2, kind: NotFound, message:
	"No such file or directory" }
	note: run with `RUST_BACKTRACE=1` environment variable to display a backtrace
	--
	test_casr_ubsan
	test result: FAILED. 22 passed; 1 failed; 4 ignored; 0 measured; 76 filtered out;
	finished in 76.93s
	error: test failed, to rerun pass `-p casr --test tests`
	Running unittests src/lib.rs (target/release/deps/libcasr-cd0206c960f194c9)
	--
	test result: ok. 0 passed; 0 failed; 0 ignored; 0 measured; 0 filtered out; finished
	in 0.00s
	error: 1 target failed:
	`-p casr --test tests`

erlang-proper-1.5.0-alt1
	1) exists_tests:exists_test/0
	^[[0;31m     Failure/Error: ?assert(proper : quickcheck ( prop_exists ( ) , ? PROPER_OPTIONS
	))
	expected: true

fonts-ttf-IosevkaCurly-34.8.1-alt1
	[ACTION] Create TTF 'dist/IosevkaCurly/TTF-Unhinted/IosevkaCurly-HeavyItalic.ttf'
	[ACTION] Create TTF 'dist/IosevkaCurly/TTF-Unhinted/IosevkaCurly-ExtendedHeavyItalic.ttf'
	[ACTION] Create TTF 'dist/IosevkaCurly/TTF-Unhinted/IosevkaCurly-Thin.ttf'
	[ACTION] Create TTF 'dist/IosevkaCurly/TTF-Unhinted/IosevkaCurly-ExtendedThin.ttf'
	[ACTION] Create TTF 'dist/IosevkaCurly/TTF-Unhinted/IosevkaCurly-ThinOblique.ttf'
	[ACTION] Create TTF 'dist/IosevkaCurly/TTF-Unhinted/IosevkaCurly-ExtendedThinOblique.ttf'
	/usr/src/tmp/rpmb-tmp.Y3jfFs: line 134: 3802840 CPU time limit exceeded npm run build
	-- ttf::IosevkaCurly
	error: Bad exit status from /usr/src/tmp/rpmb-tmp.Y3jfFs (%build)
	RPM build errors:
	Bad exit status from /usr/src/tmp/rpmb-tmp.Y3jfFs (%build)

fonts-ttf-IosevkaTermSlab-34.8.1-alt1
	[ACTION] Hint TTF 'dist/IosevkaTermSlab/TTF/IosevkaTermSlab-ExtendedBold.ttf'
	[ACTION] Hint TTF 'dist/IosevkaSlab/TTF/IosevkaSlab-HeavyItalic.ttf' <-
	'dist/IosevkaSlab/TTF-Unhinted/IosevkaSlab-HeavyItalic.ttf'
	[ACTION] Hint TTF 'dist/IosevkaTermSlab/TTF/IosevkaTermSlab-Bold.ttf'
	[ACTION] Hint TTF 'dist/IosevkaSlab/TTF/IosevkaSlab-ExtendedSemiBoldOblique.ttf' <-
	'dist/IosevkaSlab/TTF-Unhinted/IosevkaSlab-ExtendedSemiBoldOblique.ttf'
	[ACTION] Hint TTF 'dist/IosevkaSlab/TTF/IosevkaSlab-ExtendedLightOblique.ttf' <-
	'dist/IosevkaSlab/TTF-Unhinted/IosevkaSlab-ExtendedLightOblique.ttf'
	[ACTION] Hint TTF 'dist/IosevkaSlab/TTF/IosevkaSlab-ExtraLightOblique.ttf' <-
	'dist/IosevkaSlab/TTF-Unhinted/IosevkaSlab-ExtraLightOblique.ttf'
	/usr/src/tmp/rpmb-tmp.V6uZaE: line 134: 600010 CPU time limit exceeded npm run build --
	ttf::IosevkaTermSlab
	error: Bad exit status from /usr/src/tmp/rpmb-tmp.V6uZaE (%build)
	RPM build errors:
	Bad exit status from /usr/src/tmp/rpmb-tmp.V6uZaE (%build)

kernel-modules-drbd9-talos-1:9.3.3-alt1.397873.1
	kernel-headers-modules-talos is already the newest version.
	E: Version ='9.3.3' for 'kernel-source-drbd9' was not found
	hsh-install: Failed to calculate package file list.

kopia-0.23.1-alt1
	ok	github.com/kopia/kopia/tests/tools/fswalker/walker	0.026s
	?	github.com/kopia/kopia/tests/tools/kopiaclient	[no test files]
	ok	github.com/kopia/kopia/tests/tools/kopiarunner	0.017s
	ok	github.com/kopia/kopia/tools/cli2md	0.057s
	?	github.com/kopia/kopia/tools/gettool	[no test files]
	?	github.com/kopia/kopia/tools/gettool/autodownload	[no test files]
	FAIL
	error: Bad exit status from /usr/src/tmp/rpmb-tmp.xFy6hC (%check)
	RPM build errors:
	Bad exit status from /usr/src/tmp/rpmb-tmp.xFy6hC (%check)

libltc-1.3.2-alt1
	ltcloop-ltcloop.o: file not recognized: file format not recognized
	collect2: error: ld returned 1 exit status
	make[2]: *** [Makefile:388: ltcloop] Error 1
	--
	ltcloop-ltcloop.o: file not recognized: file format not recognized
	collect2: error: ld returned 1 exit status
	make[1]: *** [Makefile:388: ltcloop] Error 1

libpjsip-2.17-alt1
	make[1]: *** Waiting for unfinished jobs....
	make[2]: Entering directory '/usr/src/RPM/BUILD/libpjsip-2.17/pjsip-apps/build'
	if test ! -d ../bin; then mkdir -p ../bin; fi
	x86_64-alt-linux-g++ -o ../bin/pjsua-x86_64-alt-linux-gnu \
	output/pjsua-x86_64-alt-linux-gnu/main.o  output/pjsua-x86_64-alt-linux-gnu/pjsua_app.o
	output/pjsua-x86_64-alt-linux-gnu/pjsua_app_cli.o
	output/pjsua-x86_64-alt-linux-gnu/pjsua_app_common.o
	output/pjsua-x86_64-alt-linux-gnu/pjsua_app_config.o
	output/pjsua-x86_64-alt-linux-gnu/pjsua_app_legacy.o
	-L/usr/src/RPM/BUILD/libpjsip-2.17/pjlib/lib
	-L/usr/src/RPM/BUILD/libpjsip-2.17/pjlib-util/lib
	-L/usr/src/RPM/BUILD/libpjsip-2.17/pjnath/lib
	-L/usr/src/RPM/BUILD/libpjsip-2.17/pjmedia/lib -L/usr/src/RPM/BUILD/libpjsip-2.17/pjsip/lib
	-L/usr/src/RPM/BUILD/libpjsip-2.17/third_party/lib		-lpjsua -lpjsip-ua
	-lpjsip-simple -lpjsip -lpjmedia-codec -lpjmedia-videodev -lpjmedia-audiodev -lpjmedia
	-lpjnath -lpjlib-util -lresample -lsrtp2 -lgsm -lspeex -lspeexdsp -lpj -lssl -lcrypto
	-luuid -lm -lrt -lpthread  -lasound
	make[2]: Leaving directory '/usr/src/RPM/BUILD/libpjsip-2.17/pjsip-apps/build'
	make: *** [Makefile:16: all] Error 1
	error: Bad exit status from /usr/src/tmp/rpmb-tmp.iBQYcH (%build)
	RPM build errors:
	Bad exit status from /usr/src/tmp/rpmb-tmp.iBQYcH (%build)

postgresql18-18.6-alt1
	1..231\r
	# 116 of 231 tests failed.\r
	# The differences that caused some tests to fail can be viewed in the file
	"/usr/src/RPM/BUILD/postgresql18-18.6/src/test/regress/regression.diffs".\r

python3-module-fabio-2025.10.0-alt1
	+ cd /usr/src/RPM/BUILD
	+ cd python3-module-fabio-2025.10.0
	+ env
	PYTHONPATH=/usr/src/tmp/python3-module-fabio-buildroot/usr/lib64/python3/site-packages
	python3 run_tests.py --installed
	WARNING:py.warnings:/usr/lib64/python3/site-packages/h5py/__init__.py:36: UserWarning:
	h5py is running against HDF5 2.2.0 when it was built against 2.1.1, this may cause problems
	_warn(("h5py is running against HDF5 {0} when it was built against {1}, "
	WARNING:run_tests:Test fabio 2025.10.0 from
	/usr/src/tmp/python3-module-fabio-buildroot/usr/lib64/python3/site-packages/fabio
	.........................................................sssssssssssssssssss...............................s........ssssssssss.........sssssssssss.....s..................sss....ssssssssssssssssssssss...sss...sssssss...ss.ssssss.sssssssssssssssssssssssssss...sssss/usr/src/tmp/rpmb-tmp.kTMaTU:
	line 138: 1915901 Illegal instruction	  env
	PYTHONPATH=/usr/src/tmp/python3-module-fabio-buildroot/usr/lib64/python3/site-packages
	python3 run_tests.py --installed
	error: Bad exit status from /usr/src/tmp/rpmb-tmp.kTMaTU (%check)
	RPM build errors:
	Bad exit status from /usr/src/tmp/rpmb-tmp.kTMaTU (%check)

python3-module-trimesh-4.11.0-alt1
	tests/test_primitives.py::test_primitives
	hasher-privd: parent: handle_io: idle time limit (3600 seconds) exceeded

python3-module-websockets-16.1-alt1
	.........................................sssssssssssssss.......ssssssss...........................................................................................................................................................................s....s.s...........................................................................................................................................................................................................................................................................................................................................................................................................................................................................................ss...........................................................................................................................................................................................................................................................................................................................................................................................sssssssssssssss.....ssssssss...................................................................................................EF................s.s.....................................................................................................................................................................................................................................................................................................................................................................................................................................................................................................................................................................................................................................................................................................................................................
	ERROR: test_writing_in_recv_events_fails
	(tests.sync.test_connection.ClientConnectionTests.test_writing_in_recv_events_fails)
	Error when responding to incoming frames is correctly reported.
	--
	raise self.protocol.close_exc from original_exc
	websockets.exceptions.ConnectionClosedError: no close frame received or sent
	FAIL: test_writing_in_send_context_fails
	(tests.sync.test_connection.ClientConnectionTests.test_writing_in_send_context_fails)
	Error when sending outgoing frame is correctly reported.
	--
	self.assertIsInstance(raised.exception.__cause__, BrokenPipeError)
	AssertionError: None is not an instance of <class 'BrokenPipeError'>
	Ran 1979 tests in 74.390s
	FAILED (failures=1, errors=1, skipped=53)
	INFO	 : Command's result: FAILURE
	INFO	 : Command's error: Command '['python3', '-m', 'unittest']' returned non-zero
	exit status 1.
	error: Bad exit status from /usr/src/tmp/rpmb-tmp.lJneG4 (%check)

python3-module-zict-3.0.0-alt1
	File "/usr/src/RPM/BUILD/python3-module-zict-3.0.0/zict/tests/utils_test.py", line 193,
	in check_different_keys_threadsafe
	f1.result()
	File "/usr/lib64/python3.14/concurrent/futures/_base.py", line 449, in result
	self._condition.wait(timeout)
	File "/usr/lib64/python3.14/threading.py", line 370, in wait
	waiter.acquire()
	+++++++++++++++++++++++++++++++++++ Timeout ++++++++++++++++++++++++++++++++++++
	error: Bad exit status from /usr/src/tmp/rpmb-tmp.27ALL8 (%check)
	RPM build errors:
	Bad exit status from /usr/src/tmp/rpmb-tmp.27ALL8 (%check)

wiredpanda-5.2.2-alt1
	AutoGen: Writing the settings file
	"SRC:/x86_64-alt-linux/CMakeFiles/wiredpanda_lib_autogen.dir/AutogenUsed.txt"
	/usr/bin/cmake -E touch
	/usr/src/RPM/BUILD/wiredpanda-5.2.2/x86_64-alt-linux/wiredpanda_lib_autogen/timestamp
	gmake[2]: Leaving directory '/usr/src/RPM/BUILD/wiredpanda-5.2.2/x86_64-alt-linux'
	gmake[1]: Entering directory '/usr/src/RPM/BUILD/wiredpanda-5.2.2/x86_64-alt-linux'
	[ 29%] Built target wiredpanda_lib_autogen
	gmake[1]: Leaving directory '/usr/src/RPM/BUILD/wiredpanda-5.2.2/x86_64-alt-linux'
	gmake: *** [Makefile:146: all] Error 2
	error: Bad exit status from /usr/src/tmp/rpmb-tmp.rpGxWW (%build)
	RPM build errors:
	Bad exit status from /usr/src/tmp/rpmb-tmp.rpGxWW (%build)

	10 error logs REMOVED from the list
blender-4.5.12-alt1
eartag-1.0.3-alt1
fonts-ttf-IosevkaTermCurlySlab-34.8.1-alt1
gawk-5.1.0.0.213.d04f-alt2
herdr-0.8.2-alt1
libs2geometry-0.14.0-alt2
python3-module-oscrypto-1.3.0-alt1.1
ready-set-0.14.2-alt1
stevia-0.56.0-alt1
uutils-coreutils-0.9.0-alt1

Total 364 error logs.


^ permalink raw reply	[flat|nested] only message in thread

only message in thread, other threads:[~2026-09-17  7:40 UTC | newest]

Thread overview: (only message) (download: mbox.gz / follow: Atom feed)
-- links below jump to the message on this page --
2026-09-17  7:40 [cyber] I: Sisyphus-20260917 x86_64 beehive_status: +14 -10 (364) ALT beekeeper

ALT Linux Sisyphus cybertalk

This inbox may be cloned and mirrored by anyone:

	git clone --mirror http://lore.altlinux.org/sisyphus-cybertalk/0 sisyphus-cybertalk/git/0.git

	# If you have public-inbox 1.1+ installed, you may
	# initialize and index your mirror using the following commands:
	public-inbox-init -V2 sisyphus-cybertalk sisyphus-cybertalk/ http://lore.altlinux.org/sisyphus-cybertalk \
		sisyphus-cybertalk@lists.altlinux.org sisyphus-cybertalk@lists.altlinux.ru sisyphus-cybertalk@lists.altlinux.com
	public-inbox-index sisyphus-cybertalk

Example config snippet for mirrors.
Newsgroup available over NNTP:
	nntp://lore.altlinux.org/org.altlinux.lists.sisyphus-cybertalk


AGPL code for this site: git clone https://public-inbox.org/public-inbox.git