ALT Linux Sisyphus cybertalk
 help / color / mirror / Atom feed
* [cyber] I: Sisyphus-20260916 x86_64 beehive_status: +16 -31 (360)
@ 2026-09-16  7:47 ALT beekeeper
  0 siblings, 0 replies; only message in thread
From: ALT beekeeper @ 2026-09-16  7:47 UTC (permalink / raw)
  To: sisyphus-cybertalk

	16 NEW error logs

bpftrace-0.27.0-alt1
	^[[94m[	 SKIP	]^[[0m probe.kprobe_offset_module_error (unmet condition: 'lsmod | grep
	'^nf_tables'')\r
	^[[91m[	FAILED	]^[[0m 1 tests, listed below:\r
	^[[91m[	FAILED	]^[[0m json-output.time series min\r
	1506.85user 1072.27system 39:06.44elapsed 109%CPU (0avgtext+0avgdata 14574440maxresident)k

eartag-1.0.3-alt1
	stderr:
	Fatal Python error: Segmentation fault
	Thread 0x00007f0492c166c0 [asyncio_0] (most recent call first):

fonts-ttf-Iosevka-34.8.1-alt1
	[ACTION] Create TTF 'dist/Iosevka/TTF-Unhinted/Iosevka-HeavyItalic.ttf'
	[ACTION] Create TTF 'dist/Iosevka/TTF-Unhinted/Iosevka-ExtendedHeavyItalic.ttf'
	[ACTION] Create TTF 'dist/Iosevka/TTF-Unhinted/Iosevka-Thin.ttf'
	[ACTION] Create TTF 'dist/Iosevka/TTF-Unhinted/Iosevka-ExtendedThin.ttf'
	[ACTION] Create TTF 'dist/Iosevka/TTF-Unhinted/Iosevka-ThinOblique.ttf'
	[ACTION] Create TTF 'dist/Iosevka/TTF-Unhinted/Iosevka-ExtendedThinOblique.ttf'
	/usr/src/tmp/rpmb-tmp.ee4Rh7: line 134: 511073 CPU time limit exceeded npm run build
	-- ttf::Iosevka
	error: Bad exit status from /usr/src/tmp/rpmb-tmp.ee4Rh7 (%build)
	RPM build errors:
	Bad exit status from /usr/src/tmp/rpmb-tmp.ee4Rh7 (%build)

fonts-ttf-IosevkaCurlySlab-34.8.1-alt1
	[ACTION] Create TTF 'dist/IosevkaCurlySlab/TTF-Unhinted/IosevkaCurlySlab-HeavyItalic.ttf'
	[ACTION] Create TTF
	'dist/IosevkaCurlySlab/TTF-Unhinted/IosevkaCurlySlab-ExtendedHeavyItalic.ttf'
	[ACTION] Create TTF 'dist/IosevkaCurlySlab/TTF-Unhinted/IosevkaCurlySlab-Thin.ttf'
	[ACTION] Create TTF 'dist/IosevkaCurlySlab/TTF-Unhinted/IosevkaCurlySlab-ExtendedThin.ttf'
	[ACTION] Create TTF 'dist/IosevkaCurlySlab/TTF-Unhinted/IosevkaCurlySlab-ThinOblique.ttf'
	[ACTION] Create TTF
	'dist/IosevkaCurlySlab/TTF-Unhinted/IosevkaCurlySlab-ExtendedThinOblique.ttf'
	/usr/src/tmp/rpmb-tmp.25q4pR: line 134: 932901 CPU time limit exceeded npm run build --
	ttf::IosevkaCurlySlab
	error: Bad exit status from /usr/src/tmp/rpmb-tmp.25q4pR (%build)
	RPM build errors:
	Bad exit status from /usr/src/tmp/rpmb-tmp.25q4pR (%build)

fonts-ttf-IosevkaSlab-34.8.1-alt1
	[ACTION] Create TTF 'dist/IosevkaSlab/TTF-Unhinted/IosevkaSlab-ExtendedHeavyItalic.ttf'
	[ACTION] Create TTF 'dist/IosevkaSlab/TTF-Unhinted/IosevkaSlab-Thin.ttf'
	[ACTION] Create TTF 'dist/IosevkaSlab/TTF-Unhinted/IosevkaSlab-ExtendedThin.ttf'
	[ACTION] Create TTF 'dist/IosevkaSlab/TTF-Unhinted/IosevkaSlab-ThinOblique.ttf'
	[ACTION] Create TTF 'dist/IosevkaSlab/TTF-Unhinted/IosevkaSlab-ExtendedThinOblique.ttf'
	[ACTION] Hint TTF 'dist/IosevkaSlab/TTF/IosevkaSlab-ExtendedHeavy.ttf' <-
	'dist/IosevkaSlab/TTF-Unhinted/IosevkaSlab-ExtendedHeavy.ttf'
	/usr/src/tmp/rpmb-tmp.qf9s1u: line 134: 1380458 CPU time limit exceeded npm run build
	-- ttf::IosevkaSlab
	error: Bad exit status from /usr/src/tmp/rpmb-tmp.qf9s1u (%build)
	RPM build errors:
	Bad exit status from /usr/src/tmp/rpmb-tmp.qf9s1u (%build)

fonts-ttf-IosevkaTerm-34.8.1-alt1
	[ACTION] Create TTF 'dist/Iosevka/TTF-Unhinted/Iosevka-HeavyItalic.ttf'
	[ACTION] Create TTF 'dist/Iosevka/TTF-Unhinted/Iosevka-ExtendedHeavyItalic.ttf'
	[ACTION] Create TTF 'dist/Iosevka/TTF-Unhinted/Iosevka-Thin.ttf'
	[ACTION] Create TTF 'dist/Iosevka/TTF-Unhinted/Iosevka-ExtendedThin.ttf'
	[ACTION] Create TTF 'dist/Iosevka/TTF-Unhinted/Iosevka-ThinOblique.ttf'
	[ACTION] Create TTF 'dist/Iosevka/TTF-Unhinted/Iosevka-ExtendedThinOblique.ttf'
	/usr/src/tmp/rpmb-tmp.oRZ1yd: line 134: 3769382 CPU time limit exceeded npm run build
	-- ttf::IosevkaTerm
	error: Bad exit status from /usr/src/tmp/rpmb-tmp.oRZ1yd (%build)
	RPM build errors:
	Bad exit status from /usr/src/tmp/rpmb-tmp.oRZ1yd (%build)

fonts-ttf-IosevkaTermCurly-34.8.1-alt1
	[ACTION] Create TTF 'dist/IosevkaCurly/TTF-Unhinted/IosevkaCurly-HeavyItalic.ttf'
	[ACTION] Create TTF 'dist/IosevkaCurly/TTF-Unhinted/IosevkaCurly-ExtendedHeavyItalic.ttf'
	[ACTION] Create TTF 'dist/IosevkaCurly/TTF-Unhinted/IosevkaCurly-Thin.ttf'
	[ACTION] Create TTF 'dist/IosevkaCurly/TTF-Unhinted/IosevkaCurly-ExtendedThin.ttf'
	[ACTION] Create TTF 'dist/IosevkaCurly/TTF-Unhinted/IosevkaCurly-ThinOblique.ttf'
	[ACTION] Create TTF 'dist/IosevkaCurly/TTF-Unhinted/IosevkaCurly-ExtendedThinOblique.ttf'
	/usr/src/tmp/rpmb-tmp.VpuwnW: line 134: 4175709 CPU time limit exceeded npm run build
	-- ttf::IosevkaTermCurly
	error: Bad exit status from /usr/src/tmp/rpmb-tmp.VpuwnW (%build)
	RPM build errors:
	Bad exit status from /usr/src/tmp/rpmb-tmp.VpuwnW (%build)

fonts-ttf-IosevkaTermCurlySlab-34.8.1-alt1
	[ACTION] Create TTF 'dist/IosevkaCurlySlab/TTF-Unhinted/IosevkaCurlySlab-Thin.ttf'
	[ACTION] Create TTF 'dist/IosevkaCurlySlab/TTF-Unhinted/IosevkaCurlySlab-ExtendedThin.ttf'
	[ACTION] Create TTF 'dist/IosevkaCurlySlab/TTF-Unhinted/IosevkaCurlySlab-ThinOblique.ttf'
	[ACTION] Create TTF
	'dist/IosevkaCurlySlab/TTF-Unhinted/IosevkaCurlySlab-ExtendedThinOblique.ttf'
	[ACTION] Hint TTF 'dist/IosevkaCurlySlab/TTF/IosevkaCurlySlab-ExtendedExtraLight.ttf' <-
	'dist/IosevkaCurlySlab/TTF-Unhinted/IosevkaCurlySlab-ExtendedExtraLight.ttf'
	[ACTION] Hint TTF
	'dist/IosevkaTermCurlySlab/TTF/IosevkaTermCurlySlab-ExtendedExtraLight.ttf'
	/usr/src/tmp/rpmb-tmp.FKlI0n: line 134: 268708 CPU time limit exceeded npm run build --
	ttf::IosevkaTermCurlySlab
	error: Bad exit status from /usr/src/tmp/rpmb-tmp.FKlI0n (%build)
	RPM build errors:
	Bad exit status from /usr/src/tmp/rpmb-tmp.FKlI0n (%build)

gawk-5.1.0.0.213.d04f-alt2
	make[3]: Entering directory '/usr/src/RPM/BUILD/gawk-5.1.0.0.213.d04f-alt2/test'
	1 TESTS FAILED
	make[3]: *** [Makefile:5248: pass-fail] Error 1

gtranslator-50.0-alt1
	[120/163] Compiling C object src/libgtranslator.so.p/gtr-actions-search.c.o
	FAILED: [code=1] src/libgtranslator.so.p/gtr-actions-search.c.o
	cc -Isrc/libgtranslator.so.p -Isrc -I../src -I. -I.. -Isrc/translation-memory
	-I../src/translation-memory -Isrc/codeview -I../src/codeview -I/usr/include/glib-2.0
	-I/usr/lib64/glib-2.0/include -I/usr/include/gtk-4.0 -I/usr/include/pango-1.0
	-I/usr/include/harfbuzz -I/usr/include/gdk-pixbuf-2.0 -I/usr/include/cairo
	-I/usr/include/freetype2 -I/usr/include/libpng16 -I/usr/include/graphene-1.0
	-I/usr/lib64/graphene-1.0/include -I/usr/include/libadwaita-1
	-I/usr/include/libspelling-1 -I/usr/include/gtksourceview-5 -I/usr/include/libxml2
	-I/usr/include/gsettings-desktop-schemas -I/usr/include/libsoup-3.0
	-I/usr/include/json-glib-1.0 -fdiagnostics-color=always -D_FILE_OFFSET_BITS=64 -Wall
	-Winvalid-pch -O2 -g -DHAVE_CONFIG_H -DG_DISABLE_ASSERT -DG_DISABLE_CAST_CHECKS
	-pipe -frecord-gcc-switches -Wall -g -O2 -flto=auto -fPIC -pthread
	-mfpmath=sse -msse -msse2 -mfpmath=sse -msse -msse2 -mfpmath=sse -msse
	-msse2 -mfpmath=sse -msse -msse2 '-DG_LOG_DOMAIN="org.gnome.Gtranslator"'
	-MD -MQ src/libgtranslator.so.p/gtr-actions-search.c.o
	-MF src/libgtranslator.so.p/gtr-actions-search.c.o.d -o
	src/libgtranslator.so.p/gtr-actions-search.c.o -c ../src/gtr-actions-search.c
	In file included from ../src/gtr-actions-search.c:32:
	/usr/include/gtk-4.0/gdk/gdkkeysyms.h:32:2: error: #error "Only <gdk/gdk.h> can be
	included directly."
	32 | #error "Only <gdk/gdk.h> can be included directly."

gz-sim-10.5.0-alt1
	296/296 Test #296: world_TEST ...................................................
	Passed	  2.38 sec
	99% tests passed, 1 tests failed out of 296
	Total Test time (real) = 803.34 sec
	The following tests FAILED:
	275 - INTEGRATION_triggered_camera (Timeout)

libs2geometry-0.14.0-alt2
	1893/1893 Test #1809: VsOpenSSL/VsOpenSSLTest.MultiplyCorrect/(4-byte object <50-46
	00-00>, 4-byte object <50-46 00-00>) .............   Passed    0.29 sec
	99% tests passed, 1 tests failed out of 1893
	Total Test time (real) =   4.04 sec
	--
	1135 - AreaMetricTest.GetLevelOptModeDoesNotDieOnNaN (Skipped)
	The following tests FAILED:
	1204 - S2Polygon.TestApproxContainsAndDisjoint (Failed)

python3-module-chess-1.11.2-alt1
	return await command.result
	chess.engine.EngineTerminatedError: engine process died unexpectedly (exit code: -11)
	ERROR: test_sf_multipv (__main__.EngineTestCase.test_sf_multipv)
	Traceback (most recent call last):
	--
	return await command.result
	chess.engine.EngineTerminatedError: engine process died unexpectedly (exit code: -11)
	ERROR: test_sf_options (__main__.EngineTestCase.test_sf_options)
	Traceback (most recent call last):
	--
	return await command.result
	chess.engine.EngineTerminatedError: engine process died unexpectedly (exit code: -11)
	ERROR: test_sf_quit (__main__.EngineTestCase.test_sf_quit)
	Traceback (most recent call last):
	--
	return await command.result
	chess.engine.EngineTerminatedError: engine process died unexpectedly (exit code: -11)
	Ran 288 tests in 1.046s
	FAILED (errors=4, skipped=17)
	py3: exit 1 (1.23 seconds) /usr/src/RPM/BUILD/python3-module-chess-1.11.2> python
	test.py --verbose pid=2373047

ready-set-0.14.2-alt1
	[116/358] Compiling Vala source ../plugins/keyboard/current-input-row.vala
	../plugins/keyboard/current-input-sources.vala ../plugins/keyboard/enums.vala
	../plugins/keyboard/ibus-utils.vala ../plugins/keyboard/input-info.vala
	../plugins/keyboard/input-row.vala ../plugins/keyboard/input-sources-dialog.vala
	../plugins/keyboard/input-sources-manager.vala ../plugins/keyboard/input-sources.vala
	../plugins/keyboard/layout-switch-button.vala ../plugins/keyboard/page.vala
	../plugins/keyboard/plugin.vala ../plugins/keyboard/preview-dialog.vala
	../plugins/keyboard/stevia-layout-data.vala ../plugins/keyboard/utils.vala
	lib/src/libready-set-0.14.vapi
	FAILED: [code=1] plugins/keyboard/libkeyboard.so.p/current-input-row.c
	plugins/keyboard/libkeyboard.so.p/current-input-sources.c
	plugins/keyboard/libkeyboard.so.p/enums.c plugins/keyboard/libkeyboard.so.p/ibus-utils.c
	plugins/keyboard/libkeyboard.so.p/input-info.c
	plugins/keyboard/libkeyboard.so.p/input-row.c
	plugins/keyboard/libkeyboard.so.p/input-sources-dialog.c
	plugins/keyboard/libkeyboard.so.p/input-sources-manager.c
	plugins/keyboard/libkeyboard.so.p/input-sources.c
	plugins/keyboard/libkeyboard.so.p/layout-switch-button.c
	plugins/keyboard/libkeyboard.so.p/page.c plugins/keyboard/libkeyboard.so.p/plugin.c
	plugins/keyboard/libkeyboard.so.p/preview-dialog.c
	plugins/keyboard/libkeyboard.so.p/stevia-layout-data.c
	plugins/keyboard/libkeyboard.so.p/utils.c plugins/keyboard/keyboard.h
	plugins/keyboard/keyboard.vapi
	valac --depfile plugins/keyboard/keyboard.depfile -C --debug --fatal-warnings
	--enable-experimental --vapidir /usr/src/RPM/BUILD/ready-set-0.14.2/vapi --vapi-comments
	--pkg ibus-1.0 --pkg xkbcommon --pkg polkit-gobject-1 --pkg libserialize-7 --pkg
	libpeas-2 --pkg libadwaita-1 --pkg gio-unix-2.0 --pkg libcase-0 --pkg gnome-desktop-4
	--color=always --directory plugins/keyboard/libkeyboard.so.p --basedir ../plugins/keyboard
	--library keyboard --header plugins/keyboard/keyboard.h --vapi ../keyboard.vapi
	--gresources=../plugins/keyboard/data/org.altlinux.ReadySet.Plugin.Keyboard.gresource.xml
	--gresourcesdir=/usr/src/RPM/BUILD/ready-set-0.14.2/x86_64-alt-linux/plugins/keyboard/data
	--gresourcesdir=plugins/keyboard/data --gresourcesdir=../plugins/keyboard/data
	--vapidir /usr/src/RPM/BUILD/ready-set-0.14.2/plugins/keyboard/vapi
	-D HAVE_IBUS ../plugins/keyboard/current-input-row.vala
	../plugins/keyboard/current-input-sources.vala ../plugins/keyboard/enums.vala
	../plugins/keyboard/ibus-utils.vala ../plugins/keyboard/input-info.vala
	../plugins/keyboard/input-row.vala ../plugins/keyboard/input-sources-dialog.vala
	../plugins/keyboard/input-sources-manager.vala ../plugins/keyboard/input-sources.vala
	../plugins/keyboard/layout-switch-button.vala ../plugins/keyboard/page.vala
	../plugins/keyboard/plugin.vala ../plugins/keyboard/preview-dialog.vala
	../plugins/keyboard/stevia-layout-data.vala ../plugins/keyboard/utils.vala
	lib/src/libready-set-0.14.vapi

stevia-0.56.0-alt1
	+ xvfb-run /usr/bin/meson test --no-rebuild --print-errorlogs -C x86_64-alt-linux
	_XSERVTransmkdir: ERROR: euid != 0,directory /tmp/.X11-unix will not be created.
	1/71 phosh-osk-stevia:Validate schema file	       OK	       0.15s
	--
	# random seed: R02Sa3a667ba6e8306da755c41091a653686
	# Gdk-DEBUG: error: XDG_RUNTIME_DIR is invalid or not set in the environment.
	stderr:

uutils-coreutils-0.9.0-alt1
	test_stdbuf::test_stdbuf_unbuffered_stdout
	test result: FAILED. 5124 passed; 7 failed; 85 ignored; 0 measured; 48 filtered out;
	finished in 13.99s
	error: test failed, to rerun pass `--test tests`
	Doc-tests coreutils
	--
	test result: ok. 0 passed; 0 failed; 0 ignored; 0 measured; 0 filtered out; finished
	in 0.00s
	error: 1 target failed:
	`--test tests`

	31 error logs REMOVED from the list
Uranium-5.13.0-alt5
altlinux-freedesktop-menu-0.70-alt2
casr-2.13.1-alt2
deepin-compressor-1:6.5.33-alt1
deepin-fcitx5configtool-plugin-6.0.33-alt1
eden-0.2.1-alt2.2
fonts-ttf-Iosevka-34.7.0-alt1
fonts-ttf-IosevkaCurlySlab-34.4.0-alt1
fonts-ttf-IosevkaSlab-34.7.0-alt1
fonts-ttf-IosevkaTerm-34.7.0-alt1
fonts-ttf-IosevkaTermCurly-34.7.0-alt1
fonts-ttf-IosevkaTermCurlySlab-34.4.0-alt1
fonts-ttf-IosevkaTermSlab-34.7.0-alt1
gambit-4.9.7-alt5
grex-1.4.6-alt1
itext-1:2.1.7-alt7_41jpp11
java-classmate-1.7.3-alt2
libgupnp-igd-1.6.0-alt1
libnfs-5.0.3-alt1
libxfconf-4.21.2-alt1
lore-0.8.6-alt1
perl-CHI-0.61-alt1
perl-Tie-DBI-1.08-alt1
postgresql16-16.15-alt1
prometheus-3.12.0-alt1
python3-module-aiosmtplib-5.1.2-alt1
python3-module-charset-normalizer-3.5.1-alt1
python3-module-mkdocs-1.6.1-alt2
python3-module-paho-2.1.0-alt2
python3-module-rapidfuzz-3.14.6-alt1
python3-module-zict-3.0.0-alt1

Total 360 error logs.


^ permalink raw reply	[flat|nested] only message in thread

only message in thread, other threads:[~2026-09-16  7:47 UTC | newest]

Thread overview: (only message) (download: mbox.gz / follow: Atom feed)
-- links below jump to the message on this page --
2026-09-16  7:47 [cyber] I: Sisyphus-20260916 x86_64 beehive_status: +16 -31 (360) ALT beekeeper

ALT Linux Sisyphus cybertalk

This inbox may be cloned and mirrored by anyone:

	git clone --mirror http://lore.altlinux.org/sisyphus-cybertalk/0 sisyphus-cybertalk/git/0.git

	# If you have public-inbox 1.1+ installed, you may
	# initialize and index your mirror using the following commands:
	public-inbox-init -V2 sisyphus-cybertalk sisyphus-cybertalk/ http://lore.altlinux.org/sisyphus-cybertalk \
		sisyphus-cybertalk@lists.altlinux.org sisyphus-cybertalk@lists.altlinux.ru sisyphus-cybertalk@lists.altlinux.com
	public-inbox-index sisyphus-cybertalk

Example config snippet for mirrors.
Newsgroup available over NNTP:
	nntp://lore.altlinux.org/org.altlinux.lists.sisyphus-cybertalk


AGPL code for this site: git clone https://public-inbox.org/public-inbox.git