ALT Linux Sisyphus cybertalk
 help / color / mirror / Atom feed
* [cyber] I: Sisyphus-20260915 x86_64 beehive_status: +21 -29 (375)
@ 2026-09-15  7:35 ALT beekeeper
  0 siblings, 0 replies; only message in thread
From: ALT beekeeper @ 2026-09-15  7:35 UTC (permalink / raw)
  To: sisyphus-cybertalk

[-- Warning: decoded text below may be mangled, UTF-8 assumed --]
[-- Attachment #1: Type: text/plain; charset=unknown-8bit, Size: 33775 bytes --]

	21 NEW error logs

Uranium-5.13.0-alt5
	>	self.assertEqual(len(os.listdir(self._temp_dir.name)), 1)
	E	AssertionError: 2 != 1
	tests/SaveFile/TestSaveFile.py:43: AssertionError
	--
	=========================== short test summary info ============================
	FAILED tests/SaveFile/TestSaveFile.py::TestSaveFile::test_multiWrite - Assert...
	=== 1 failed, 2356 passed, 10 skipped, 19 deselected, 22 warnings in 10.21s ====

casr-2.13.1-alt2
	test test_safe_func32 ... ignored
	test test_casr_ubsan ... FAILED
	test test_casr_lua ... ok
	--
	thread 'test_casr_ubsan' (3889758) panicked at casr/tests/tests.rs:3961:43:
	called `Result::unwrap()` on an `Err` value: Os { code: 2, kind: NotFound, message:
	"No such file or directory" }
	note: run with `RUST_BACKTRACE=1` environment variable to display a backtrace
	--
	test_casr_ubsan
	test result: FAILED. 22 passed; 1 failed; 4 ignored; 0 measured; 76 filtered out;
	finished in 94.70s
	error: test failed, to rerun pass `-p casr --test tests`
	Running unittests src/lib.rs (target/release/deps/libcasr-cd0206c960f194c9)
	--
	test result: ok. 0 passed; 0 failed; 0 ignored; 0 measured; 0 filtered out; finished
	in 0.00s
	error: 1 target failed:
	`-p casr --test tests`

eden-0.2.1-alt2.2
	[1340/1515] /usr/bin/clang++ -DARCHITECTURE_x86_64=1 -DBOOST_ATOMIC_DYN_LINK
	-DBOOST_ATOMIC_NO_LIB -DBOOST_CONTEXT_DYN_LINK -DBOOST_CONTEXT_NO_LIB
	-DBOOST_FILESYSTEM_DYN_LINK -DBOOST_FILESYSTEM_NO_LIB -DBUILD_ID=\"amd64\"
	-DCPPHTTPLIB_BROTLI_SUPPORT -DCPPHTTPLIB_OPENSSL_SUPPORT
	-DCPPHTTPLIB_USE_NON_BLOCKING_GETADDRINFO -DCPPHTTPLIB_ZLIB_SUPPORT
	-DENABLE_WEB_SERVICE -DFMT_SHARED -DHAS_OPENGL -DNDEBUG -DQT_CONCURRENT_LIB
	-DQT_CORE5COMPAT_LIB -DQT_CORE_LIB -DQT_GUI_LIB -DQT_NO_CAST_FROM_ASCII
	-DQT_NO_CAST_TO_ASCII -DQT_NO_DEBUG -DQT_NO_NARROWING_CONVERSIONS_IN_CONNECT
	-DQT_NO_PROCESS_COMBINED_ARGUMENT_START -DQT_NO_URL_CAST_FROM_STRING
	-DQT_USE_QSTRINGBUILDER -DQT_WIDGETS_LIB -DYUZU_ROOM -D_FILE_OFFSET_BITS=64
	-I/usr/src/RPM/BUILD/eden/x86_64-alt-linux/src/qt_common/qt_common_autogen/include
	-I/usr/src/RPM/BUILD/eden/src/. -I/usr/src/RPM/BUILD/eden/x86_64-alt-linux/src
	-I/usr/src/RPM/BUILD/eden/externals/./stb -I/include -isystem /usr/include/qt6/QtWidgets
	-isystem /usr/include/qt6 -isystem /usr/include/qt6/QtCore -isystem
	/usr/lib64/qt6/mkspecs/linux-g++ -isystem /usr/include/qt6/QtGui -isystem
	/usr/include/qt6/QtConcurrent -isystem /usr/include/QuaZip-Qt6-1.5 -isystem
	/usr/include/QuaZip-Qt6-1.5/quazip -isystem /usr/include/qt6/QtCore5Compat -isystem
	/usr/include/qt6/QtGui/6.11.2 -isystem /usr/include/qt6/QtGui/6.11.2/QtGui -isystem
	/usr/include/qt6/QtCore/6.11.2 -isystem /usr/include/qt6/QtCore/6.11.2/QtCore
	-pipe -frecord-gcc-switches -Wall -g -O2 -flto=auto -O2 -g -DNDEBUG
	-std=gnu++20 -fwrapv -pipe -fno-rtti -Werror=all -Werror=extra
	-Werror=missing-declarations -Werror=shadow -Werror=unused -Wno-attributes
	-Wno-invalid-offsetof -Wno-unused-parameter -Wno-missing-field-initializers
	-Werror=shadow-uncaptured-local -Werror=implicit-fallthrough -Werror=type-limits
	-Wno-braced-scalar-init -Wno-unused-private-field -Wno-nullability-completeness
	-mcx16 -MD -MT src/qt_common/CMakeFiles/qt_common.dir/util/mod.cpp.o
	-MF src/qt_common/CMakeFiles/qt_common.dir/util/mod.cpp.o.d
	-o src/qt_common/CMakeFiles/qt_common.dir/util/mod.cpp.o -c
	/usr/src/RPM/BUILD/eden/src/qt_common/util/mod.cpp
	FAILED: [code=1] src/qt_common/CMakeFiles/qt_common.dir/util/mod.cpp.o
	/usr/bin/clang++ -DARCHITECTURE_x86_64=1 -DBOOST_ATOMIC_DYN_LINK -DBOOST_ATOMIC_NO_LIB
	-DBOOST_CONTEXT_DYN_LINK -DBOOST_CONTEXT_NO_LIB -DBOOST_FILESYSTEM_DYN_LINK
	-DBOOST_FILESYSTEM_NO_LIB -DBUILD_ID=\"amd64\" -DCPPHTTPLIB_BROTLI_SUPPORT
	-DCPPHTTPLIB_OPENSSL_SUPPORT -DCPPHTTPLIB_USE_NON_BLOCKING_GETADDRINFO
	-DCPPHTTPLIB_ZLIB_SUPPORT -DENABLE_WEB_SERVICE -DFMT_SHARED -DHAS_OPENGL -DNDEBUG
	-DQT_CONCURRENT_LIB -DQT_CORE5COMPAT_LIB -DQT_CORE_LIB -DQT_GUI_LIB -DQT_NO_CAST_FROM_ASCII
	-DQT_NO_CAST_TO_ASCII -DQT_NO_DEBUG -DQT_NO_NARROWING_CONVERSIONS_IN_CONNECT
	-DQT_NO_PROCESS_COMBINED_ARGUMENT_START -DQT_NO_URL_CAST_FROM_STRING
	-DQT_USE_QSTRINGBUILDER -DQT_WIDGETS_LIB -DYUZU_ROOM -D_FILE_OFFSET_BITS=64
	-I/usr/src/RPM/BUILD/eden/x86_64-alt-linux/src/qt_common/qt_common_autogen/include
	-I/usr/src/RPM/BUILD/eden/src/. -I/usr/src/RPM/BUILD/eden/x86_64-alt-linux/src
	-I/usr/src/RPM/BUILD/eden/externals/./stb -I/include -isystem /usr/include/qt6/QtWidgets
	-isystem /usr/include/qt6 -isystem /usr/include/qt6/QtCore -isystem
	/usr/lib64/qt6/mkspecs/linux-g++ -isystem /usr/include/qt6/QtGui -isystem
	/usr/include/qt6/QtConcurrent -isystem /usr/include/QuaZip-Qt6-1.5 -isystem
	/usr/include/QuaZip-Qt6-1.5/quazip -isystem /usr/include/qt6/QtCore5Compat -isystem
	/usr/include/qt6/QtGui/6.11.2 -isystem /usr/include/qt6/QtGui/6.11.2/QtGui -isystem
	/usr/include/qt6/QtCore/6.11.2 -isystem /usr/include/qt6/QtCore/6.11.2/QtCore
	-pipe -frecord-gcc-switches -Wall -g -O2 -flto=auto -O2 -g -DNDEBUG
	-std=gnu++20 -fwrapv -pipe -fno-rtti -Werror=all -Werror=extra
	-Werror=missing-declarations -Werror=shadow -Werror=unused -Wno-attributes
	-Wno-invalid-offsetof -Wno-unused-parameter -Wno-missing-field-initializers
	-Werror=shadow-uncaptured-local -Werror=implicit-fallthrough -Werror=type-limits
	-Wno-braced-scalar-init -Wno-unused-private-field -Wno-nullability-completeness
	-mcx16 -MD -MT src/qt_common/CMakeFiles/qt_common.dir/util/mod.cpp.o
	-MF src/qt_common/CMakeFiles/qt_common.dir/util/mod.cpp.o.d
	-o src/qt_common/CMakeFiles/qt_common.dir/util/mod.cpp.o -c
	/usr/src/RPM/BUILD/eden/src/qt_common/util/mod.cpp
	--
	In file included from /usr/src/RPM/BUILD/eden/src/./core/file_sys/registered_cache.h:15:
	/usr/include/ankerl/unordered_dense.h:1380:40: error: expected member name or ';'
	after declaration specifiers
	1380 |	   static constexpr std::size_t slots =
	std::tuple_size_v<decltype(Group::m_fingerprints)>;
	/usr/include/ankerl/unordered_dense.h:1388:41: error: expected expression
	1388 |	       std::array<value_idx_type, slots> m_index;
	/usr/include/ankerl/unordered_dense.h:1938:91: error: no type named 'block' in
	'ankerl::unordered_dense::detail::group_storage<ankerl::unordered_dense::bucket_type::basic_group<unsigned
	int>, std::allocator<std::pair<unsigned long, std::array<unsigned char, 16>>>>'
	1938 |								 typename
	bucket_container_type::block const& home,
	--
	In file included from /usr/src/RPM/BUILD/eden/src/./core/file_sys/registered_cache.h:15:
	/usr/include/ankerl/unordered_dense.h:1938:91: error: no type named 'block' in
	'ankerl::unordered_dense::detail::group_storage<ankerl::unordered_dense::bucket_type::basic_group<unsigned
	int>, std::allocator<std::pair<unsigned long, FileSys::CNMT>>>'
	1938 |								 typename
	bucket_container_type::block const& home,
	--
	In file included from /usr/src/RPM/BUILD/eden/src/./core/file_sys/registered_cache.h:15:
	/usr/include/ankerl/unordered_dense.h:1938:91: error: no type named 'block' in
	'ankerl::unordered_dense::detail::group_storage<ankerl::unordered_dense::bucket_type::basic_group<unsigned
	int>, std::allocator<std::pair<std::tuple<unsigned long, FileSys::ContentRecordType,
	FileSys::TitleType>, std::shared_ptr<FileSys::VfsFile>>>>'
	1938 |								 typename
	bucket_container_type::block const& home,
	--
	In file included from /usr/src/RPM/BUILD/eden/src/./core/file_sys/registered_cache.h:15:
	/usr/include/ankerl/unordered_dense.h:1938:91: error: no type named 'block' in
	'ankerl::unordered_dense::detail::group_storage<ankerl::unordered_dense::bucket_type::basic_group<unsigned
	int>, std::allocator<std::pair<unsigned long, unsigned int>>>'
	1938 |								 typename
	bucket_container_type::block const& home,

fonts-ttf-IosevkaTermCurlySlab-34.4.0-alt1
	[ACTION] Create TTF 'dist/IosevkaCurlySlab/TTF-Unhinted/IosevkaCurlySlab-HeavyItalic.ttf'
	[ACTION] Create TTF
	'dist/IosevkaCurlySlab/TTF-Unhinted/IosevkaCurlySlab-ExtendedHeavyItalic.ttf'
	[ACTION] Create TTF 'dist/IosevkaCurlySlab/TTF-Unhinted/IosevkaCurlySlab-Thin.ttf'
	[ACTION] Create TTF 'dist/IosevkaCurlySlab/TTF-Unhinted/IosevkaCurlySlab-ExtendedThin.ttf'
	[ACTION] Create TTF 'dist/IosevkaCurlySlab/TTF-Unhinted/IosevkaCurlySlab-ThinOblique.ttf'
	[ACTION] Create TTF
	'dist/IosevkaCurlySlab/TTF-Unhinted/IosevkaCurlySlab-ExtendedThinOblique.ttf'
	/usr/src/tmp/rpmb-tmp.WW5LZj: line 134: 2805231 CPU time limit exceeded npm run build
	-- ttf::IosevkaTermCurlySlab
	error: Bad exit status from /usr/src/tmp/rpmb-tmp.WW5LZj (%build)
	RPM build errors:
	Bad exit status from /usr/src/tmp/rpmb-tmp.WW5LZj (%build)

gambit-4.9.7-alt5
	make[4]: Leaving directory '/usr/src/RPM/BUILD/gambit-4.9.7/lib/_irregex'
	make[4]: Entering directory '/usr/src/RPM/BUILD/gambit-4.9.7/lib'
	LD_LIBRARY_PATH=../lib:../gsi:../gsc:
	../gsc/gsc -:~~bin=../bin,~~lib=../lib,~~include=../include -f -target js  -prelude
	"(define-cond-expand-feature|enable-type-checking|)(define-cond-expand-feature|disable-auto-forcing|)(define-cond-expand-feature|enable-sharp-dot|)(define-cond-expand-feature|enable-bignum|)(define-cond-expand-feature|enable-ratnum|)(define-cond-expand-feature|enable-cpxnum|)(define-cond-expand-feature|enable-s8vector|)(define-cond-expand-feature|enable-u16vector|)(define-cond-expand-feature|enable-s16vector|)(define-cond-expand-feature|enable-u32vector|)(define-cond-expand-feature|enable-s32vector|)(define-cond-expand-feature|enable-u64vector|)(define-cond-expand-feature|enable-s64vector|)(define-cond-expand-feature|enable-f32vector|)(define-cond-expand-feature|disable-smp|)(##include\"../lib/header.scm\")"
	-label-namespace "" -c -o _gambit.js ../lib/_univlib.scm
	make[4]: Leaving directory '/usr/src/RPM/BUILD/gambit-4.9.7/lib'
	make[2]: *** [makefile:546: modules-recursive] Error 2
	make[1]: *** [makefile:373: modules] Error 2
	make: *** [makefile:107: all] Error 2
	error: Bad exit status from /usr/src/tmp/rpmb-tmp.3jdo2L (%build)
	RPM build errors:
	Bad exit status from /usr/src/tmp/rpmb-tmp.3jdo2L (%build)

grex-1.4.6-alt1
	test matching_regexes_without_end_anchor ... ok
	test matching_regexes_with_case_insensitive_matching ... FAILED
	test matching_regexes_without_start_anchor ... ok
	--
	thread 'matching_regexes_with_case_insensitive_matching' (1656136) panicked at
	tests/property_tests.rs:23:1:
	Test failed: assertion failed: test_cases.iter().all(|test_case|
	compiled_regexp.is_match(test_case)) at tests/property_tests.rs:281.
	minimal failing input: test_cases = {
	--
	matching_regexes_with_case_insensitive_matching
	test result: FAILED. 44 passed; 1 failed; 0 ignored; 0 measured; 0 filtered out;
	finished in 0.76s
	error: test failed, to rerun pass `--test property_tests`
	error: Bad exit status from /usr/src/tmp/rpmb-tmp.BAhgoO (%check)

intel-compute-runtime-legacy-24.35.30872.45-alt1
	[587/2089] cd
	/usr/src/RPM/BUILD/intel-compute-runtime-legacy-24.35.30872.45/shared/source/built_ins/kernels
	&& /usr/bin/cmake -E env
	LD_LIBRARY_PATH=:/usr/src/RPM/BUILD/intel-compute-runtime-legacy-24.35.30872.45/x86_64-alt-linux/bin
	/usr/src/RPM/BUILD/intel-compute-runtime-legacy-24.35.30872.45/x86_64-alt-linux/bin/ocloc-24.35.0
	-q -file
	/usr/src/RPM/BUILD/intel-compute-runtime-legacy-24.35.30872.45/x86_64-alt-linux/bin/built_ins/x64/gen8/stateless_copy_buffer_rect_stateless_bdw.spv
	-spirv_input -device 8.0.0 -cl-intel-greater-than-4GB-buffer-required
	-64 -stateful_address_mode bindful -output
	stateless_copy_buffer_rect_stateless_8_0_0 -output_no_suffix -out_dir
	/usr/src/RPM/BUILD/intel-compute-runtime-legacy-24.35.30872.45/x86_64-alt-linux/bin/built_ins/x64/gen8
	-options -cl-kernel-arg-info
	FAILED: [code=1] bin/built_ins/x64/gen8/stateless_copy_buffer_rect_stateless_8_0_0.bin
	/usr/src/RPM/BUILD/intel-compute-runtime-legacy-24.35.30872.45/x86_64-alt-linux/bin/built_ins/x64/gen8/stateless_copy_buffer_rect_stateless_8_0_0.bin
	cd
	/usr/src/RPM/BUILD/intel-compute-runtime-legacy-24.35.30872.45/shared/source/built_ins/kernels
	&& /usr/bin/cmake -E env
	LD_LIBRARY_PATH=:/usr/src/RPM/BUILD/intel-compute-runtime-legacy-24.35.30872.45/x86_64-alt-linux/bin
	/usr/src/RPM/BUILD/intel-compute-runtime-legacy-24.35.30872.45/x86_64-alt-linux/bin/ocloc-24.35.0
	-q -file
	/usr/src/RPM/BUILD/intel-compute-runtime-legacy-24.35.30872.45/x86_64-alt-linux/bin/built_ins/x64/gen8/stateless_copy_buffer_rect_stateless_bdw.spv
	-spirv_input -device 8.0.0 -cl-intel-greater-than-4GB-buffer-required
	-64 -stateful_address_mode bindful -output
	stateless_copy_buffer_rect_stateless_8_0_0 -output_no_suffix -out_dir
	/usr/src/RPM/BUILD/intel-compute-runtime-legacy-24.35.30872.45/x86_64-alt-linux/bin/built_ins/x64/gen8
	-options -cl-kernel-arg-info
	ERROR! Trying to select a workaround table for an unknown architecture. Aborting.
	[588/2089] cd
	/usr/src/RPM/BUILD/intel-compute-runtime-legacy-24.35.30872.45/shared/source/built_ins/kernels
	&& /usr/bin/cmake -E env
	LD_LIBRARY_PATH=:/usr/src/RPM/BUILD/intel-compute-runtime-legacy-24.35.30872.45/x86_64-alt-linux/bin
	/usr/src/RPM/BUILD/intel-compute-runtime-legacy-24.35.30872.45/x86_64-alt-linux/bin/ocloc-24.35.0
	-q -file
	/usr/src/RPM/BUILD/intel-compute-runtime-legacy-24.35.30872.45/x86_64-alt-linux/bin/built_ins/x64/gen8/stateless_copy_buffer_to_buffer_stateless_bdw.spv
	-spirv_input -device 8.0.0 -cl-intel-greater-than-4GB-buffer-required
	-64 -stateful_address_mode bindful -output
	stateless_copy_buffer_to_buffer_stateless_8_0_0 -output_no_suffix -out_dir
	/usr/src/RPM/BUILD/intel-compute-runtime-legacy-24.35.30872.45/x86_64-alt-linux/bin/built_ins/x64/gen8
	-options -cl-kernel-arg-info
	FAILED: [code=1] bin/built_ins/x64/gen8/stateless_copy_buffer_to_buffer_stateless_8_0_0.bin
	/usr/src/RPM/BUILD/intel-compute-runtime-legacy-24.35.30872.45/x86_64-alt-linux/bin/built_ins/x64/gen8/stateless_copy_buffer_to_buffer_stateless_8_0_0.bin
	cd
	/usr/src/RPM/BUILD/intel-compute-runtime-legacy-24.35.30872.45/shared/source/built_ins/kernels
	&& /usr/bin/cmake -E env
	LD_LIBRARY_PATH=:/usr/src/RPM/BUILD/intel-compute-runtime-legacy-24.35.30872.45/x86_64-alt-linux/bin
	/usr/src/RPM/BUILD/intel-compute-runtime-legacy-24.35.30872.45/x86_64-alt-linux/bin/ocloc-24.35.0
	-q -file
	/usr/src/RPM/BUILD/intel-compute-runtime-legacy-24.35.30872.45/x86_64-alt-linux/bin/built_ins/x64/gen8/stateless_copy_buffer_to_buffer_stateless_bdw.spv
	-spirv_input -device 8.0.0 -cl-intel-greater-than-4GB-buffer-required
	-64 -stateful_address_mode bindful -output
	stateless_copy_buffer_to_buffer_stateless_8_0_0 -output_no_suffix -out_dir
	/usr/src/RPM/BUILD/intel-compute-runtime-legacy-24.35.30872.45/x86_64-alt-linux/bin/built_ins/x64/gen8
	-options -cl-kernel-arg-info
	ERROR! Trying to select a workaround table for an unknown architecture. Aborting.
	[589/2089] cd
	/usr/src/RPM/BUILD/intel-compute-runtime-legacy-24.35.30872.45/shared/source/built_ins/kernels
	&& /usr/bin/cmake -E env
	LD_LIBRARY_PATH=:/usr/src/RPM/BUILD/intel-compute-runtime-legacy-24.35.30872.45/x86_64-alt-linux/bin
	/usr/src/RPM/BUILD/intel-compute-runtime-legacy-24.35.30872.45/x86_64-alt-linux/bin/ocloc-24.35.0
	-q -spv_only -file
	/usr/src/RPM/BUILD/intel-compute-runtime-legacy-24.35.30872.45/shared/source/built_ins/kernels/copy_kernel_timestamps.builtin_kernel
	-out_dir
	/usr/src/RPM/BUILD/intel-compute-runtime-legacy-24.35.30872.45/x86_64-alt-linux/bin/built_ins/x64/spirv/
	-output_no_suffix -options -cl-kernel-arg-info

libgupnp-igd-1.6.0-alt1
	Bail out!
	1/1 gupnp-igd:gupnp-simple-igd FAIL	       7.85s   killed by signal 6 SIGABRT
	Summary of Failures:
	1/1 gupnp-igd:gupnp-simple-igd FAIL	       7.85s   killed by signal 6 SIGABRT
	Ok:		   0
	Fail:		   1
	Full log written to
	/usr/src/RPM/BUILD/gupnp-igd-1.6.0/x86_64-alt-linux/meson-logs/testlog.txt
	error: Bad exit status from /usr/src/tmp/rpmb-tmp.Og1mpl (%check)
	RPM build errors:
	Bad exit status from /usr/src/tmp/rpmb-tmp.Og1mpl (%check)

libxfconf-4.21.2-alt1
	[4/167] cc -Ixfconf/libxfconf-0.so.3.0.0.p -Ixfconf -I../xfconf -I. -I.. -Icommon
	-I../common -I/usr/include/glib-2.0 -I/usr/lib64/glib-2.0/include
	-I/usr/include/gio-unix-2.0 -I/usr/include/xfce4 -fvisibility=hidden
	-fdiagnostics-color=always -D_FILE_OFFSET_BITS=64 -Wall -Winvalid-pch -Wextra -std=gnu11
	-O2 -g -Wmissing-declarations -Wmissing-noreturn -Wold-style-definition -Wredundant-decls
	-Wpointer-arith -Wcast-align -Winit-self -Wshadow -Wmissing-include-dirs -Wundef
	-Wformat -Wformat-security -Wformat-y2k -Wnested-externs -Wno-unused-parameter
	-Wno-declaration-after-statement -Wno-missing-field-initializers
	-Werror=implicit-function-declaration -Wno-error=deprecated-declarations
	-DGLIB_VERSION_MIN_REQUIRED=GLIB_VERSION_2_72 -DGLIB_VERSION_MAX_ALLOWED=GLIB_VERSION_2_72
	-DG_LOG_USE_STRUCTURED=1 '-DPACKAGE="xfconf"' '-DPACKAGE_NAME="xfconf"'
	'-DPACKAGE_VERSION="4.21.2"' '-DVERSION="4.21.2"' '-DVERSION_SHORT="4.21"'
	'-DPACKAGE_STRING="xfconf 4.21.2"' '-DPACKAGE_DATADIR="/usr/share/xfconf"'
	'-DCOPYRIGHT_YEAR="2026"' '-DPACKAGE_LOCALE_DIR="/usr/share/locale"'
	'-DPACKAGE_BUGREPORT="https://gitlab.xfce.org/xfce/xfconf/-/issues"'
	'-DGETTEXT_PACKAGE="xfconf"' '-DPREFIX="/usr"' '-DBINDIR="/usr/bin"'
	'-DDATADIR="/usr/share"' '-DINCLUDEDIR="/usr/include"' '-DLIBDIR="/usr/lib64"'
	'-DLIBEXECDIR="/usr/lib"' '-DLOCALEDIR="/usr/share/locale"' '-DLOCALSTATEDIR="/var"'
	'-DSBINDIR="/usr/sbin"' '-DSYSCONFDIR="/etc"' -DHAVE_XFCE_REVISION_H=1
	-DENABLE_SYMBOL_VISIBILITY=1 '-DXFCONF_EXPORT=__attribute__((visibility("default")))'
	'-DXFCONF_SERVICE_NAME_PREFIX="org.xfce"' '-DXFCONF_SERVICE_PATH_PREFIX="/org/xfce"'
	-DBUILD_XFCONF_BACKEND_PERCHANNEL_XML=1 -DALIGNOF_GUCHAR=1 -DALIGNOF_GCHAR=1
	-DALIGNOF_GUINT16=2 -DALIGNOF_GINT16=2 -DALIGNOF_GUINT32=4 -DALIGNOF_GINT32=4
	-DALIGNOF_GUINT64=8 -DALIGNOF_GINT64=8 -DALIGNOF_GFLOAT=4 -DALIGNOF_GDOUBLE=8
	-DALIGNOF_GBOOLEAN=4 -DALIGNOF_GPOINTER=8 -DHAVE_FDATASYNC=1 -DHAVE_FSYNC=1
	-DHAVE_SYS_STAT_H=1 -DHAVE_SYS_TYPES_H=1 -DHAVE_SYS_WAIT_H=1 -DHAVE_ERRNO_H=1
	-DHAVE_FCNTL_H=1 -DHAVE_GRP_H=1 -DHAVE_SIGNAL_H=1 -DHAVE_STDLIB_H=1
	-DHAVE_STRING_H=1 -DHAVE_UNISTD_H=1 -pipe -frecord-gcc-switches -Wall -g -O2
	-flto=auto -fPIC -pthread '-DG_LOG_DOMAIN="xfconf"' -DLIBXFCONF_COMPILATION=1
	-MD -MQ xfconf/libxfconf-0.so.3.0.0.p/xfconf-cache.c.o
	-MF xfconf/libxfconf-0.so.3.0.0.p/xfconf-cache.c.o.d -o
	xfconf/libxfconf-0.so.3.0.0.p/xfconf-cache.c.o -c ../xfconf/xfconf-cache.c
	FAILED: [code=1] xfconf/libxfconf-0.so.3.0.0.p/xfconf-cache.c.o
	cc -Ixfconf/libxfconf-0.so.3.0.0.p -Ixfconf -I../xfconf -I. -I.. -Icommon -I../common
	-I/usr/include/glib-2.0 -I/usr/lib64/glib-2.0/include -I/usr/include/gio-unix-2.0
	-I/usr/include/xfce4 -fvisibility=hidden -fdiagnostics-color=always -D_FILE_OFFSET_BITS=64
	-Wall -Winvalid-pch -Wextra -std=gnu11 -O2 -g -Wmissing-declarations -Wmissing-noreturn
	-Wold-style-definition -Wredundant-decls -Wpointer-arith -Wcast-align -Winit-self -Wshadow
	-Wmissing-include-dirs -Wundef -Wformat -Wformat-security -Wformat-y2k -Wnested-externs
	-Wno-unused-parameter -Wno-declaration-after-statement -Wno-missing-field-initializers
	-Werror=implicit-function-declaration -Wno-error=deprecated-declarations
	-DGLIB_VERSION_MIN_REQUIRED=GLIB_VERSION_2_72 -DGLIB_VERSION_MAX_ALLOWED=GLIB_VERSION_2_72
	-DG_LOG_USE_STRUCTURED=1 '-DPACKAGE="xfconf"' '-DPACKAGE_NAME="xfconf"'
	'-DPACKAGE_VERSION="4.21.2"' '-DVERSION="4.21.2"' '-DVERSION_SHORT="4.21"'
	'-DPACKAGE_STRING="xfconf 4.21.2"' '-DPACKAGE_DATADIR="/usr/share/xfconf"'
	'-DCOPYRIGHT_YEAR="2026"' '-DPACKAGE_LOCALE_DIR="/usr/share/locale"'
	'-DPACKAGE_BUGREPORT="https://gitlab.xfce.org/xfce/xfconf/-/issues"'
	'-DGETTEXT_PACKAGE="xfconf"' '-DPREFIX="/usr"' '-DBINDIR="/usr/bin"'
	'-DDATADIR="/usr/share"' '-DINCLUDEDIR="/usr/include"' '-DLIBDIR="/usr/lib64"'
	'-DLIBEXECDIR="/usr/lib"' '-DLOCALEDIR="/usr/share/locale"' '-DLOCALSTATEDIR="/var"'
	'-DSBINDIR="/usr/sbin"' '-DSYSCONFDIR="/etc"' -DHAVE_XFCE_REVISION_H=1
	-DENABLE_SYMBOL_VISIBILITY=1 '-DXFCONF_EXPORT=__attribute__((visibility("default")))'
	'-DXFCONF_SERVICE_NAME_PREFIX="org.xfce"' '-DXFCONF_SERVICE_PATH_PREFIX="/org/xfce"'
	-DBUILD_XFCONF_BACKEND_PERCHANNEL_XML=1 -DALIGNOF_GUCHAR=1 -DALIGNOF_GCHAR=1
	-DALIGNOF_GUINT16=2 -DALIGNOF_GINT16=2 -DALIGNOF_GUINT32=4 -DALIGNOF_GINT32=4
	-DALIGNOF_GUINT64=8 -DALIGNOF_GINT64=8 -DALIGNOF_GFLOAT=4 -DALIGNOF_GDOUBLE=8
	-DALIGNOF_GBOOLEAN=4 -DALIGNOF_GPOINTER=8 -DHAVE_FDATASYNC=1 -DHAVE_FSYNC=1
	-DHAVE_SYS_STAT_H=1 -DHAVE_SYS_TYPES_H=1 -DHAVE_SYS_WAIT_H=1 -DHAVE_ERRNO_H=1
	-DHAVE_FCNTL_H=1 -DHAVE_GRP_H=1 -DHAVE_SIGNAL_H=1 -DHAVE_STDLIB_H=1
	-DHAVE_STRING_H=1 -DHAVE_UNISTD_H=1 -pipe -frecord-gcc-switches -Wall -g -O2
	-flto=auto -fPIC -pthread '-DG_LOG_DOMAIN="xfconf"' -DLIBXFCONF_COMPILATION=1
	-MD -MQ xfconf/libxfconf-0.so.3.0.0.p/xfconf-cache.c.o
	-MF xfconf/libxfconf-0.so.3.0.0.p/xfconf-cache.c.o.d -o
	xfconf/libxfconf-0.so.3.0.0.p/xfconf-cache.c.o -c ../xfconf/xfconf-cache.c
	../xfconf/xfconf-cache.c:31:10: fatal error: common/xfconf-marshal.h: No such file
	or directory
	31 | #include "common/xfconf-marshal.h"

lore-0.8.6-alt1
	test lore-server/src/server.rs - server::server_main (line 164) - compile ... ok
	test lore-server/src/hooks/traits.rs - hooks::traits::HookError::rejected_default
	(line 294) ... ok
	test lore-server/src/hooks/traits.rs - hooks::traits::StatusCode (line 157) ... ok
	--
	test lore-server/src/hooks/registry.rs - hooks::registry (line 13) ... ok
	test lore-server/src/hooks/traits.rs - hooks::traits::HookError::rejected (line 267) ... ok
	test lore-server/src/plugins/mod.rs - plugins (line 57) ... ok
	--
	test result: ok. 0 passed; 0 failed; 0 ignored; 0 measured; 0 filtered out; finished
	in 0.00s
	error: 1 target failed:
	`-p lore-revision --test clone`

perl-CHI-0.61-alt1
	# 40 is not between 59 and 99
	#   Failed test 'Memory:l1_cache size = 40'
	#   at /usr/src/RPM/BUILD/CHI-0.61/blib/lib/CHI/t/Driver.pm line 1555.
	--
	# 2 is not between 3 and 5
	#   Failed test 'Memory:l1_cache keys = 2'
	#   at /usr/src/RPM/BUILD/CHI-0.61/blib/lib/CHI/t/Driver.pm line 1557.
	--
	t/Driver-Memory.t		      (Wstat: 512 (exited 2) Tests: 875 Failed: 2)
	Failed tests:  864-865
	Non-zero exit status: 2
	--
	Result: FAIL
	Failed 1/26 test programs. 2/1787 subtests failed.
	make: *** [Makefile:828: test_dynamic] Error 255

perl-Tie-DBI-1.08-alt1
	Result: FAIL
	Failed 1/2 test programs. 0/46 subtests failed.
	make: *** [Makefile:781: test_dynamic] Error 255

postgresql16-16.15-alt1
	1..220
	# 32 of 220 tests failed.
	# The differences that caused some tests to fail can be viewed in the file
	"/usr/src/RPM/BUILD/postgresql16-16.15/src/test/regress/regression.diffs".

prometheus-3.12.0-alt1
	time=2026-09-15T02:08:25.154Z level=INFO source=main.go:1701 msg="Completed
	loading of configuration file" db_storage=2.16µs remote_storage=1.77µs
	web_handler=760ns query_engine=1.01µs scrape=259.622µs scrape_sd=11.61µs
	notify=1.94µs notify_sd=1.08µs rules=2.57µs tracing=4.46µs
	filename=/usr/src/tmp/TestScrapeFailureLogFile2521751062/001/prometheus.yml
	totalDuration=529.483µs
	--- FAIL: TestRuntimeGOGCConfig (0.00s)
	--- FAIL: TestRuntimeGOGCConfig/incomplete_runtime_block (0.19s)
	reload_test.go:194: time=2026-09-15T02:08:26.218Z level=INFO source=main.go:1708
	msg="updated GOGC" old=100 new=75
	--
	/usr/src/RPM/BUILD/prometheus-3.12.0/cmd/prometheus/main_test.go:836
	Error:		Not equal:
	expected: 200

python3-module-aiosmtplib-5.1.2-alt1
	self._sslobj.do_handshake()
	ssl.SSLCertVerificationError: [SSL: CERTIFICATE_VERIFY_FAILED] certificate verify failed:
	unable to get local issuer certificate (_ssl.c:1082)
	The above exception was the direct cause of the following exception:
	--
	>	assert "Future exception was never retrieved" not in caplog.text
	E	AssertionError: assert 'Future exce...er retrieved' not in 'ERROR    as...F
	received\n'
	E
	E	  'Future exception was never retrieved' is contained here:
	E	    ERROR    asyncio:base_events.py:1886 Future exception was never retrieved
	E	    future: <Future finished exception=SMTPServerDisconnected('Unexpected
	EOF received')>
	--
	------------------------------ Captured log call -------------------------------
	ERROR	 asyncio:base_events.py:1886 Future exception was never retrieved
	future: <Future finished exception=SMTPServerDisconnected('Unexpected EOF received')>
	--
	=========================== short test summary info ============================
	FAILED tests/test_protocol.py::test_protocol_exception_cleanup_warning - Asse...
	================== 1 failed, 357 passed, 2 warnings in 3.69s ===================
	INFO	 : Command's result: FAILURE
	INFO	 : Command's error: Command '['python3', '-m', 'pytest', '-vra']' returned
	non-zero exit status 1.
	error: Bad exit status from /usr/src/tmp/rpmb-tmp.72tthY (%check)

python3-module-mkdocs-1.6.1-alt2
	..................................................................................................................................................................................................................................................................................................................................................................................................................................................F...............................................s..................................................s................s...............s........................................................................................................................
	FAIL: test_watch_with_broken_symlinks
	(mkdocs.tests.livereload_tests.BuildTests.test_watch_with_broken_symlinks)
	Traceback (most recent call last):
	--
	self.assertTrue(started_building.wait(timeout=10))
	AssertionError: False is not true
	Ran 687 tests in 18.476s
	FAILED (failures=1, skipped=4)
	INFO	 : Command's result: FAILURE
	INFO	 : Command's error: Command '['python3', '-m', 'unittest', 'discover', '-p',
	'*tests.py', 'mkdocs', '--top-level-directory', '.']' returned non-zero exit status 1.
	error: Bad exit status from /usr/src/tmp/rpmb-tmp.fstB6I (%check)

python3-module-oscrypto-1.3.0-alt1.1
	test_dump_certificate (tests.test_asymmetric.AsymmetricTests.test_dump_certificate) ... ok
	test_dump_private (tests.test_asymmetric.AsymmetricTests.test_dump_private) ... ERROR
	test_dump_private_openssl (tests.test_asymmetric.AsymmetricTests.test_dump_private_openssl)
	... ok
	--
	test_load_order (tests.test_init.InitTests.test_load_order) ... ok
	ERROR: test_dump_private (tests.test_asymmetric.AsymmetricTests.test_dump_private)
	Traceback (most recent call last):
	--
	iterations = int(iterations / fraction / 2.0)
	ZeroDivisionError: division by zero
	Ran 141 tests in 0.216s
	FAILED (errors=1)
	error: Bad exit status from /usr/src/tmp/rpmb-tmp.CWRqM8 (%check)

python3-module-paho-2.1.0-alt2
	==================================== ERRORS ====================================
	____________________ ERROR at teardown of test_01_will_set _____________________
	def fin():
	--
	>	    raise RuntimeError(f"Client {name} exited with code {proc.returncode},
	expected {expected_returncode}")
	E	    RuntimeError: Client 01-will-set.py exited with code -2, expected 0
	tests/lib/conftest.py:75: RuntimeError
	--
	KeyboardInterrupt
	_________ ERROR at teardown of test_03_publish_helper_qos1_disconnect __________
	def fin():
	--
	>	    raise RuntimeError(f"Client {name} exited with code {proc.returncode},
	expected {expected_returncode}")
	E	    RuntimeError: Client 03-publish-helper-qos1-disconnect.py exited with code
	-2, expected 0
	tests/lib/conftest.py:75: RuntimeError
	--
	=========================== short test summary info ============================
	ERROR tests/lib/test_01_will_set.py::test_01_will_set - RuntimeError: Client ...
	ERROR
	tests/lib/test_03_publish_helper_qos1_disconnect.py::test_03_publish_helper_qos1_disconnect
	============ 136 passed, 26 skipped, 1 xfailed, 2 errors in 35.41s =============
	INFO	 : Command's result: FAILURE
	INFO	 : Command's error: Command '['python3', '-m', 'pytest', '-o', 'addopts=',
	'tests']' returned non-zero exit status 1.
	error: Bad exit status from /usr/src/tmp/rpmb-tmp.2Z3vOx (%check)

python3-module-rapidfuzz-3.14.6-alt1
	=========================== short test summary info ============================
	FAILED tests/test_hypothesis.py::test_jaro_winkler_random - AssertionError
	======================== 1 failed, 420 passed in 18.90s ========================

python3-module-zict-3.0.0-alt1
	File "/usr/src/RPM/BUILD/python3-module-zict-3.0.0/zict/tests/utils_test.py", line 193,
	in check_different_keys_threadsafe
	f1.result()
	File "/usr/lib64/python3.14/concurrent/futures/_base.py", line 449, in result
	self._condition.wait(timeout)
	File "/usr/lib64/python3.14/threading.py", line 370, in wait
	waiter.acquire()
	+++++++++++++++++++++++++++++++++++ Timeout ++++++++++++++++++++++++++++++++++++
	error: Bad exit status from /usr/src/tmp/rpmb-tmp.GTofFR (%check)
	RPM build errors:
	Bad exit status from /usr/src/tmp/rpmb-tmp.GTofFR (%check)

shader-slang-2026.13.1-alt1
	/usr/src/RPM/BUILD/shader-slang-2026.13.1/source/core/slang-hash.h: In function
	'Slang::HashCode64 Slang::getHashCode(const char*, std::size_t)':
	/usr/src/RPM/BUILD/shader-slang-2026.13.1/source/core/slang-hash.h:138:45: error:
	'ankerl::unordered_dense::v5_0_0::detail::wyhash' has not been declared
	138 |	  return ankerl::unordered_dense::detail::wyhash::hash(buffer, len);
	--
	/usr/src/RPM/BUILD/shader-slang-2026.13.1/source/core/slang-hash.h: In function
	'Slang::HashCode64 Slang::getHashCode(const char*, std::size_t)':
	/usr/src/RPM/BUILD/shader-slang-2026.13.1/source/core/slang-hash.h:138:45: error:
	'ankerl::unordered_dense::v5_0_0::detail::wyhash' has not been declared
	138 |	  return ankerl::unordered_dense::detail::wyhash::hash(buffer, len);
	--
	/usr/src/RPM/BUILD/shader-slang-2026.13.1/source/core/../core/slang-hash.h: In function
	'Slang::HashCode64 Slang::getHashCode(const char*, std::size_t)':
	/usr/src/RPM/BUILD/shader-slang-2026.13.1/source/core/../core/slang-hash.h:138:45: error:
	'ankerl::unordered_dense::v5_0_0::detail::wyhash' has not been declared
	138 |	  return ankerl::unordered_dense::detail::wyhash::hash(buffer, len);
	--
	/usr/src/RPM/BUILD/shader-slang-2026.13.1/source/core/../core/../core/slang-hash.h:
	In function 'Slang::HashCode64 Slang::getHashCode(const char*, std::size_t)':
	/usr/src/RPM/BUILD/shader-slang-2026.13.1/source/core/../core/../core/slang-hash.h:138:45:
	error: 'ankerl::unordered_dense::v5_0_0::detail::wyhash' has not been declared
	138 |	  return ankerl::unordered_dense::detail::wyhash::hash(buffer, len);
	--
	/usr/src/RPM/BUILD/shader-slang-2026.13.1/source/core/slang-hash.h: In function
	'Slang::HashCode64 Slang::getHashCode(const char*, std::size_t)':
	/usr/src/RPM/BUILD/shader-slang-2026.13.1/source/core/slang-hash.h:138:45: error:
	'ankerl::unordered_dense::v5_0_0::detail::wyhash' has not been declared
	138 |	  return ankerl::unordered_dense::detail::wyhash::hash(buffer, len);
	--
	/usr/src/RPM/BUILD/shader-slang-2026.13.1/source/core/slang-hash.h: In function
	'Slang::HashCode64 Slang::getHashCode(const char*, std::size_t)':
	/usr/src/RPM/BUILD/shader-slang-2026.13.1/source/core/slang-hash.h:138:45: error:
	'ankerl::unordered_dense::v5_0_0::detail::wyhash' has not been declared
	138 |	  return ankerl::unordered_dense::detail::wyhash::hash(buffer, len);
	--
	/usr/src/RPM/BUILD/shader-slang-2026.13.1/source/core/../core/../core/../core/slang-hash.h:
	In function 'Slang::HashCode64 Slang::getHashCode(const char*, std::size_t)':
	/usr/src/RPM/BUILD/shader-slang-2026.13.1/source/core/../core/../core/../core/slang-hash.h:138:45:
	error: 'ankerl::unordered_dense::v5_0_0::detail::wyhash' has not been declared
	138 |	  return ankerl::unordered_dense::detail::wyhash::hash(buffer, len);
	--
	/usr/src/RPM/BUILD/shader-slang-2026.13.1/source/core/../../source/core/slang-hash.h:
	In function 'Slang::HashCode64 Slang::getHashCode(const char*, std::size_t)':
	/usr/src/RPM/BUILD/shader-slang-2026.13.1/source/core/../../source/core/slang-hash.h:138:45:
	error: 'ankerl::unordered_dense::v5_0_0::detail::wyhash' has not been declared
	138 |	  return ankerl::unordered_dense::detail::wyhash::hash(buffer, len);
	--
	/usr/src/RPM/BUILD/shader-slang-2026.13.1/source/core/slang-hash.h: In function
	'Slang::HashCode64 Slang::getHashCode(const char*, std::size_t)':
	/usr/src/RPM/BUILD/shader-slang-2026.13.1/source/core/slang-hash.h:138:45: error:
	'ankerl::unordered_dense::v5_0_0::detail::wyhash' has not been declared
	138 |	  return ankerl::unordered_dense::detail::wyhash::hash(buffer, len);
	--
	/usr/src/RPM/BUILD/shader-slang-2026.13.1/source/core/slang-hash.h: In function
	'Slang::HashCode64 Slang::getHashCode(const char*, std::size_t)':
	/usr/src/RPM/BUILD/shader-slang-2026.13.1/source/core/slang-hash.h:138:45: error:
	'ankerl::unordered_dense::v5_0_0::detail::wyhash' has not been declared
	138 |	  return ankerl::unordered_dense::detail::wyhash::hash(buffer, len);

	29 error logs REMOVED from the list
NetworkManager-1.58.1-alt1
binwalk3-3.1.0-alt1
bmake-20251111-alt1
bpftrace-0.27.0-alt1
codex-0.146.0-alt1
eartag-1.0.3-alt1
edk2-20260201-alt1
edk2-aarch64-20260201-alt1
fcoe-utils-1.0.34-alt3
flatlaf-3.7.1-alt3
fonts-ttf-IosevkaCurly-34.4.0-alt1
intel-compute-runtime-26.09.37435.1-alt1
javacc-gradle-plugin-4.0.3-alt1
kvmtool-3.18.0-alt9
lxc-6.0.5-alt3
mairix-0.24-alt1
openFPGALoader-1.1.1-alt1
python3-module-chess-1.11.2-alt1
python3-module-devpi-server-6.20.3-alt1
python3-module-easyprocess-1.1-alt2
python3-module-joblib-1.6.0-alt1
python3-module-pulsectl-asyncio-1.3.2-alt1
python3-module-pyqtgraph-0.14.0-alt1
python3-module-qtconsole-5.7.2-alt1.1
python3-module-slicer-0.0.8-alt4
python3-module-websockets-16.1-alt1
rdf-urdna-1.4-alt1
shim-16.1-alt3
ubdsrv-1.6-alt1

Total 375 error logs.


^ permalink raw reply	[flat|nested] only message in thread

only message in thread, other threads:[~2026-09-15  7:35 UTC | newest]

Thread overview: (only message) (download: mbox.gz / follow: Atom feed)
-- links below jump to the message on this page --
2026-09-15  7:35 [cyber] I: Sisyphus-20260915 x86_64 beehive_status: +21 -29 (375) ALT beekeeper

ALT Linux Sisyphus cybertalk

This inbox may be cloned and mirrored by anyone:

	git clone --mirror http://lore.altlinux.org/sisyphus-cybertalk/0 sisyphus-cybertalk/git/0.git

	# If you have public-inbox 1.1+ installed, you may
	# initialize and index your mirror using the following commands:
	public-inbox-init -V2 sisyphus-cybertalk sisyphus-cybertalk/ http://lore.altlinux.org/sisyphus-cybertalk \
		sisyphus-cybertalk@lists.altlinux.org sisyphus-cybertalk@lists.altlinux.ru sisyphus-cybertalk@lists.altlinux.com
	public-inbox-index sisyphus-cybertalk

Example config snippet for mirrors.
Newsgroup available over NNTP:
	nntp://lore.altlinux.org/org.altlinux.lists.sisyphus-cybertalk


AGPL code for this site: git clone https://public-inbox.org/public-inbox.git