* [cyber] I: p10-20260913 x86_64 beehive_status: +16 -16 (102)
@ 2026-09-13 20:52 ALT beekeeper
0 siblings, 0 replies; only message in thread
From: ALT beekeeper @ 2026-09-13 20:52 UTC (permalink / raw)
To: sisyphus-cybertalk
16 NEW error logs
SPICE-0.15.0-alt1
[13/173] Compiling C object
subprojects/spice-common/tests/test_marshallers.p/meson-generated_.._generated_test_marshallers.c.o
FAILED:
subprojects/spice-common/tests/test_marshallers.p/meson-generated_.._generated_test_marshallers.c.o
cc -Isubprojects/spice-common/tests/test_marshallers.p -Isubprojects/spice-common/tests
-I../subprojects/spice-common/tests -Isubprojects/spice-common
-I../subprojects/spice-common -I/usr/include/spice-1 -I/usr/include/glib-2.0
-I/usr/lib64/glib-2.0/include -I/usr/include/pixman-1 -I/usr/include/opus
-I/usr/include/cacard -fdiagnostics-color=always -D_FILE_OFFSET_BITS=64 -Wall
-Winvalid-pch -Wextra -O2 -g '-DG_LOG_DOMAIN="Spice"' -Wno-unused-parameter
-DGLIB_VERSION_MIN_REQUIRED=GLIB_VERSION_2_38 -DGLIB_VERSION_MAX_ALLOWED=GLIB_VERSION_2_38
-pipe -frecord-gcc-switches -Wall -g -O2 -MD -MQ
subprojects/spice-common/tests/test_marshallers.p/meson-generated_.._generated_test_marshallers.c.o
-MF
subprojects/spice-common/tests/test_marshallers.p/meson-generated_.._generated_test_marshallers.c.o.d
-o
subprojects/spice-common/tests/test_marshallers.p/meson-generated_.._generated_test_marshallers.c.o
-c subprojects/spice-common/tests/generated_test_marshallers.c
In file included from subprojects/spice-common/tests/generated_test_marshallers.c:20:
../subprojects/spice-common/tests/test-marshallers.h:6:10: fatal error:
generated_test_messages.h: No such file or directory
6 | #include "generated_test_messages.h"
altlinux-freedesktop-menu-0.69-alt1
+ j=altlinux-webdevelopment.directory
+ grep altlinux-webdevelopment.directory ignore.list
+ grep 'Name\[ru\]=' desktop-directories/altlinux-webdevelopment.directory
+ for i in desktop-directories/*.directory
++ basename desktop-directories/altlinux-xfce.directory
+ j=altlinux-xfce.directory
+ grep altlinux-xfce.directory ignore.list
+ rm ignore.list
+ '[' 0 -gt 0 ']'
+ exit 1
bind-9.16.50-alt3
0inputs+0outputs (0major+34206minor)pagefaults 0swaps
Error: no exit code is found, failure.
casr-2.12.1-alt0.p10.1
test test_casr_san_sigbus ... ignored
test test_casr_ubsan ... FAILED
test test_casr_python ... ok
--
thread 'test_casr_ubsan' panicked at casr/tests/tests.rs:3870:43:
called `Result::unwrap()` on an `Err` value: Os { code: 2, kind: NotFound, message:
"No such file or directory" }
note: run with `RUST_BACKTRACE=1` environment variable to display a backtrace
--
test_casr_ubsan
test result: FAILED. 54 passed; 1 failed; 5 ignored; 0 measured; 38 filtered out;
finished in 92.18s
error: test failed, to rerun pass `-p casr --test tests`
fscrypt-0.3.0.0.5.e479779-alt1
make: Entering directory '/usr/src/RPM/BUILD/fscrypt-0.3.0.0.5.e479779'
make: git: No such file or directory
make: Leaving directory '/usr/src/RPM/BUILD/fscrypt-0.3.0.0.5.e479779'
--
make: Entering directory '/usr/src/RPM/BUILD/fscrypt-0.3.0.0.5.e479779'
make: git: No such file or directory
make: Leaving directory '/usr/src/RPM/BUILD/fscrypt-0.3.0.0.5.e479779'
--
0inputs+0outputs (0major+37121minor)pagefaults 0swaps
Error: no exit code is found, failure.
glibc-6:2.32-alt5.p10.7
UNSUPPORTED: sunrpc/tst-svc_register
FAIL: time/tst-cpuclock1
Summary of test results:
--
+ rc=2
+ grep '^FAIL:' build-x86_64-linux/tests.sum
+ cut '-d ' -f2-
--
==> build-x86_64-linux/time/tst-cpuclock1.test-result <==
FAIL: time/tst-cpuclock1
original exit status 1
ima-evm-utils-1.3.2-alt1
0inputs+0outputs (0major+37592minor)pagefaults 0swaps
Error: no exit code is found, failure.
kernel-image-std-def-2:5.10.268-alt1
0inputs+0outputs (0major+36162minor)pagefaults 0swaps
Error: no exit code is found, failure.
error: Bad exit status from /usr/src/tmp/rpm-tmp.33873 (%check)
kernel-modules-lkrg-un-def-0.9.8-alt3.393658.1
0inputs+0outputs (0major+36479minor)pagefaults 0swaps
Error: no exit code is found, failure.
+ exit 1
litmus-0.14.0-alt1.git.9fbc73d
checking for a BSD-compatible install... /bin/install -c
./configure: line 2846: syntax error near unexpected token `0,'
./configure: line 2846: `NE_REQUIRE_VERSIONS(0, 26 27 28 29 30 31)'
meschach-1.2-alt1.b.3
Verifying ELF objects in /usr/src/tmp/meschach-buildroot
(arch=normal,fhs=normal,lfs=relaxed,lint=relaxed,rpath=normal,stack=normal,textrel=normal,unresolved=normal)
verify-elf: ERROR: ./usr/lib64/libmeschach.so.0: undefined symbol: bd_free
verify-elf: ERROR: ./usr/lib64/libmeschach.so.0: undefined symbol: Usolve
verify-elf: ERROR: ./usr/lib64/libmeschach.so.0: undefined symbol: trieig
verify-elf: ERROR: ./usr/lib64/libmeschach.so.0: undefined symbol: square
verify-elf: ERROR: ./usr/lib64/libmeschach.so.0: undefined symbol: rot_vec
verify-elf: ERROR: ./usr/lib64/libmeschach.so.0: undefined symbol: givens
verify-elf: ERROR: ./usr/lib64/libmeschach.so.0: undefined symbol: _v_norm2
php8.1-pcntl-8.1.34-alt1
0inputs+0outputs (0major+37238minor)pagefaults 0swaps
Error: no exit code is found, failure.
php8.3-pcntl-8.3.31-alt1
0inputs+0outputs (0major+36882minor)pagefaults 0swaps
Error: no exit code is found, failure.
python3-module-setuptools-1:57.4.0-alt2.p10.1
INTERNALERROR> > assert False, formatted_error
INTERNALERROR> E AssertionError: Traceback (most recent call last):
INTERNALERROR> E File "/usr/lib/python3/site-packages/_pytest/main.py",
line 268, in wrap_session
--
INTERNALERROR> E handler = _signal.signal(_enum_to_int(signalnum),
_enum_to_int(handler))
INTERNALERROR> E ValueError: signal only works in main thread of the main
interpreter
INTERNALERROR>
--
INTERNALERROR> assert not crashitem, (crashitem, node)
INTERNALERROR> AssertionError: ('setuptools/tests/test_packageindex.py::test_REL_DoS',
<WorkerController gw14>)
============ 560 passed, 18 skipped, 3 xfailed, 1 xpassed in 10.49s ============
ERROR: InvocationError for command
/usr/src/RPM/BUILD/python3-module-setuptools-57.4.0/.tox/py3/bin/pytest --ignore
pavement.py -vra (exited with code 3)
py3 finish: run-test after 10.83 seconds
--
___________________________________ summary ____________________________________
ERROR: py3: commands failed
trace-cmd-3.1.6-alt2
0inputs+0outputs (0major+36198minor)pagefaults 0swaps
Error: no exit code is found, failure.
tuned-2.22.1-alt1
0inputs+0outputs (0major+35367minor)pagefaults 0swaps
Error: no exit code is found, failure.
16 error logs REMOVED from the list
SNNS-4.3-alt1.1.1.1
atlas-3.9.35-alt1.qa1
clementine-1.4.0-alt4.git67a947f11
dropbear-2022.83-alt2
e2fsprogs-1.47.1.0.10.ad56-alt1.p10.1
fsverity-utils-1.4-alt1
kernel-image-xenomai-4.19.252-alt1.cip78.23
kernel-modules-dm-secdel-un-def-2:1.0.9-alt1.393658.1
kernel-modules-ipt-so-std-def-1.0-alt9.330508.1
libredland-1.0.17-alt3
os-autoinst-4.6-alt14
perl-Crypt-Random-1.54-alt1
perl-Gearman-2.004.015-alt1_5
php8.2-pcntl-8.2.31-alt1
proftpd-1.3.6-alt0.4.ga73dbfe3b
tripso-1.2-alt1
Total 102 error logs.
^ permalink raw reply [flat|nested] only message in thread
only message in thread, other threads:[~2026-09-13 20:52 UTC | newest]
Thread overview: (only message) (download: mbox.gz / follow: Atom feed)
-- links below jump to the message on this page --
2026-09-13 20:52 [cyber] I: p10-20260913 x86_64 beehive_status: +16 -16 (102) ALT beekeeper
ALT Linux Sisyphus cybertalk
This inbox may be cloned and mirrored by anyone:
git clone --mirror http://lore.altlinux.org/sisyphus-cybertalk/0 sisyphus-cybertalk/git/0.git
# If you have public-inbox 1.1+ installed, you may
# initialize and index your mirror using the following commands:
public-inbox-init -V2 sisyphus-cybertalk sisyphus-cybertalk/ http://lore.altlinux.org/sisyphus-cybertalk \
sisyphus-cybertalk@lists.altlinux.org sisyphus-cybertalk@lists.altlinux.ru sisyphus-cybertalk@lists.altlinux.com
public-inbox-index sisyphus-cybertalk
Example config snippet for mirrors.
Newsgroup available over NNTP:
nntp://lore.altlinux.org/org.altlinux.lists.sisyphus-cybertalk
AGPL code for this site: git clone https://public-inbox.org/public-inbox.git