ALT Linux Sisyphus cybertalk
 help / color / mirror / Atom feed
* [cyber] I: Sisyphus-20260913 x86_64 beehive_status: +14 -76 (386)
@ 2026-09-13 14:41 ALT beekeeper
  0 siblings, 0 replies; only message in thread
From: ALT beekeeper @ 2026-09-13 14:41 UTC (permalink / raw)
  To: sisyphus-cybertalk

	14 NEW error logs

edk2-aarch64-20260201-alt1
	68 |   ParserBlackBox<CVfrDLGLexer, EfiVfrParser, ANTLRToken> VfrParser(File);
	Pccts/h/PBlackBox.h:88:14: error: no matching function for call to
	'ANTLRTokenBuffer::ANTLRTokenBuffer(CVfrDLGLexer*&)'
	88 |	   pipe = new ANTLRTokenBuffer(scan);
	--
	Pccts/h/ATokenBuffer.h:55:22: note: no known conversion for argument 1 from 'CVfrDLGLexer*'
	to 'const ANTLRTokenBuffer&'
	Pccts/h/PBlackBox.h:90:13: error: 'class CVfrDLGLexer' has no member named 'setToken'
	90 |	   scan->setToken(tok);

fonts-ttf-IosevkaTermCurly-34.7.0-alt1
	[ACTION] Create TTF 'dist/IosevkaCurly/TTF-Unhinted/IosevkaCurly-ExtendedHeavyItalic.ttf'
	[ACTION] Create TTF 'dist/IosevkaCurly/TTF-Unhinted/IosevkaCurly-Thin.ttf'
	[ACTION] Create TTF 'dist/IosevkaCurly/TTF-Unhinted/IosevkaCurly-ExtendedThin.ttf'
	[ACTION] Create TTF 'dist/IosevkaCurly/TTF-Unhinted/IosevkaCurly-ThinOblique.ttf'
	[ACTION] Create TTF 'dist/IosevkaCurly/TTF-Unhinted/IosevkaCurly-ExtendedThinOblique.ttf'
	[ACTION] Hint TTF 'dist/IosevkaCurly/TTF/IosevkaCurly-Heavy.ttf' <-
	'dist/IosevkaCurly/TTF-Unhinted/IosevkaCurly-Heavy.ttf'
	/usr/src/tmp/rpmb-tmp.LNOBM6: line 134: 1359950 CPU time limit exceeded npm run build
	-- ttf::IosevkaTermCurly
	error: Bad exit status from /usr/src/tmp/rpmb-tmp.LNOBM6 (%build)
	RPM build errors:
	Bad exit status from /usr/src/tmp/rpmb-tmp.LNOBM6 (%build)

fonts-ttf-IosevkaTermSlab-34.7.0-alt1
	[ACTION] Create TTF 'dist/IosevkaSlab/TTF-Unhinted/IosevkaSlab-HeavyItalic.ttf'
	[ACTION] Create TTF 'dist/IosevkaSlab/TTF-Unhinted/IosevkaSlab-ExtendedHeavyItalic.ttf'
	[ACTION] Create TTF 'dist/IosevkaSlab/TTF-Unhinted/IosevkaSlab-Thin.ttf'
	[ACTION] Create TTF 'dist/IosevkaSlab/TTF-Unhinted/IosevkaSlab-ExtendedThin.ttf'
	[ACTION] Create TTF 'dist/IosevkaSlab/TTF-Unhinted/IosevkaSlab-ThinOblique.ttf'
	[ACTION] Create TTF 'dist/IosevkaSlab/TTF-Unhinted/IosevkaSlab-ExtendedThinOblique.ttf'
	/usr/src/tmp/rpmb-tmp.RG2YwW: line 134: 878221 CPU time limit exceeded npm run build --
	ttf::IosevkaTermSlab
	error: Bad exit status from /usr/src/tmp/rpmb-tmp.RG2YwW (%build)
	RPM build errors:
	Bad exit status from /usr/src/tmp/rpmb-tmp.RG2YwW (%build)

gnuplot-1:6.0.4-alt1
	make[1]: Leaving directory '/usr/src/RPM/BUILD/gnuplot-6.0.4/docs'
	make[1]: *** Deleting file 'gnuplot.tex'
	make[1]: Entering directory '/usr/src/RPM/BUILD/gnuplot-6.0.4/docs'
	./doc2tex -figures ./gnuplot.doc gnuplot.tex
	make[1]: *** [Makefile:1101: gnuplot.tex] Segmentation fault
	make[1]: Leaving directory '/usr/src/RPM/BUILD/gnuplot-6.0.4/docs'
	make: *** [Makefile:1104: pdf] Error 2
	error: Bad exit status from /usr/src/tmp/rpmb-tmp.U1gmp7 (%build)
	RPM build errors:
	Bad exit status from /usr/src/tmp/rpmb-tmp.U1gmp7 (%build)

gz-sensors-10.0.2-alt1
	Expected: true
	[  FAILED  ]
	DopplerVelocityLogTests/DopplerVelocityLogTest.BottomTrackingWhileStatic/ogre2, where
	GetParam() = "ogre2" (1331 ms)
	[ RUN	   ]
	DopplerVelocityLogTests/DopplerVelocityLogTest.WaterMassTrackingWhileStatic/ogre2
	--
	[  PASSED  ] 3 tests.
	[  FAILED  ] 1 test, listed below:
	[  FAILED  ]
	DopplerVelocityLogTests/DopplerVelocityLogTest.BottomTrackingWhileStatic/ogre2, where
	GetParam() = "ogre2"
	1 FAILED TEST
	Start 25: check_INTEGRATION_dvl
	--
	55/55 Test #55: check_INTEGRATION_navsat .........................   Passed    0.02 sec
	98% tests passed, 1 tests failed out of 55
	Total Test time (real) =  33.02 sec
	The following tests FAILED:
	24 - INTEGRATION_dvl (Failed)

javassist-0:3.30.2-alt1
	[ERROR] javassist.JvstTest4.testJIRA150 -- Time elapsed: 0.213 s <<< FAILURE!
	junit.framework.AssertionFailedError: performance test (the next try may succeed):
	125 < 6 * 17
	at junit.framework.Assert.fail(Assert.java:57)

libopenimageio-3.1.17.0-alt1
	/usr/src/RPM/BUILD/libopenimageio-3.1.17.0/src/libutil/timer_test.cpp:89:
	FAILED: selective() == 0.1
	values were '0.122747' and '0.1', diff was 0.0227593
	/usr/src/RPM/BUILD/libopenimageio-3.1.17.0/src/libutil/timer_test.cpp:93:
	FAILED: selective() == 0.1
	values were '0.12276' and '0.1', diff was 0.0227603
	--
	simd sqrt	:   27.8 ns (+/- 18.8ns),  144.1 Mvals/s, 4e+01 Mcalls/s
	ERRORS!
	122/148 Test #111: ffmpeg ..................................   Passed	27.25 sec
	--
	148/148 Test   #5: oiiotool ................................   Passed  243.05 sec
	99% tests passed, 1 tests failed out of 148
	Total Test time (real) = 243.08 sec
	The following tests FAILED:
	134 - unit_timer (Failed)

libta-lib-0.4.0-alt4
	x86_64-alt-linux-gcc -pipe -frecord-gcc-switches -Wall -g -O2 -flto=auto -o
	gen_code gen_code-gen_code.o  -L/usr/src/RPM/BUILD/ta-lib-0.4.0/src/ta_common
	-L/usr/src/RPM/BUILD/ta-lib-0.4.0/src/ta_abstract
	-L/usr/src/RPM/BUILD/ta-lib-0.4.0/src/ta_func
	/usr/src/RPM/BUILD/ta-lib-0.4.0/src/ta_common/.libs/libta_common.a
	/usr/src/RPM/BUILD/ta-lib-0.4.0/src/ta_abstract/.libs/libta_abstract_gc.a
	/usr/src/RPM/BUILD/ta-lib-0.4.0/src/ta_func/.libs/libta_func.a -lm -lpthread -ldl
	ld: error: gen_code-gen_code.o: ELF section name out of range
	collect2: error: ld returned 1 exit status
	make[2]: *** [Makefile:222: gen_code] Error 1
	--
	x86_64-alt-linux-gcc -pipe -frecord-gcc-switches -Wall -g -O2 -flto=auto -o
	gen_code gen_code-gen_code.o  -L/usr/src/RPM/BUILD/ta-lib-0.4.0/src/ta_common
	-L/usr/src/RPM/BUILD/ta-lib-0.4.0/src/ta_abstract
	-L/usr/src/RPM/BUILD/ta-lib-0.4.0/src/ta_func
	/usr/src/RPM/BUILD/ta-lib-0.4.0/src/ta_common/.libs/libta_common.a
	/usr/src/RPM/BUILD/ta-lib-0.4.0/src/ta_abstract/.libs/libta_abstract_gc.a
	/usr/src/RPM/BUILD/ta-lib-0.4.0/src/ta_func/.libs/libta_func.a -lm -lpthread -ldl
	ld: error: gen_code-gen_code.o: ELF section name out of range
	collect2: error: ld returned 1 exit status
	make[3]: *** [Makefile:222: gen_code] Error 1
	--
	x86_64-alt-linux-gcc -pipe -frecord-gcc-switches -Wall -g -O2 -flto=auto -o
	gen_code gen_code-gen_code.o  -L/usr/src/RPM/BUILD/ta-lib-0.4.0/src/ta_common
	-L/usr/src/RPM/BUILD/ta-lib-0.4.0/src/ta_abstract
	-L/usr/src/RPM/BUILD/ta-lib-0.4.0/src/ta_func
	/usr/src/RPM/BUILD/ta-lib-0.4.0/src/ta_common/.libs/libta_common.a
	/usr/src/RPM/BUILD/ta-lib-0.4.0/src/ta_abstract/.libs/libta_abstract_gc.a
	/usr/src/RPM/BUILD/ta-lib-0.4.0/src/ta_func/.libs/libta_func.a -lm -lpthread -ldl
	ld: error: gen_code-gen_code.o: ELF section name out of range
	collect2: error: ld returned 1 exit status
	make[2]: *** [Makefile:222: gen_code] Error 1

nushell-0.114.1-alt1
	test commands::job::tagged_job_recv_filters_untagged_messages ... ok
	test commands::network::http::get::http_get_with_socks5_proxy::case_2_http_proxy ... FAILED
	test commands::idx::idx_search_bracket_pattern_finds_content ... ok
	--
	---- serial - commands::network::http::get::http_get_with_socks5_proxy::case_2_http_proxy
	stdout ----
	Error: TestError {
	location: crates/nu-command/tests/commands/network/http/get.rs:397:62,
	--
	serial: commands::network::http::get::http_get_with_socks5_proxy::case_2_http_proxy
	test result: FAILED. 2455 passed; 1 failed; 28 ignored; 0 filtered out; across 9 groups,
	finished in 39.46s
	error: test failed, to rerun pass `-p nu-command --test tests`
	Caused by:

perl-Badger-0.16-alt1
	Result: FAIL
	Failed 1/70 test programs. 0/1739 subtests failed.
	make: *** [Makefile:866: test_dynamic] Error 255

perl-Sys-Mmap-0.20-alt1
	Result: FAIL
	Failed 1/2 test programs. 0/13 subtests failed.
	make: *** [Makefile:962: test_dynamic] Error 255

pkcs11-provider-1.2.0-alt3
	Full log written to
	/usr/src/RPM/BUILD/pkcs11-provider-1.2.0/x86_64-alt-linux/meson-logs/testlog.txt
	FAILED: [code=1] meson-internal__test
	/usr/bin/meson test --no-rebuild --print-errorlogs

python3-module-serializable-2.1.0-alt1
	self.assertDictEqual(dd1, dd2, msg)
	E   AssertionError: {'_id[1006 chars]-ref-2', '_references': ({'_ref': 'sub-ref-3',[790
	chars]k'>"} != {'_id[1006 chars]-ref-3', '_references': ({'_ref': 'sub-ref-2',[790
	chars]k'>"}
	E     {'%conv': "<class 'tests.model.Book'>",
	--
	=========================== short test summary info ============================
	FAILED tests/test_xml.py::TestXml::test_deserializable_with_unknown_ignored_attributes
	FAILED tests/test_xml.py::TestXml::test_deserializable_with_unknown_ignored_elements
	========================= 2 failed, 89 passed in 0.12s =========================
	INFO	 : Command's result: FAILURE
	INFO	 : Command's error: Command '['python3', '-m', 'pytest']' returned non-zero
	exit status 1.
	error: Bad exit status from /usr/src/tmp/rpmb-tmp.v51jLs (%check)

util-linux-2.39.2-alt3
	}}}-diff
	lsfd: read-only regular file			    ... FAILED (lsfd/mkfds-ro-regular-file)
	lscpu: lscpu: [12] sparc64			     ... OK
	--
	}}}-diff
	script: options: [05] size			      ... FAILED (script/options-size)
	script: options					      ... FAILED (1 from 5 sub-tests)
	libfdisk: mkpart-full: [11] gpt-err-overlap		... OK
	--
	script: race conditions				      ... OK
	2 tests of 247 FAILED
	lsfd/mkfds-ro-regular-file

	76 error logs REMOVED from the list
adriconf-2.7.3-alt1
aeskulap-0.2.2-alt9.git8787e95
angus-mail-2.0.5-alt1.1
ardour-9.8-alt1
arpage-0.3.3-alt3_25
art-1.26.8-alt1
auditd-plugin-clickhouse-lite-0.1.9-alt3
cdrdao-1.2.6-alt1
cherrytree-1.7.2-alt1
cpu-x-5.4.0-alt3
dune3d-1.4.0-alt1
eiciel-0.10.1-alt1_3
fontforge-20251009-alt1
gambit-4.9.7-alt5
gimagereader-3.4.3-alt2
gip-1.7.0-alt3
gnome-quod-0.2.3-alt5
gnome-system-monitor-50.0-alt1
grub-customizer-5.2.8-alt1
gsmartcontrol-2.0.2-alt1
guile-fibers-1.4.3-alt1
guitarix-0.47.0-alt2
gz-rendering-10.0.2-alt1
gz-sim-10.5.0-alt1
horizon-2.7.2-alt1
imgdiff-1.0-alt3
infector-0.4-alt2.qa1.1
inkscape-1.4.4-alt2
libflowcanvas-0.7.1-alt3
libfprint2-1.94.100-alt1
libglademm-2.6.7-alt3
libglibmm-2.66.9-alt1
libglibmm2.68-2.88.1-alt1
libgnomecanvasmm-2.26.0-alt3.2
libgtkmm3-3.24.11-alt1
libgtkmm4-4.22.0-alt1
libgtksourceviewmm3-3.21.3-alt1
libgtkspellmm3-3.0.5-alt1
libnotifymm-0.6.1-alt2
mapsoft2-2.10-alt1
mate-eiciel-1.20.1-alt1
mate-system-monitor-1:1.28.1-alt1
mazen-1.0.1-alt2
moc-2.6.0-alt0.9
mysql-workbench-community-8.0.47-alt5
nautilus-50.2.2-alt1
nitrogen-1.6.1-alt1
nwg-launchers-0.7.1.1-alt2
open-vm-tools-13.1.0-alt2
opensearch-3.6.0-alt5
paman-0.9.4-alt4.qa3
paprefs-1.2-alt1
pavucontrol-6.2-alt1
pavumeter-0.9.3-alt3.qa3
perl-HTML-Widget-1.11-alt3
python3-module-aiosmtplib-5.1.2-alt1
python3-module-easyprocess-1.1-alt2
python3-module-fabio-2025.10.0-alt1
python3-module-git-pandas-2.5.0-alt2.git2789b49d
python3-module-jsonpath-python-1.1.6-alt1
python3-module-numcodecs-0.16.5-alt1
qt5-pim-5.15-alt1
radiotray-ng-0.2.10.1-alt1
rawtherapee-5.13-alt1
snes9x-1.63-alt2.1
stockfish-18-alt1
subtitleeditor-0.56.2-alt1
synfigstudio-1.5.5-alt1
terminator-2.1.5-alt1.1
transmission-4.1.3-alt2
vidcom-0.83-alt1
waybar-0.15.0-alt1
wayfire-config-manager-0.11.0-alt1
wf-shell-0.11.0-alt1
wl-screenrec-0.2.0-alt2
workrave-1.11.1-alt1

Total 386 error logs.


^ permalink raw reply	[flat|nested] only message in thread

only message in thread, other threads:[~2026-09-13 14:41 UTC | newest]

Thread overview: (only message) (download: mbox.gz / follow: Atom feed)
-- links below jump to the message on this page --
2026-09-13 14:41 [cyber] I: Sisyphus-20260913 x86_64 beehive_status: +14 -76 (386) ALT beekeeper

ALT Linux Sisyphus cybertalk

This inbox may be cloned and mirrored by anyone:

	git clone --mirror http://lore.altlinux.org/sisyphus-cybertalk/0 sisyphus-cybertalk/git/0.git

	# If you have public-inbox 1.1+ installed, you may
	# initialize and index your mirror using the following commands:
	public-inbox-init -V2 sisyphus-cybertalk sisyphus-cybertalk/ http://lore.altlinux.org/sisyphus-cybertalk \
		sisyphus-cybertalk@lists.altlinux.org sisyphus-cybertalk@lists.altlinux.ru sisyphus-cybertalk@lists.altlinux.com
	public-inbox-index sisyphus-cybertalk

Example config snippet for mirrors.
Newsgroup available over NNTP:
	nntp://lore.altlinux.org/org.altlinux.lists.sisyphus-cybertalk


AGPL code for this site: git clone https://public-inbox.org/public-inbox.git