* [cyber] I: p11-20260913 x86_64 beehive_status: +9 -14 (92)
@ 2026-09-13 7:07 ALT beekeeper
0 siblings, 0 replies; only message in thread
From: ALT beekeeper @ 2026-09-13 7:07 UTC (permalink / raw)
To: sisyphus-cybertalk
9 NEW error logs
casr-2.12.1-alt1
test test_casr_san_sigbus ... ignored
test test_casr_ubsan ... FAILED
test test_casr_ignore_frames ... ok
--
thread 'test_casr_ubsan' (4033997) panicked at casr/tests/tests.rs:3870:43:
called `Result::unwrap()` on an `Err` value: Os { code: 2, kind: NotFound, message:
"No such file or directory" }
note: run with `RUST_BACKTRACE=1` environment variable to display a backtrace
--
test_casr_ubsan
test result: FAILED. 55 passed; 1 failed; 5 ignored; 0 measured; 37 filtered out;
finished in 79.77s
error: test failed, to rerun pass `-p casr --test tests`
Running unittests src/lib.rs (target/release/deps/libcasr-c7c32ce512d29aea)
--
test result: ok. 0 passed; 0 failed; 0 ignored; 0 measured; 0 filtered out; finished
in 0.00s
error: 1 target failed:
`-p casr --test tests`
cppcheck-2.16.1-alt2
[ 57%] Building CXX object lib/CMakeFiles/cppcheck-core.dir/build/mc_vf_subfunction.cpp.o
cd /usr/src/RPM/BUILD/cppcheck-2.16.1/x86_64-alt-linux/lib &&
/usr/bin/c++ -DFILESDIR=\"/usr/share/Cppcheck\" -DHAVE_RULES
-I/usr/src/RPM/BUILD/cppcheck-2.16.1/x86_64-alt-linux/lib
-I/usr/src/RPM/BUILD/cppcheck-2.16.1/lib -I/usr/src/RPM/BUILD/cppcheck-2.16.1/externals
-I/usr/src/RPM/BUILD/cppcheck-2.16.1/externals/tinyxml2
-I/usr/src/RPM/BUILD/cppcheck-2.16.1/externals/picojson
-I/usr/src/RPM/BUILD/cppcheck-2.16.1/externals/simplecpp -isystem /usr/include/pcre
-pipe -frecord-gcc-switches -Wall -g -O2 -flto=auto -Wno-error=return-type -O2
-DNDEBUG -std=gnu++11 -O2 -pedantic -Wall -Wextra -Wcast-qual -Wfloat-equal
-Wmissing-declarations -Wmissing-format-attribute -Wno-long-long -Wpacked
-Wredundant-decls -Wundef -Wno-missing-field-initializers -Wno-missing-braces
-Wno-sign-compare -Wno-multichar -Woverloaded-virtual -pipe -Wno-maybe-uninitialized
-Wsuggest-attribute=noreturn -Wno-shadow -Wuseless-cast -Winvalid-pch -include
/usr/src/RPM/BUILD/cppcheck-2.16.1/x86_64-alt-linux/lib/CMakeFiles/cppcheck-core.dir/cmake_pch.hxx
-MD -MT lib/CMakeFiles/cppcheck-core.dir/build/mc_vf_subfunction.cpp.o
-MF CMakeFiles/cppcheck-core.dir/build/mc_vf_subfunction.cpp.o.d
-o CMakeFiles/cppcheck-core.dir/build/mc_vf_subfunction.cpp.o -c
/usr/src/RPM/BUILD/cppcheck-2.16.1/x86_64-alt-linux/lib/build/mc_vf_subfunction.cpp
gmake[2]: Leaving directory '/usr/src/RPM/BUILD/cppcheck-2.16.1/x86_64-alt-linux'
gmake[1]: Entering directory '/usr/src/RPM/BUILD/cppcheck-2.16.1/x86_64-alt-linux'
[ 58%] Built target cppcheck-core
gmake[1]: Leaving directory '/usr/src/RPM/BUILD/cppcheck-2.16.1/x86_64-alt-linux'
gmake: *** [Makefile:146: all] Error 2
error: Bad exit status from /usr/src/tmp/rpmb-tmp.BJvZ1n (%build)
RPM build errors:
Bad exit status from /usr/src/tmp/rpmb-tmp.BJvZ1n (%build)
java-1.8.0-openjdk-0:1.8.0.504.b01-alt1
Unparseable macro: % by %%)
Macro %z not found
ignored self-provides: java-1.8.0-openjdk = 0:1.8.0.504.b01-alt1
ignored self-provides: java-1.8.0-openjdk-headless = 0:1.8.0.504.b01-alt1
ignored self-provides: java-1.8.0-openjdk-devel = 0:1.8.0.504.b01
ignored self-provides: java-1.8.0-openjdk-demo = 0:1.8.0.504.b01-alt1
ignored self-provides: java-1.8.0-openjdk-src = 0:1.8.0.504.b01-alt1
ignored self-provides: java-1.8.0-openjdk-javadoc = 0:1.8.0.504.b01-alt1
Unparseable macro: %.*}"
Bad exit status from /usr/src/tmp/rpmb-tmp.09IiMm (%build)
openFPGALoader-0.13.1-alt1
hex file flash
/usr/src/RPM/BUILD/openFPGALoader-0.13.1/doc/vendors/intel.rst:87: ERROR: Error in
"code-block" directive:
maximum 1 argument(s) allowed, 5 supplied.
--
doctree = pickle.loads(serialised)
_pickle.UnpicklingError: pickle data was truncated
The above exception was the direct cause of the following exception:
--
raise ExtensionError(
sphinx.errors.ExtensionError: Handler <bound method TocTreeCollector.get_updated_docs
of <sphinx.environment.collectors.toctree.TocTreeCollector object at 0x7fd54a653230>>
for event 'env-get-updated' threw an exception (exception: pickle data was truncated)
Extension error (sphinx.environment.collectors.toctree):
--
hex file flash
/usr/src/RPM/BUILD/openFPGALoader-0.13.1/doc/vendors/intel.rst:87: ERROR: Error in
"code-block" directive:
maximum 1 argument(s) allowed, 5 supplied.
--
doctree = pickle.loads(serialised)
_pickle.UnpicklingError: pickle data was truncated
The above exception was the direct cause of the following exception:
--
raise ExtensionError(
sphinx.errors.ExtensionError: Handler <bound method TocTreeCollector.get_updated_docs
of <sphinx.environment.collectors.toctree.TocTreeCollector object at 0x7fd762c63ec0>>
for event 'env-get-updated' threw an exception (exception: pickle data was truncated)
Extension error (sphinx.environment.collectors.toctree):
openblas-0.3.27-alt1
gemv.c: In function 'sgemv_':
gemv.c:229:31: error: 'GEMM_MULTITHREAD_THRESHOLD' undeclared (first use in this function)
229 | if ( 1L * m * n < 115200L * GEMM_MULTITHREAD_THRESHOLD )
--
ger.c: In function 'sger_':
ger.c:167:49: error: 'GEMM_MULTITHREAD_THRESHOLD' undeclared (first use in this function)
167 | if (incx == 1 && incy == 1 && 1L*m*n <= 2048 *GEMM_MULTITHREAD_THRESHOLD) {
--
gemv.c: In function 'cblas_sgemv':
gemv.c:229:31: error: 'GEMM_MULTITHREAD_THRESHOLD' undeclared (first use in this function)
229 | if ( 1L * m * n < 115200L * GEMM_MULTITHREAD_THRESHOLD )
--
ger.c: In function 'cblas_sger':
ger.c:167:49: error: 'GEMM_MULTITHREAD_THRESHOLD' undeclared (first use in this function)
167 | if (incx == 1 && incy == 1 && 1L*m*n <= 2048 *GEMM_MULTITHREAD_THRESHOLD) {
perl-HTML-Widget-1.11-alt3
Compilation failed in require at t/result_add_error.t line 6.
BEGIN failed--compilation aborted at t/result_add_error.t line 6.
# Looks like your test exited with 2 before it could output anything.
--
Compilation failed in require at t/submitted.t line 6.
BEGIN failed--compilation aborted at t/submitted.t line 6.
# Looks like your test exited with 2 before it could output anything.
--
t/01use.t (Wstat: 256 (exited 1) Tests: 1 Failed: 1)
Failed test: 1
Non-zero exit status: 1
--
Result: FAIL
Failed 53/90 test programs. 1/236 subtests failed.
make: *** [Makefile:834: test_dynamic] Error 2
python3-module-inline-snapshot-0.28.0-alt1
> result.assert_outcomes(passed=1)
E AssertionError: assert {'errors': 0,...pped': 0, ...} == {'errors': 0,...pped':
0, ...}
E
--
=========================== short test summary info ============================
FAILED tests/test_file.py::test_a - assert 4 == 5
============================== 1 failed in 0.08s ===============================
--
==================================== ERRORS ====================================
_________________________ ERROR at teardown of test_a __________________________
some snapshots in this test have incorrect values.
--
=========================== short test summary info ============================
ERROR tests/test_file.py::test_a - Failed: some snapshots in this test have i...
========================== 1 passed, 1 error in 0.16s ==========================
--
=========================== short test summary info ============================
FAILED tests/test_file.py::test_a - assert 4 == 5
============================== 1 failed in 0.09s ===============================
=========================== short test summary info ============================
FAILED tests/test_pytest_plugin.py::test_disabled - AssertionError: assert {'...
= 1 failed, 597 passed, 7 deselected, 1 xfailed, 997 subtests passed in 127.83s (0:02:07) =
INFO : Command's result: FAILURE
INFO : Command's error: Command '['python3', '-m', 'pytest', '-k', 'not pyright
and not test_compare']' returned non-zero exit status 1.
error: Bad exit status from /usr/src/tmp/rpmb-tmp.sxBLEA (%check)
python3-module-mkdocs-1.6.0-alt1
.......................................................................................................................................................................................................................................................................................................................................................................................................................................................................................F...............................................s..................................................s................s...............s.......................................................................................................................
FAIL: test_watch_with_broken_symlinks
(mkdocs.tests.livereload_tests.BuildTests.test_watch_with_broken_symlinks)
Traceback (most recent call last):
--
self.assertTrue(started_building.wait(timeout=10))
AssertionError: False is not true
Ran 723 tests in 18.460s
FAILED (failures=1, skipped=4)
INFO : Command's result: FAILURE
INFO : Command's error: Command '['python3', '-m', 'unittest', 'discover', '-p',
'*tests.py', 'mkdocs', '--top-level-directory', '.']' returned non-zero exit status 1.
error: Bad exit status from /usr/src/tmp/rpmb-tmp.DzAcF5 (%check)
python3-module-terminado-0.18.1-alt1
tests/basic_test.py::UniqueTermTests::test_large_io_doesnt_hang ^[[32mPASSED^[[0m^[[32m
[ 77%]^[[0m
tests/basic_test.py::UniqueTermTests::test_max_terminals ^[[31mFAILED^[[0m^[[31m [
88%]^[[0m
tests/basic_test.py::UniqueTermTests::test_unique_processes ^[[32mPASSED^[[0m^[[31m
[100%]^[[0m
--
> self.assertEqual(msg[0], "setup")
^[[1m^[[31mE TypeError: 'NoneType' object is not subscriptable^[[0m
msg = None
--
^[[36m^[[1m=========================== short test summary info
============================^[[0m
^[[31mFAILED^[[0m tests/basic_test.py::^[[1mUniqueTermTests::test_max_terminals^[[0m -
TypeError: 'NoneType' object is not subscriptable
^[[31m========================= ^[[31m^[[1m1 failed^[[0m, ^[[32m8 passed^[[0m^[[31m in
38.36s^[[0m^[[31m =========================^[[0m
INFO : Command's result: FAILURE
INFO : Command's error: Command '['python3', '-m', 'pytest', '-vra']' returned
non-zero exit status 1.
error: Bad exit status from /usr/src/tmp/rpmb-tmp.Ubd4T1 (%check)
14 error logs REMOVED from the list
automake_1.11-1.11.6-alt10
doctest-2.4.11-alt2
givaro-4.2.0-alt3
gz-gui-10.0.0-alt2
gz-sim-10.1.0-alt1
libcacard-2.8.1-alt1
litmus-0.14.0-alt2.git.9fbc73d
mysqltuner-1.7.2-alt1
podman-tui-1.11.3-alt1
python3-module-aiohttp-3.14.1-alt0.p11.1
python3-module-curio-1.6-alt1
python3-module-hid-tools-0.9-alt1
tbb-2022.1.0-alt1.2
zstd-1.5.5-alt2
Total 92 error logs.
^ permalink raw reply [flat|nested] only message in thread
only message in thread, other threads:[~2026-09-13 7:07 UTC | newest]
Thread overview: (only message) (download: mbox.gz / follow: Atom feed)
-- links below jump to the message on this page --
2026-09-13 7:07 [cyber] I: p11-20260913 x86_64 beehive_status: +9 -14 (92) ALT beekeeper
ALT Linux Sisyphus cybertalk
This inbox may be cloned and mirrored by anyone:
git clone --mirror http://lore.altlinux.org/sisyphus-cybertalk/0 sisyphus-cybertalk/git/0.git
# If you have public-inbox 1.1+ installed, you may
# initialize and index your mirror using the following commands:
public-inbox-init -V2 sisyphus-cybertalk sisyphus-cybertalk/ http://lore.altlinux.org/sisyphus-cybertalk \
sisyphus-cybertalk@lists.altlinux.org sisyphus-cybertalk@lists.altlinux.ru sisyphus-cybertalk@lists.altlinux.com
public-inbox-index sisyphus-cybertalk
Example config snippet for mirrors.
Newsgroup available over NNTP:
nntp://lore.altlinux.org/org.altlinux.lists.sisyphus-cybertalk
AGPL code for this site: git clone https://public-inbox.org/public-inbox.git