ALT Linux Sisyphus cybertalk
 help / color / mirror / Atom feed
* [cyber] I: Sisyphus-20260911 x86_64 beehive_status: +20 -31 (392)
@ 2026-09-11  3:33 ALT beekeeper
  0 siblings, 0 replies; only message in thread
From: ALT beekeeper @ 2026-09-11  3:33 UTC (permalink / raw)
  To: sisyphus-cybertalk

	20 NEW error logs

altlinux-freedesktop-menu-0.70-alt2
	+ for i in desktop-directories/*.directory
	++ basename desktop-directories/altlinux-xfce.directory
	+ j=altlinux-xfce.directory
	+ grep altlinux-xfce.directory ignore.list
	+ rm ignore.list
	+ '[' 0 -gt 0 ']'
	+ exit 1
	error: Bad exit status from /usr/src/tmp/rpmb-tmp.blU9Pg (%check)
	RPM build errors:
	Bad exit status from /usr/src/tmp/rpmb-tmp.blU9Pg (%check)

apache2-mod_perl-2.0.13-alt1
	[   info] adding source lib
	/usr/src/RPM/BUILD/mod_perl-2.0.13/Apache-Reload/../Apache-Test/lib to @INC
	# Failed test 2 in t/reload.t at line 47
	t/reload.t ..
	--
	t/reload.t (Wstat: 0 Tests: 3 Failed: 1)
	Failed test:  2
	Files=1, Tests=3,  0 wallclock secs ( 0.02 usr	0.00 sys +  0.16 cusr  0.05 csys =
	0.23 CPU)
	Result: FAIL
	Failed 1/1 test programs. 1/3 subtests failed.
	[warning] server localhost.localdomain:8529 shutdown

bore-0.6.0-alt2
	test basic_proxy::secret_2 ... ok
	test basic_proxy::secret_3 ... FAILED
	test half_closed_tcp_stream ... ok
	--
	test mismatched_secret::case_2 ... ok
	test very_long_frame ... FAILED
	failures:
	--
	-------------- TEST START --------------
	Error: could not connect to localhost:7835
	Caused by:
	--
	---- very_long_frame stdout ----
	Error: Connection refused (os error 111)
	failures:
	--
	very_long_frame
	test result: FAILED. 7 passed; 2 failed; 0 ignored; 0 measured; 0 filtered out; finished
	in 0.40s
	error: test failed, to rerun pass `--test e2e_test`
	Doc-tests bore_cli
	--
	test result: ok. 1 passed; 0 failed; 0 ignored; 0 measured; 0 filtered out; finished
	in 0.15s
	error: 1 target failed:
	`--test e2e_test`

bpftrace-0.27.0-alt1
	^[[94m[	 SKIP	]^[[0m probe.kprobe_offset_module_error (unmet condition: 'lsmod | grep
	'^nf_tables'')\r
	^[[91m[	FAILED	]^[[0m 2 tests, listed below:\r
	^[[91m[	FAILED	]^[[0m call.tseries zigzag\r
	^[[91m[	FAILED	]^[[0m json-output.time series\r
	1222.88user 1051.46system 30:32.50elapsed 124%CPU (0avgtext+0avgdata 14358804maxresident)k

casr-2.13.1-alt2
	test test_safe_func32 ... ignored
	test test_casr_ubsan ... FAILED
	test test_casr_lua ... ok
	--
	thread 'test_casr_ubsan' (170348) panicked at casr/tests/tests.rs:3961:43:
	called `Result::unwrap()` on an `Err` value: Os { code: 2, kind: NotFound, message:
	"No such file or directory" }
	note: run with `RUST_BACKTRACE=1` environment variable to display a backtrace
	--
	test_casr_ubsan
	test result: FAILED. 22 passed; 1 failed; 4 ignored; 0 measured; 76 filtered out;
	finished in 61.12s
	error: test failed, to rerun pass `-p casr --test tests`
	Running unittests src/lib.rs (target/release/deps/libcasr-cd0206c960f194c9)
	--
	test result: ok. 0 passed; 0 failed; 0 ignored; 0 measured; 0 filtered out; finished
	in 0.00s
	error: 1 target failed:
	`-p casr --test tests`

codex-0.146.0-alt1
	Running `rustc --crate-name clap_complete --edition=2021
	/usr/src/RPM/BUILD/codex-0.146.0/vendor/clap_complete/src/lib.rs --error-format=json
	--json=diagnostic-rendered-ansi,artifacts,future-incompat --crate-type lib
	--emit=dep-info,metadata,link -C opt-level=3 -C embed-bitcode=no -C codegen-units=16
	-C debuginfo=line-tables-only -C split-debuginfo=off --warn=rust_2018_idioms
	'--warn=clippy::zero_sized_map_values' '--warn=clippy::verbose_file_reads'
	--warn=unused_qualifications --warn=unused_macro_rules --warn=unused_lifetimes
	--warn=unsafe_op_in_unsafe_fn --warn=unreachable_pub --allow=unnameable_types
	'--warn=clippy::uninlined_format_args' '--warn=clippy::trait_duplication_in_bounds'
	'--warn=clippy::todo' '--warn=clippy::string_lit_as_bytes'
	'--warn=clippy::string_add_assign' '--warn=clippy::semicolon_if_nothing_returned'
	'--warn=clippy::self_named_module_files' '--warn=clippy::same_functions_in_if_condition'
	'--allow=clippy::result_large_err' '--warn=clippy::rest_pat_in_fully_bound_structs'
	'--warn=clippy::ref_option_ref' '--warn=clippy::redundant_feature_names'
	'--warn=clippy::rc_mutex' '--warn=clippy::ptr_as_ptr'
	'--warn=clippy::path_buf_push_overwrite' '--warn=clippy::negative_feature_names'
	'--warn=clippy::needless_for_each' '--allow=clippy::needless_continue'
	'--warn=clippy::mutex_integer' '--allow=clippy::multiple_bound_locations'
	'--warn=clippy::mem_forget' '--warn=clippy::macro_use_imports'
	'--warn=clippy::lossy_float_literal' '--warn=clippy::linkedlist'
	'--allow=clippy::let_and_return' '--warn=clippy::large_types_passed_by_value'
	'--warn=clippy::large_stack_arrays' '--warn=clippy::large_digit_groups'
	'--warn=clippy::invalid_upcast_comparisons' '--warn=clippy::infinite_loop'
	'--warn=clippy::inefficient_to_string' '--warn=clippy::inconsistent_struct_constructor'
	'--warn=clippy::imprecise_flops' '--warn=clippy::implicit_clone'
	'--allow=clippy::if_same_then_else' '--warn=clippy::from_iter_instead_of_collect'
	'--warn=clippy::fn_params_excessive_bools' '--warn=clippy::float_cmp_const'
	'--warn=clippy::flat_map_option' '--warn=clippy::filter_map_next'
	'--warn=clippy::fallible_impl_from' '--warn=clippy::explicit_into_iter_loop'
	'--warn=clippy::explicit_deref_methods' '--warn=clippy::expl_impl_clone_on_copy'
	'--warn=clippy::enum_glob_use' '--warn=clippy::empty_enum' '--warn=clippy::doc_markdown'
	'--warn=clippy::debug_assert_with_mut_call' '--warn=clippy::dbg_macro'
	'--warn=clippy::create_dir' '--allow=clippy::collapsible_else_if'
	'--warn=clippy::checked_conversions' '--allow=clippy::branches_sharing_code'
	'--allow=clippy::bool_assert_comparison' '--allow=clippy::blocks_in_conditions'
	'--allow=clippy::assigning_clones' --cfg 'feature="default"' --check-cfg 'cfg(docsrs,test)'
	--check-cfg 'cfg(feature, values("debug", "default", "unstable-doc", "unstable-dynamic",
	"unstable-shell-tests"))' -C metadata=7313d5080223da51 -C extra-filename=-2779b134e52bbcc6
	--out-dir /usr/src/RPM/BUILD/codex-0.146.0/codex-rs/target/release/deps -L
	dependency=/usr/src/RPM/BUILD/codex-0.146.0/codex-rs/target/release/deps --extern
	clap=/usr/src/RPM/BUILD/codex-0.146.0/codex-rs/target/release/deps/libclap-5d23165ba7ca7087.rmeta
	--cap-lints allow -Copt-level=3 -Cdebuginfo=1`
	hasher-privd: parent: handle_io: idle time limit (3600 seconds) exceeded

compiz-0.9.14.2-alt3.4
	[  1%] Generating /usr/src/RPM/BUILD/compiz-0.9.14.2/po/compiz.pot
	cd /usr/src/RPM/BUILD/compiz-0.9.14.2/po && /usr/bin/intltool-update --gettext-package
	compiz --pot
	make[2]: Leaving directory '/usr/src/RPM/BUILD/compiz-0.9.14.2/x86_64-alt-linux'
	make[1]: Entering directory '/usr/src/RPM/BUILD/compiz-0.9.14.2/x86_64-alt-linux'
	[ 21%] Built target nls
	make[1]: Leaving directory '/usr/src/RPM/BUILD/compiz-0.9.14.2/x86_64-alt-linux'
	make: *** [Makefile:169: all] Error 2
	error: Bad exit status from /usr/src/tmp/rpmb-tmp.VDyrLJ (%build)
	RPM build errors:
	Bad exit status from /usr/src/tmp/rpmb-tmp.VDyrLJ (%build)

edk2-aarch64-20260201-alt1
	g++ -c -DPCCTS_USE_NAMESPACE_STD -I Pccts/h -I .. -I ../Include/Common -I ../Include/ -I
	../Include/IndustryStandard -I ../Common/ -I .. -I . -I ../../../../MdePkg/Include/X64/
	-I ../../../../MdePkg/Include  -O2 -pipe -frecord-gcc-switches -Wall -g -O2  VfrSyntax.cpp
	-o VfrSyntax.o
	VfrSyntax.cpp:43:10: fatal error: VfrLexer.h: No such file or directory
	43 | #include "VfrLexer.h"

fonts-ttf-IosevkaCurly-34.4.0-alt1
	[ACTION] Create TTF 'dist/IosevkaCurly/TTF-Unhinted/IosevkaCurly-HeavyItalic.ttf'
	[ACTION] Create TTF 'dist/IosevkaCurly/TTF-Unhinted/IosevkaCurly-ExtendedHeavyItalic.ttf'
	[ACTION] Create TTF 'dist/IosevkaCurly/TTF-Unhinted/IosevkaCurly-Thin.ttf'
	[ACTION] Create TTF 'dist/IosevkaCurly/TTF-Unhinted/IosevkaCurly-ExtendedThin.ttf'
	[ACTION] Create TTF 'dist/IosevkaCurly/TTF-Unhinted/IosevkaCurly-ThinOblique.ttf'
	[ACTION] Create TTF 'dist/IosevkaCurly/TTF-Unhinted/IosevkaCurly-ExtendedThinOblique.ttf'
	/usr/src/tmp/rpmb-tmp.7XjSBs: line 134: 498468 CPU time limit exceeded npm run build --
	ttf::IosevkaCurly
	error: Bad exit status from /usr/src/tmp/rpmb-tmp.7XjSBs (%build)
	RPM build errors:
	Bad exit status from /usr/src/tmp/rpmb-tmp.7XjSBs (%build)

fonts-ttf-IosevkaSlab-34.7.0-alt1
	[ACTION] Create TTF 'dist/IosevkaSlab/TTF-Unhinted/IosevkaSlab-HeavyItalic.ttf'
	[ACTION] Create TTF 'dist/IosevkaSlab/TTF-Unhinted/IosevkaSlab-ExtendedHeavyItalic.ttf'
	[ACTION] Create TTF 'dist/IosevkaSlab/TTF-Unhinted/IosevkaSlab-Thin.ttf'
	[ACTION] Create TTF 'dist/IosevkaSlab/TTF-Unhinted/IosevkaSlab-ExtendedThin.ttf'
	[ACTION] Create TTF 'dist/IosevkaSlab/TTF-Unhinted/IosevkaSlab-ThinOblique.ttf'
	[ACTION] Create TTF 'dist/IosevkaSlab/TTF-Unhinted/IosevkaSlab-ExtendedThinOblique.ttf'
	/usr/src/tmp/rpmb-tmp.rlle4T: line 134: 2822740 CPU time limit exceeded npm run build
	-- ttf::IosevkaSlab
	error: Bad exit status from /usr/src/tmp/rpmb-tmp.rlle4T (%build)
	RPM build errors:
	Bad exit status from /usr/src/tmp/rpmb-tmp.rlle4T (%build)

libdqlite-1.18.2-alt2
	make[2]: Entering directory '/usr/src/RPM/BUILD/libdqlite-1.18.2'
	FAIL: integration-test
	make[2]: Leaving directory '/usr/src/RPM/BUILD/libdqlite-1.18.2'
	--
	# SKIP:  0
	# XFAIL: 0
	# FAIL:  1
	# XPASS: 0
	# ERROR: 0
	See ./test-suite.log

ocaml-sqlite3-5.4.2-alt1
	0 SYNTACTICALLY INCORRECT SQL STATEMENT
	Identified error: near "SYNTACTICALLY": syntax error
	1 SYNTACTICALLY INCORRECT SQL STATEMENT
	Identified error: near "SYNTACTICALLY": syntax error
	2 SYNTACTICALLY INCORRECT SQL STATEMENT
	Identified error: near "SYNTACTICALLY": syntax error
	3 SYNTACTICALLY INCORRECT SQL STATEMENT
	Identified error: near "SYNTACTICALLY": syntax error
	0 INSERT INTO tbl0 VALUES ('a', 3, 3.14)
	--
	Called from Sqlite3_test__Test_win.(fun) in file "test/test_win.ml", lines 13-16,
	characters 6-47
	FAILED 1 / 1 tests
	error: Bad exit status from /usr/src/tmp/rpmb-tmp.cUFSXH (%check)

python3-module-django-mptt-0.18-alt1
	..F.FFF.......x......s..................................sss............................................ssss.................
	FAIL: test_movenodeform (tests.myapp.test_forms.TestForms.test_movenodeform)
	Traceback (most recent call last):
	--
	self.assertHTMLEqual(str(form.as_div()), expected)
	AssertionError: <div>
	<label for="id_target">
	--
	</div>
	FAIL: test_treenodechoicefield (tests.myapp.test_forms.TestForms.test_treenodechoicefield)
	Traceback (most recent call last):
	--
	"</select>",
	AssertionError: <select name="test">
	<option selected value="">
	--
	Diff is 688 characters long. Set self.maxDiff to None to see it.
	FAIL: test_treenodechoicefield_level_indicator
	(tests.myapp.test_forms.TestForms.test_treenodechoicefield_level_indicator)
	Traceback (most recent call last):
	--
	"</select>",
	AssertionError: <select name="test">
	<option selected value="">
	--
	Diff is 688 characters long. Set self.maxDiff to None to see it.
	FAIL: test_treenodechoicefield_relative_level
	(tests.myapp.test_forms.TestForms.test_treenodechoicefield_relative_level)
	Traceback (most recent call last):
	--
	"</select>",
	AssertionError: <select name="test">
	<option selected value="">
	--
	Ran 124 tests in 2.556s
	FAILED (failures=4, skipped=8, expected failures=1)
	Destroying test database for alias 'default'...

python3-module-easyprocess-1.1-alt2
	tests/test_fast/test_proc.py::test_wrap PASSED				 [ 26%]
	tests/test_fast/test_proc.py::test_with FAILED				 [ 28%]
	tests/test_fast/test_proc.py::test_parse PASSED				 [ 31%]
	--
	=========================== short test summary info ============================
	FAILED tests/test_fast/test_proc.py::test_with - assert False
	=================== 1 failed, 37 passed in 76.37s (0:01:16) ====================

python3-module-m2crypto-0.47.0-alt1
	"Control characters are not allowed in cookies %r %r %r" % (key, val, coded_val,))
	E	    http.cookies.CookieError:
	Control characters are not allowed in cookies '_M2AUTH_'
	'exp=1789100346.146027&data=cogitoergosum&digest=sgvFPV\x7fVECjMEqqYlqWRLebmwkz3h8dDFG8xKB8ei34='
	'"exp=1789100346.146027&data=cogitoergosum&digest=sgvFPV\x7fVECjMEqqYlqWRLebmwkz3h8dDFG8xKB8ei34="'
	/usr/lib64/python3.14/http/cookies.py:359: CookieError
	--
	=========================== short test summary info ============================
	FAILED tests/test_authcookie.py::AuthCookieTestCase::test_cookie_str_changed_mac
	= 1 failed, 326 passed, 13 skipped, 3 warnings, 53 subtests passed in 68.04s (0:01:08) =

python3-module-rapidfuzz-3.14.6-alt1
	=========================== short test summary info ============================
	FAILED tests/test_hypothesis.py::test_jaro_winkler_word - AssertionError
	======================== 1 failed, 420 passed in 11.48s ========================

python3-module-sqlfluff-4.3.0-alt1
	>	assert os.path.expanduser(resolved_path) ==
	os.path.expanduser(resolved_config_path)
	E	AssertionError: assert '/usr/src/Lib...port/sqlfluff' ==
	'/usr/src/.co...path/sqlfluff'
	E
	--
	SKIPPED [1] test/rules/cp04_rust_dispatch_test.py:104: Rust parser not available
	FAILED
	test/core/config/loader_test.py::test__config__get_user_config_dir_path[linux-False-False-~/.config/my/special/path/sqlfluff-paths_checked1]
	FAILED
	test/core/config/loader_test.py::test__config__get_user_config_dir_path[darwin-False-False-~/Library/Application
	Support/sqlfluff-paths_checked2]
	FAILED
	test/core/config/loader_test.py::test__config__get_user_config_dir_path[darwin-True-False-~/.config/my/special/path/sqlfluff-paths_checked3]
	==== 3 failed, 10691 passed, 2537 skipped, 5 warnings in 131.16s (0:02:11) =====
	INFO	 : Command's result: FAILURE
	INFO	 : Command's error: Command
	'['python3', '-m', 'pytest', '-n', 'auto', '-vra', 'test',
	'--deselect=test/core/plugin_test.py::test__plugin_default_config_read[Example_L001-forbidden_columns]',
	'--deselect=test/core/plugin_test.py::test__plugin_example_rules_returned[Rule_Example_L001]',
	'--deselect=test/core/plugin_test.py::test__plugin_manager_registers_example_plugin']'
	returned non-zero exit status 1.
	error: Bad exit status from /usr/src/tmp/rpmb-tmp.IQ87iG (%check)

qemu-10.2.4-alt1
	28/143 func-quick+func-microblazeel - qemu:func-microblazeel-empty_cpu_model OK
	0.58s	1 subtests passed
	6/143 func-quick+func-arm - qemu:func-arm-vnc				    ERROR
	1.48s	exit status 1
	>>>
	PYTHONPATH=/usr/src/RPM/BUILD/qemu-10.2.4/python:/usr/src/RPM/BUILD/qemu-10.2.4/tests/functional
	LD_LIBRARY_PATH=/usr/src/RPM/BUILD/qemu-10.2.4/build-dynamic/:/usr/src/RPM/BUILD/qemu-10.2.4/build-dynamic/tests/tcg/plugins:/usr/src/RPM/BUILD/qemu-10.2.4/build-dynamic/contrib/plugins
	MSAN_OPTIONS=halt_on_error=1:abort_on_error=1:print_summary=1:print_stacktrace=1
	QEMU_TEST_QEMU_IMG=/usr/src/RPM/BUILD/qemu-10.2.4/build-dynamic/qemu-img
	QEMU_BUILD_ROOT=/usr/src/RPM/BUILD/qemu-10.2.4/build-dynamic RUST_BACKTRACE=1
	UBSAN_OPTIONS=halt_on_error=1:abort_on_error=1:print_summary=1:print_stacktrace=1
	QEMU_TEST_QEMU_BINARY=/usr/src/RPM/BUILD/qemu-10.2.4/build-dynamic/qemu-system-arm
	MALLOC_PERTURB_=41 MESON_TEST_ITERATION=1
	ASAN_OPTIONS=halt_on_error=1:abort_on_error=1:print_summary=1
	/usr/src/RPM/BUILD/qemu-10.2.4/build-dynamic/pyvenv/bin/python3
	/usr/src/RPM/BUILD/qemu-10.2.4/tests/functional/generic/test_vnc.py
	--
	self.assertFalse(check_connect(c))
	AssertionError: True is not false
	More information on test_vnc.Vnc.test_change_listen could be found here:
	--
	Summary of Failures:
	6/143 func-quick+func-arm - qemu:func-arm-vnc				    ERROR
	1.48s	exit status 1
	Ok:		   136

uutils-coreutils-0.9.0-alt1
	test_du::test_du_repeated_b
	test result: FAILED. 5129 passed; 2 failed; 85 ignored; 0 measured; 48 filtered out;
	finished in 18.13s
	error: test failed, to rerun pass `--test tests`
	Doc-tests coreutils
	--
	test result: ok. 0 passed; 0 failed; 0 ignored; 0 measured; 0 filtered out; finished
	in 0.00s
	error: 1 target failed:
	`--test tests`

wabt-1.0.41-alt1
	+ test/wasm2c/spec/simd_f32x4_pmin_pmax.txt (143.248s)
	**** FAILED ******************************************************************
	- test/wasm2c/spec/memory64/memory_copy.txt

	31 error logs REMOVED from the list
binwalk3-3.1.0-alt1
bmake-20251111-alt1
bpftrace-0.26.1-alt1
disruptor-3.4.4-alt1_3jpp11
dm-secdel-1.0.12-alt1
dufs-0.46.0-alt1
dvdauthor-0.7.2-alt5.1
gambit-4.9.7-alt5
glaxnimate-0.5.5-alt4
gz-gui-10.0.0-alt3
jakarta-json-2.1.3-alt2
jnr-constants-0.9.12-alt1_8jpp11
jnr-unixsocket-0.21-alt1_8jpp11
kernel-image-6.12-6.12.108-alt1
kernel-image-6.18-6.18.49-alt1
kernel-image-rt-6.12.108-alt1
libgupnp-igd-1.6.0-alt1
lightdm-1.32.0-alt15
linstor-1.34.1-alt1
ltp-alt-lists-20-alt1
maven-osgi-1:0.2.0-alt1_19jpp11
nushell-0.114.1-alt1
pkcs11-provider-1.2.0-alt3
portlet-2.0-api-1.0-alt3_24jpp11
postgresql17-17.11-alt1
python3-module-oscrypto-1.3.0-alt1.1
python3-module-paho-2.1.0-alt2
python3-module-pytest-xprocess-1.0.2-alt1.1
python3-module-zict-3.0.0-alt1
treelayout-1.0.3-alt1_13jpp11
verilator-5.048-alt1

Total 392 error logs.


^ permalink raw reply	[flat|nested] only message in thread

only message in thread, other threads:[~2026-09-11  3:33 UTC | newest]

Thread overview: (only message) (download: mbox.gz / follow: Atom feed)
-- links below jump to the message on this page --
2026-09-11  3:33 [cyber] I: Sisyphus-20260911 x86_64 beehive_status: +20 -31 (392) ALT beekeeper

ALT Linux Sisyphus cybertalk

This inbox may be cloned and mirrored by anyone:

	git clone --mirror http://lore.altlinux.org/sisyphus-cybertalk/0 sisyphus-cybertalk/git/0.git

	# If you have public-inbox 1.1+ installed, you may
	# initialize and index your mirror using the following commands:
	public-inbox-init -V2 sisyphus-cybertalk sisyphus-cybertalk/ http://lore.altlinux.org/sisyphus-cybertalk \
		sisyphus-cybertalk@lists.altlinux.org sisyphus-cybertalk@lists.altlinux.ru sisyphus-cybertalk@lists.altlinux.com
	public-inbox-index sisyphus-cybertalk

Example config snippet for mirrors.
Newsgroup available over NNTP:
	nntp://lore.altlinux.org/org.altlinux.lists.sisyphus-cybertalk


AGPL code for this site: git clone https://public-inbox.org/public-inbox.git