ALT Linux Sisyphus cybertalk
 help / color / mirror / Atom feed
* [cyber] I: Sisyphus-20260910 x86_64 beehive_status: +16 -23 (403)
@ 2026-09-10  7:33 ALT beekeeper
  0 siblings, 0 replies; only message in thread
From: ALT beekeeper @ 2026-09-10  7:33 UTC (permalink / raw)
  To: sisyphus-cybertalk

[-- Warning: decoded text below may be mangled, UTF-8 assumed --]
[-- Attachment #1: Type: text/plain; charset=unknown-8bit, Size: 8831 bytes --]

	16 NEW error logs

auditd-plugin-clickhouse-lite-0.1.9-alt3
	=========================== short test summary info ============================
	FAILED ../test/dbtest/plugin_test.py::test_export - AssertionError: assert 'E...
	=================== 1 failed, 13 passed in 73.26s (0:01:13) ====================
	0% tests passed, 1 tests failed out of 1
	Total Test time (real) = 145.43 sec
	The following tests FAILED:
	1 - main_test (Failed)

binwalk3-3.1.0-alt1
	test src/extractors/common.rs - extractors::common::Chroot::append_to_file (line 429)
	... ok
	test src/extractors/common.rs - extractors::common::Chroot::make_executable (line 513)
	... FAILED
	test src/extractors/common.rs - extractors::common::Chroot::create_character_device
	(line 315) ... ok
	--
	src/extractors/common.rs - extractors::common::Chroot::make_executable (line 513)
	test result: FAILED. 28 passed; 1 failed; 3 ignored; 0 measured; 0 filtered out;
	finished in 0.22s
	error: doctest failed, to rerun pass `--doc`
	error: Bad exit status from /usr/src/tmp/rpmb-tmp.yMODvk (%check)

bmake-20251111-alt1
	exit status 0
	Failed tests: cmd-interrupt
	*** Error code 1

dm-secdel-1.0.12-alt1
	systemctl daemon-reload
	make: systemctl: No such file or directory
	make: [Makefile:24: install-bin] Error 127 (ignored)
	systemctl enable secdeltab
	make: systemctl: No such file or directory
	make: [Makefile:25: install-bin] Error 127 (ignored)
	--
	make[2]: Entering directory '/usr/src/RPM/BUILD/dm-secdel-1.0.12'
	make[3]: /usr/src/linux-7.1.13-7.1-alt1/scripts/pahole-version.sh: No such file or
	directory
	make[2]: Leaving directory '/usr/src/RPM/BUILD/dm-secdel-1.0.12'
	--
	make[2]: Entering directory '/usr/src/RPM/BUILD/dm-secdel-1.0.12'
	make[3]: /usr/src/linux-7.1.13-7.1-alt1/scripts/pahole-version.sh: No such file or
	directory
	warning: pahole version differs from the one used to build the kernel

dufs-0.46.0-alt1
	running 8 tests
	test assets_override_not_found_page ... FAILED
	Error: Failed to access path `/usr/src/tmp/.tmpDHhEZ5`
	Caused by:
	No such file or directory (os error 2)
	test asset_ico ... ok
	--
	---- assets_override_not_found_page stdout ----
	Error: reqwest::Error { kind: Request, url: "http://localhost:41375/missing-path",
	source: hyper_util::client::legacy::Error(Connect, ConnectError("tcp connect error",
	127.0.0.1:41375, Os { code: 111, kind: ConnectionRefused, message: "Connection refused"
	})) }
	failures:
	assets_override_not_found_page
	test result: FAILED. 7 passed; 1 failed; 0 ignored; 0 measured; 0 filtered out; finished
	in 0.26s
	error: test failed, to rerun pass `--test assets`
	error: Bad exit status from /usr/src/tmp/rpmb-tmp.SDYzkI (%check)

dvdauthor-0.7.2-alt5.1
	dvdvmy.c:2408:3: error: expected identifier or '(' before 'return'
	2408 |	 return yyresult;
	dvdvmy.c:2409:1: error: expected identifier or '(' before '}' token
	2409 | }

fonts-ttf-IosevkaTerm-34.7.0-alt1
	[ACTION] Create TTF 'dist/Iosevka/TTF-Unhinted/Iosevka-HeavyItalic.ttf'
	[ACTION] Create TTF 'dist/Iosevka/TTF-Unhinted/Iosevka-ExtendedHeavyItalic.ttf'
	[ACTION] Create TTF 'dist/Iosevka/TTF-Unhinted/Iosevka-Thin.ttf'
	[ACTION] Create TTF 'dist/Iosevka/TTF-Unhinted/Iosevka-ExtendedThin.ttf'
	[ACTION] Create TTF 'dist/Iosevka/TTF-Unhinted/Iosevka-ThinOblique.ttf'
	[ACTION] Create TTF 'dist/Iosevka/TTF-Unhinted/Iosevka-ExtendedThinOblique.ttf'
	/usr/src/tmp/rpmb-tmp.77Q1UU: line 134: 2059394 CPU time limit exceeded npm run build
	-- ttf::IosevkaTerm
	error: Bad exit status from /usr/src/tmp/rpmb-tmp.77Q1UU (%build)
	RPM build errors:
	Bad exit status from /usr/src/tmp/rpmb-tmp.77Q1UU (%build)

gz-gui-10.0.0-alt3
	54/54 Test #54: check_INTEGRATION_transport_scene_manager ...	Passed	  0.01 sec
	98% tests passed, 1 tests failed out of 54
	Total Test time (real) = 131.56 sec
	The following tests FAILED:
	45 - INTEGRATION_Examples_TEST (Subprocess aborted)

libgupnp-igd-1.6.0-alt1
	# gupnp-resource-factory-DEBUG: Will return type GUPnPServiceProxy for UPnP type
	urn:schemas-upnp-org:service:WANIPConnection
	1/1 gupnp-igd:gupnp-simple-igd FAIL	       3.94s   killed by signal 11 SIGSEGV
	Summary of Failures:
	1/1 gupnp-igd:gupnp-simple-igd FAIL	       3.94s   killed by signal 11 SIGSEGV
	Ok:		   0
	Fail:		   1
	Full log written to
	/usr/src/RPM/BUILD/gupnp-igd-1.6.0/x86_64-alt-linux/meson-logs/testlog.txt
	error: Bad exit status from /usr/src/tmp/rpmb-tmp.G4k984 (%check)
	RPM build errors:
	Bad exit status from /usr/src/tmp/rpmb-tmp.G4k984 (%check)

lightdm-1.32.0-alt15
	# SKIP:  0
	# XFAIL: 0
	# FAIL:  1
	# XPASS: 0
	# ERROR: 0
	See tests/test-suite.log
	--
	# SKIP:  0
	# XFAIL: 0
	# FAIL:  1
	# XPASS: 0
	# ERROR: 0
	.. contents:: :depth: 2
	FAIL: test-autologin-unknown
	** (process:1108338): WARNING **: 02:28:00.848: Error loading passwd file: Failed to
	open file “/tmp/.r0/etc/passwd”: No such file or directory
	** (process:1108376): WARNING **: 02:28:00.852: Error loading passwd file: Failed to
	open file “/tmp/.r0/etc/passwd”: No such file or directory
	** (process:1108441): WARNING **: 02:28:00.855: Error loading passwd file: Failed to
	open file “/tmp/.r0/etc/passwd”: No such file or directory
	** (process:1108488): WARNING **: 02:28:00.858: Error loading passwd file: Failed to
	open file “/tmp/.r0/etc/passwd”: No such file or directory

nushell-0.114.1-alt1
	test commands::job::job_send_to_self_works ... ok
	test commands::network::http::get::http_get_with_socks5_proxy::case_3_https_proxy
	... FAILED
	test commands::job::killing_job_kills_pids ... ok
	--
	---- serial - commands::network::http::get::http_get_with_socks5_proxy::case_3_https_proxy
	stdout ----
	Error: TestError {
	location: crates/nu-command/tests/commands/network/http/get.rs:397:62,
	--
	serial: commands::network::http::get::http_get_with_socks5_proxy::case_3_https_proxy
	test result: FAILED. 2455 passed; 1 failed; 28 ignored; 0 filtered out; across 9 groups,
	finished in 34.05s
	error: test failed, to rerun pass `-p nu-command --test tests`
	Caused by:

openuds-server-4.0.0-alt8
	from weasyprint import HTML, CSS, default_url_fetcher  # pyright:
	ignore[reportUnknownVariableType]
	ImportError: cannot import name 'default_url_fetcher' from 'weasyprint'
	(/usr/lib/python3/site-packages/weasyprint/__init__.py)
	error: Bad exit status from /usr/src/tmp/rpmb-tmp.OXXB4i (%check)

pkcs11-provider-1.2.0-alt3
	Full log written to
	/usr/src/RPM/BUILD/pkcs11-provider-1.2.0/x86_64-alt-linux/meson-logs/testlog.txt
	FAILED: [code=1] meson-internal__test
	/usr/bin/meson test --no-rebuild --print-errorlogs

postgresql17-17.11-alt1
	1..225
	# 12 of 225 tests failed.
	# The differences that caused some tests to fail can be viewed in the file
	"/usr/src/RPM/BUILD/postgresql17-17.11/src/test/regress/regression.diffs".

python3-module-pytest-xprocess-1.0.2-alt1.1
	tests/test_interruption_clean_up.py::test_interruption_cleanup PASSED	 [ 15%]
	tests/test_interruption_clean_up.py::test_interruption_does_not_cleanup FAILED [ 17%]
	tests/test_process_initialization.py::test_servers_start[s1] PASSED	 [ 19%]
	--
	pidfd = os.pidfd_open(pid, 0)
	OSError: [Errno 22] Invalid argument
	=========================== short test summary info ============================
	FAILED tests/test_interruption_clean_up.py::test_interruption_does_not_cleanup
	======================== 1 failed, 50 passed in 35.28s =========================
	--
	INFO	 : Command's result: FAILURE
	INFO	 : Command's error: Command '['pytest', '-vra']' returned non-zero exit status 1.
	error: Bad exit status from /usr/src/tmp/rpmb-tmp.auLZZc (%check)

python3-module-zict-3.0.0-alt1
	File "/usr/src/RPM/BUILD/python3-module-zict-3.0.0/zict/tests/utils_test.py", line 193,
	in check_different_keys_threadsafe
	f1.result()
	File "/usr/lib64/python3.14/concurrent/futures/_base.py", line 449, in result
	self._condition.wait(timeout)
	File "/usr/lib64/python3.14/threading.py", line 370, in wait
	waiter.acquire()
	+++++++++++++++++++++++++++++++++++ Timeout ++++++++++++++++++++++++++++++++++++
	error: Bad exit status from /usr/src/tmp/rpmb-tmp.f9X4RZ (%check)
	RPM build errors:
	Bad exit status from /usr/src/tmp/rpmb-tmp.f9X4RZ (%check)

	23 error logs REMOVED from the list
altlinux-freedesktop-menu-0.70-alt2
apache-poi-5.4.1-alt2
apache2-mod_perl-2.0.13-alt1
casr-2.13.1-alt2
edk2-aarch64-20260201-alt1
fonts-ttf-IosevkaCurly-34.4.0-alt1
fonts-ttf-IosevkaSlab-34.7.0-alt1
gnuplot-1:6.0.4-alt1
gz-sim-10.5.0-alt1
libdqlite-1.18.2-alt2
lore-0.8.6-alt1
osquery-1:5.23.0-alt1
perl-Tie-DBI-1.08-alt1
python3-module-pulsectl-asyncio-1.3.2-alt1
python3-module-pythran-0.19.0-alt1
python3-module-qtconsole-5.7.2-alt1.1
python3-module-whoosh-2.7.4-alt4.1
python3-module-yaql-3.1.0-alt1
rng-tools-6.17-alt1.1
trusttunnel-1.0.33-alt2
uutils-coreutils-0.9.0-alt1
wf-recorder-0.6.0-alt1
xinetd-2.3.15-alt6

Total 403 error logs.


^ permalink raw reply	[flat|nested] only message in thread

only message in thread, other threads:[~2026-09-10  7:33 UTC | newest]

Thread overview: (only message) (download: mbox.gz / follow: Atom feed)
-- links below jump to the message on this page --
2026-09-10  7:33 [cyber] I: Sisyphus-20260910 x86_64 beehive_status: +16 -23 (403) ALT beekeeper

ALT Linux Sisyphus cybertalk

This inbox may be cloned and mirrored by anyone:

	git clone --mirror http://lore.altlinux.org/sisyphus-cybertalk/0 sisyphus-cybertalk/git/0.git

	# If you have public-inbox 1.1+ installed, you may
	# initialize and index your mirror using the following commands:
	public-inbox-init -V2 sisyphus-cybertalk sisyphus-cybertalk/ http://lore.altlinux.org/sisyphus-cybertalk \
		sisyphus-cybertalk@lists.altlinux.org sisyphus-cybertalk@lists.altlinux.ru sisyphus-cybertalk@lists.altlinux.com
	public-inbox-index sisyphus-cybertalk

Example config snippet for mirrors.
Newsgroup available over NNTP:
	nntp://lore.altlinux.org/org.altlinux.lists.sisyphus-cybertalk


AGPL code for this site: git clone https://public-inbox.org/public-inbox.git