ALT Linux Sisyphus cybertalk
 help / color / mirror / Atom feed
* [cyber] I: Sisyphus-20260909 x86_64 beehive_status: +22 -36 (410)
@ 2026-09-09  7:35 ALT beekeeper
  0 siblings, 0 replies; only message in thread
From: ALT beekeeper @ 2026-09-09  7:35 UTC (permalink / raw)
  To: sisyphus-cybertalk

	22 NEW error logs

altlinux-freedesktop-menu-0.70-alt2
	+ for i in desktop-directories/*.directory
	++ basename desktop-directories/altlinux-xfce.directory
	+ j=altlinux-xfce.directory
	+ grep altlinux-xfce.directory ignore.list
	+ rm ignore.list
	+ '[' 0 -gt 0 ']'
	+ exit 1
	error: Bad exit status from /usr/src/tmp/rpmb-tmp.TwxQf3 (%check)
	RPM build errors:
	Bad exit status from /usr/src/tmp/rpmb-tmp.TwxQf3 (%check)

apache2-mod_perl-2.0.13-alt1
	[   info] adding source lib
	/usr/src/RPM/BUILD/mod_perl-2.0.13/Apache-Reload/../Apache-Test/lib to @INC
	# Failed test 2 in t/reload.t at line 47
	t/reload.t ..
	--
	t/reload.t (Wstat: 0 Tests: 3 Failed: 1)
	Failed test:  2
	Files=1, Tests=3,  0 wallclock secs ( 0.01 usr	0.00 sys +  0.17 cusr  0.05 csys =
	0.23 CPU)
	Result: FAIL
	Failed 1/1 test programs. 1/3 subtests failed.
	[warning] server localhost.localdomain:8529 shutdown

casr-2.13.1-alt2
	test test_safe_func32 ... ignored
	test test_casr_ubsan ... FAILED
	test test_casr_lua ... ok
	--
	thread 'test_casr_ubsan' (1877245) panicked at casr/tests/tests.rs:3961:43:
	called `Result::unwrap()` on an `Err` value: Os { code: 2, kind: NotFound, message:
	"No such file or directory" }
	note: run with `RUST_BACKTRACE=1` environment variable to display a backtrace
	--
	test_casr_ubsan
	test result: FAILED. 22 passed; 1 failed; 4 ignored; 0 measured; 76 filtered out;
	finished in 101.79s
	error: test failed, to rerun pass `-p casr --test tests`
	Running unittests src/lib.rs (target/release/deps/libcasr-cd0206c960f194c9)
	--
	test result: ok. 0 passed; 0 failed; 0 ignored; 0 measured; 0 filtered out; finished
	in 0.00s
	error: 1 target failed:
	`-p casr --test tests`

edk2-aarch64-20260201-alt1
	68 |   ParserBlackBox<CVfrDLGLexer, EfiVfrParser, ANTLRToken> VfrParser(File);
	Pccts/h/PBlackBox.h:88:14: error: no matching function for call to
	'ANTLRTokenBuffer::ANTLRTokenBuffer(CVfrDLGLexer*&)'
	88 |	   pipe = new ANTLRTokenBuffer(scan);
	--
	Pccts/h/ATokenBuffer.h:55:22: note: no known conversion for argument 1 from 'CVfrDLGLexer*'
	to 'const ANTLRTokenBuffer&'
	Pccts/h/PBlackBox.h:90:13: error: 'class CVfrDLGLexer' has no member named 'setToken'
	90 |	   scan->setToken(tok);

fonts-ttf-IosevkaTermCurlySlab-34.4.0-alt1
	[ACTION] Create TTF 'dist/IosevkaCurlySlab/TTF-Unhinted/IosevkaCurlySlab-Thin.ttf'
	[ACTION] Create TTF 'dist/IosevkaCurlySlab/TTF-Unhinted/IosevkaCurlySlab-ExtendedThin.ttf'
	[ACTION] Create TTF 'dist/IosevkaCurlySlab/TTF-Unhinted/IosevkaCurlySlab-ThinOblique.ttf'
	[ACTION] Create TTF
	'dist/IosevkaCurlySlab/TTF-Unhinted/IosevkaCurlySlab-ExtendedThinOblique.ttf'
	[ACTION] Hint TTF 'dist/IosevkaCurlySlab/TTF/IosevkaCurlySlab-Light.ttf' <-
	'dist/IosevkaCurlySlab/TTF-Unhinted/IosevkaCurlySlab-Light.ttf'
	[ACTION] Hint TTF 'dist/IosevkaCurlySlab/TTF/IosevkaCurlySlab-ExtendedHeavy.ttf' <-
	'dist/IosevkaCurlySlab/TTF-Unhinted/IosevkaCurlySlab-ExtendedHeavy.ttf'
	/usr/src/tmp/rpmb-tmp.5gJkqI: line 134: 1297444 CPU time limit exceeded npm run build
	-- ttf::IosevkaTermCurlySlab
	error: Bad exit status from /usr/src/tmp/rpmb-tmp.5gJkqI (%build)
	RPM build errors:
	Bad exit status from /usr/src/tmp/rpmb-tmp.5gJkqI (%build)

gambit-4.9.7-alt5
	make[4]: Leaving directory '/usr/src/RPM/BUILD/gambit-4.9.7/lib/_irregex'
	make[4]: Entering directory '/usr/src/RPM/BUILD/gambit-4.9.7/lib'
	LD_LIBRARY_PATH=../lib:../gsi:../gsc:
	../gsc/gsc -:~~bin=../bin,~~lib=../lib,~~include=../include -f -target js  -prelude
	"(define-cond-expand-feature|enable-type-checking|)(define-cond-expand-feature|disable-auto-forcing|)(define-cond-expand-feature|enable-sharp-dot|)(define-cond-expand-feature|enable-bignum|)(define-cond-expand-feature|enable-ratnum|)(define-cond-expand-feature|enable-cpxnum|)(define-cond-expand-feature|enable-s8vector|)(define-cond-expand-feature|enable-u16vector|)(define-cond-expand-feature|enable-s16vector|)(define-cond-expand-feature|enable-u32vector|)(define-cond-expand-feature|enable-s32vector|)(define-cond-expand-feature|enable-u64vector|)(define-cond-expand-feature|enable-s64vector|)(define-cond-expand-feature|enable-f32vector|)(define-cond-expand-feature|disable-smp|)(##include\"../lib/header.scm\")"
	-label-namespace "" -c -o _gambit.js ../lib/_univlib.scm
	make[4]: Leaving directory '/usr/src/RPM/BUILD/gambit-4.9.7/lib'
	make[2]: *** [makefile:546: modules-recursive] Error 2
	make[1]: *** [makefile:373: modules] Error 2
	make: *** [makefile:107: all] Error 2
	error: Bad exit status from /usr/src/tmp/rpmb-tmp.iF522v (%build)
	RPM build errors:
	Bad exit status from /usr/src/tmp/rpmb-tmp.iF522v (%build)

gnuplot-1:6.0.4-alt1
	make[1]: Leaving directory '/usr/src/RPM/BUILD/gnuplot-6.0.4/docs'
	make[1]: *** Deleting file 'gnuplot.tex'
	make[1]: Entering directory '/usr/src/RPM/BUILD/gnuplot-6.0.4/docs'
	./doc2tex -figures ./gnuplot.doc gnuplot.tex
	make[1]: *** [Makefile:1101: gnuplot.tex] Segmentation fault
	make[1]: Leaving directory '/usr/src/RPM/BUILD/gnuplot-6.0.4/docs'
	make: *** [Makefile:1104: pdf] Error 2
	error: Bad exit status from /usr/src/tmp/rpmb-tmp.VO8b7T (%build)
	RPM build errors:
	Bad exit status from /usr/src/tmp/rpmb-tmp.VO8b7T (%build)

gz-sim-10.5.0-alt1
	(2026-09-09 01:14:53.581) [debug] [Sensors.cc:565] SensorsPrivate::Stop
	[  FAILED  ] ThermalSensorTest.ThermalSensorSystemInvalidConfig (6306 ms)
	[----------] 1 test from ThermalSensorTest (6306 ms total)
	--
	[  PASSED  ] 0 tests.
	[  FAILED  ] 1 test, listed below:
	[  FAILED  ] ThermalSensorTest.ThermalSensorSystemInvalidConfig
	1 FAILED TEST
	Start 272: check_INTEGRATION_thermal_sensor_system
	--
	296/296 Test #296: world_TEST ...................................................
	Passed	  2.44 sec
	99% tests passed, 2 tests failed out of 296
	Total Test time (real) = 559.84 sec
	The following tests FAILED:
	101 - INTEGRATION_contact_system (Failed)

libdqlite-1.18.2-alt2
	make[2]: Entering directory '/usr/src/RPM/BUILD/libdqlite-1.18.2'
	FAIL: integration-test
	make[2]: Leaving directory '/usr/src/RPM/BUILD/libdqlite-1.18.2'
	--
	# SKIP:  0
	# XFAIL: 0
	# FAIL:  1
	# XPASS: 0
	# ERROR: 0
	See ./test-suite.log

lore-0.8.6-alt1
	test lore-server/src/hooks/mod.rs - hooks (line 121) ... ok
	test lore-server/src/hooks/traits.rs - hooks::traits::HookError::rejected_default
	(line 294) ... ok
	test lore-server/src/hooks/mod.rs - hooks (line 105) ... ok
	--
	test lore-server/src/plugins/mod.rs - plugins (line 57) ... ok
	test lore-server/src/hooks/traits.rs - hooks::traits::HookError::rejected (line 267) ... ok
	test lore-server/src/server_config.rs - server_config::ServerConfig (line 30) ... ok
	--
	test result: ok. 0 passed; 0 failed; 0 ignored; 0 measured; 0 filtered out; finished
	in 0.00s
	error: 1 target failed:
	`-p lore-revision --test clone`

perl-Tie-DBI-1.08-alt1
	Result: FAIL
	Failed 1/2 test programs. 0/46 subtests failed.
	make: *** [Makefile:781: test_dynamic] Error 255

python3-module-crosshair-tool-0.0.110-alt1
	XPASS crosshair/fuzz_core_test.py::test_op[marshal.loads] - C helper rejects SymbolicBytes
	(no buffer protocol <3.12)
	FAILED crosshair/libimpl/timelib_test.py::test_monotonic_confirm - AssertionE...
	= 1 failed, 14545 passed, 848 skipped, 32 xfailed, 52 xpassed, 424 warnings in 1323.27s
	(0:22:03) =
	INFO	 : Command's result: FAILURE
	INFO	 : Command's error: Command '['python3',
	'-m', 'pytest', '-vra', '-n', '32', '--deselect',
	'crosshair/libimpl/datetimelib_ch_test.py::test_builtin[check_timedelta_new]',
	'--deselect', 'crosshair/libimpl/datetimelib_test.py::test_leap_year']' returned non-zero
	exit status 1.
	error: Bad exit status from /usr/src/tmp/rpmb-tmp.hLbrHm (%check)

python3-module-drf-spectacular-0.30.0-alt1
	>	assert actual == expected and not diff, diff
	E	AssertionError: ---
	E	+++
	--
	>	assert actual == expected and not diff, diff
	E	AssertionError: ---
	E	+++
	--
	=========================== short test summary info ============================
	FAILED tests/test_fields.py::test_fields - AssertionError: ---
	FAILED tests/test_fields.py::test_fields_oas_3_1 - AssertionError: ---
	2 failed, 499 passed in 5.60s

python3-module-pulsectl-asyncio-1.3.2-alt1
	tests/test_async_with_dummy_instance.py::AsyncDummyTests::test_ext_stream_restore PASSED
	[ 29%]
	tests/test_async_with_dummy_instance.py::AsyncDummyTests::test_get_peak_sample FAILED
	[ 35%]
	tests/test_async_with_dummy_instance.py::AsyncDummyTests::test_get_sink_src PASSED [ 41%]
	--
	>			self.assertGreater(peak, 0)
	E      AssertionError: 0.0 not greater than 0
	tests/test_async_with_dummy_instance.py:450: AssertionError
	=========================== short test summary info ============================
	FAILED tests/test_async_with_dummy_instance.py::AsyncDummyTests::test_get_peak_sample
	======================== 1 failed, 16 passed in 21.35s =========================

python3-module-pythran-0.19.0-alt1
	INFO	 : Running command: ['python3', '-m', 'pytest', '-n', 'auto', '--dist',
	'worksteal', '-v', '-ra', '--tb=short', '-k', 'not test_setup_build and not
	test_setup_build2 and not benchmark']
	hasher-privd: parent: handle_io: idle time limit (3600 seconds) exceeded

python3-module-qtconsole-5.7.2-alt1.1
	INFO	 : Running command: ['xvfb-run', '-s', '-nolisten local', 'pytest', '-v',
	'qtconsole', '--ignore', 'qtconsole/tests/test_inprocess_kernel.py']
	_XSERVTransmkdir: ERROR: euid != 0,directory /tmp/.X11-unix will not be created.
	============================= test session starts ==============================
	--
	qtconsole/tests/test_00_console_widget.py::test_scroll[True] PASSED	 [  2%]
	qtconsole/tests/test_00_console_widget.py::test_scroll[False] FAILED	 [  4%]
	qtconsole/tests/test_00_console_widget.py::test_input PASSED		 [  6%]
	--
	timeout=SHELL_TIMEOUT)
	E	pytestqt.exceptions.TimeoutError: waitUntil timed out in 20000 milliseconds
	qtconsole/tests/test_00_console_widget.py:49: TimeoutError
	--
	=========================== short test summary info ============================
	FAILED qtconsole/tests/test_00_console_widget.py::test_scroll[False] - pytest...
	============= 1 failed, 46 passed, 1 skipped in 168.19s (0:02:48) ==============
	INFO	 : Command's result: FAILURE
	INFO	 : Command's error: Command '['xvfb-run', '-s', '-nolisten local', 'pytest',
	'-v', 'qtconsole', '--ignore', 'qtconsole/tests/test_inprocess_kernel.py']' returned
	non-zero exit status 1.
	error: Bad exit status from /usr/src/tmp/rpmb-tmp.VQDw65 (%check)

python3-module-whoosh-2.7.4-alt4.1
	assert r.doc_count() == 4
	AssertionError: assert 3 == 4
	+  where 3 = doc_count()

python3-module-yaql-3.1.0-alt1
	{30} yaql.tests.test_type_aggregation.TestTypeAggregation.test_any_of [0.005791s] ... ok
	Unable to read data file '/temporarydir/some_random_filename': No such file or directory
	Unable to parse data: Expecting value: line 1 column 1 (char 0)
	--
	raise mismatch_error
	testtools.matchers._impl.MismatchError: >=:
	reference = datetime.timedelta(microseconds=240000)

rng-tools-6.17-alt1.1
	PASS: rngtestzero.sh
	FAIL: rngtestjitter.sh
	Testsuite summary for rng-tools 6.17
	--
	# SKIP:  0
	# XFAIL: 0
	# FAIL:  1
	# XPASS: 0
	# ERROR: 0
	See tests/test-suite.log

stockfish-18-alt1
	+ umask 022
	+ /bin/mkdir -p /usr/src/RPM/BUILD
	+ cd /usr/src/RPM/BUILD
	+ cd stockfish-18
	+ ./src/stockfish bench
	Stockfish 18 by the Stockfish developers (see AUTHORS file)
	/usr/src/tmp/rpmb-tmp.BgEMqU: line 137: 3427611 Segmentation fault	./src/stockfish
	bench
	error: Bad exit status from /usr/src/tmp/rpmb-tmp.BgEMqU (%check)
	RPM build errors:
	Bad exit status from /usr/src/tmp/rpmb-tmp.BgEMqU (%check)

trusttunnel-1.0.33-alt2
	test result: ok. 0 passed; 0 failed; 0 ignored; 0 measured; 0 filtered out; finished
	in 0.00s
	error: 1 target failed:
	`-p trusttunnel --test speedtest`

verilator-5.048-alt1
	V3Lexer_pregen.yy.cpp:227:25: note: the first difference of corresponding definitions
	is field 'yy_input_file'
	227 |	      std::streambuf* yy_input_file;
	V3PreLex_pregen.yy.cpp:492:15: note: a field of same name but different type is defined
	in another translation unit
	492 |	      FILE *yy_input_file;
	V3Lexer_pregen.yy.cpp:221:8: note: type name 'std::basic_streambuf<char,
	std::char_traits<char> >' should match type name '_IO_FILE'
	221 | struct yy_buffer_state
	make[2]: Leaving directory '/usr/src/RPM/BUILD/verilator-5.048/src/obj_opt'
	error: Bad exit status from /usr/src/tmp/rpmb-tmp.oRjPJi (%build)
	RPM build errors:
	Bad exit status from /usr/src/tmp/rpmb-tmp.oRjPJi (%build)

	36 error logs REMOVED from the list
auditd-plugin-clickhouse-lite-0.1.9-alt3
binwalk3-3.1.0-alt1
compiz-0.9.14.2-alt3.4
dufs-0.46.0-alt1
epsonscan2-6.7.82.0-alt3
felix-gogo-shell-1.1.4-alt1_1jpp11
fonts-ttf-IosevkaEtoile-34.7.0-alt1
fonts-ttf-IosevkaTerm-34.7.0-alt1
geronimo-annotation-1.0-alt4_28jpp11
geronimo-osgi-support-1.0-alt2_28jpp11
geronimo-parent-poms-1.6-alt3_33jpp11
glassfish-servlet-api3.1-3.1.0-alt4_18jpp11
gz-rendering-10.0.2-alt1
hedgewars-1.0.3-alt2.1
jboss-el-3.0-api-1.0.13-alt1_5jpp11
jboss-interceptors-1.2-api-1.0.1-alt1_2jpp11
jboss-jsp-2.3-api-1.0.3-alt1_2jpp11
jboss-servlet-3.1-api-1.0.2-alt1_2jpp11
jneuroml-core-1.6.1-alt1_4jpp11
jopt-simple-0:5.0.4-alt1_10jpp11
jsch-agent-proxy-0.0.8-alt1_15jpp11
json_simple-1.1.1-alt2_23jpp11
kernel-modules-nvidia-talos-595.84-alt2.397850.1
kopia-0.23.1-alt1
libfprint2-1.94.100-alt1
libmhash-0.9.9.9-alt1.qa1
liburing-2.15-alt1
perl-Crypt-Primes-0.52-alt1
python3-module-devpi-server-6.20.3-alt1
python3-module-django-extensions-3.2.3-alt4
python3-module-fabio-2025.10.0-alt1
python3-module-mdp-3.6.0.15.g64f14eee-alt7
python3-module-rapidfuzz-3.14.6-alt1
python3-module-zict-3.0.0-alt1
qt5-pim-5.15-alt1
skara-20260810-alt4.4b951a3c

Total 410 error logs.


^ permalink raw reply	[flat|nested] only message in thread

only message in thread, other threads:[~2026-09-09  7:35 UTC | newest]

Thread overview: (only message) (download: mbox.gz / follow: Atom feed)
-- links below jump to the message on this page --
2026-09-09  7:35 [cyber] I: Sisyphus-20260909 x86_64 beehive_status: +22 -36 (410) ALT beekeeper

ALT Linux Sisyphus cybertalk

This inbox may be cloned and mirrored by anyone:

	git clone --mirror http://lore.altlinux.org/sisyphus-cybertalk/0 sisyphus-cybertalk/git/0.git

	# If you have public-inbox 1.1+ installed, you may
	# initialize and index your mirror using the following commands:
	public-inbox-init -V2 sisyphus-cybertalk sisyphus-cybertalk/ http://lore.altlinux.org/sisyphus-cybertalk \
		sisyphus-cybertalk@lists.altlinux.org sisyphus-cybertalk@lists.altlinux.ru sisyphus-cybertalk@lists.altlinux.com
	public-inbox-index sisyphus-cybertalk

Example config snippet for mirrors.
Newsgroup available over NNTP:
	nntp://lore.altlinux.org/org.altlinux.lists.sisyphus-cybertalk


AGPL code for this site: git clone https://public-inbox.org/public-inbox.git