ALT Linux Sisyphus cybertalk
 help / color / mirror / Atom feed
* [cyber] I: Sisyphus-20260919 i586 beehive_status: +14 -89 (335)
@ 2026-09-19 12:29 ALT beekeeper
  0 siblings, 0 replies; only message in thread
From: ALT beekeeper @ 2026-09-19 12:29 UTC (permalink / raw)
  To: sisyphus-cybertalk

	14 NEW error logs

auditd-plugin-clickhouse-lite-0.1.9-alt3
	ok 5 auditd-plugin-clickhouse def-threads 100-loads
	0% tests passed, 1 tests failed out of 1
	Total Test time (real) = 1500.10 sec
	The following tests FAILED:
	1 - main_test (Timeout)

compiz-0.9.14.2-alt3.4
	[  1%] Generating /usr/src/RPM/BUILD/compiz-0.9.14.2/po/compiz.pot
	cd /usr/src/RPM/BUILD/compiz-0.9.14.2/po && /usr/bin/intltool-update --gettext-package
	compiz --pot
	make[2]: Leaving directory '/usr/src/RPM/BUILD/compiz-0.9.14.2/i586-alt-linux'
	make[1]: Entering directory '/usr/src/RPM/BUILD/compiz-0.9.14.2/i586-alt-linux'
	[ 37%] Built target nls
	make[1]: Leaving directory '/usr/src/RPM/BUILD/compiz-0.9.14.2/i586-alt-linux'
	make: *** [Makefile:169: all] Error 2
	error: Bad exit status from /usr/src/tmp/rpmb-tmp.wEubot (%build)
	RPM build errors:
	Bad exit status from /usr/src/tmp/rpmb-tmp.wEubot (%build)

drumgizmo-0.9.20-alt3
	make[3]: Entering directory '/usr/src/RPM/BUILD/drumgizmo-0.9.20/plugin'
	./ttlgen .libs/drumgizmo.so manifest.ttl X11UI > /dev/null
	make[3]: *** [Makefile:1192: manifest.ttl] Error 139
	make[3]: Leaving directory '/usr/src/RPM/BUILD/drumgizmo-0.9.20/plugin'
	make[2]: *** [Makefile:888: all-recursive] Error 1
	make[1]: *** [Makefile:473: all-recursive] Error 1
	make: *** [Makefile:405: all] Error 2
	error: Bad exit status from /usr/src/tmp/rpmb-tmp.nhnFhc (%build)
	RPM build errors:
	Bad exit status from /usr/src/tmp/rpmb-tmp.nhnFhc (%build)

gawk-5.1.0.0.213.d04f-alt2
	make[3]: Entering directory '/usr/src/RPM/BUILD/gawk-5.1.0.0.213.d04f-alt2/test'
	1 TESTS FAILED
	make[3]: *** [Makefile:5248: pass-fail] Error 1

gnome-sound-recorder-43-alt0.7.beta
	[67/68] Generating src/typescript-compile with a custom command
	FAILED: [code=2] src/tsc-output
	/usr/bin/tsc --outDir
	/usr/src/RPM/BUILD/gnome-sound-recorder-43.beta/noarch-alt-linux/tsc-out

gtranslator-50.0-alt1
	[119/163] Compiling C object src/libgtranslator.so.p/gtr-actions-search.c.o
	FAILED: [code=1] src/libgtranslator.so.p/gtr-actions-search.c.o
	cc -Isrc/libgtranslator.so.p -Isrc -I../src -I. -I.. -Isrc/translation-memory
	-I../src/translation-memory -Isrc/codeview -I../src/codeview
	-I/usr/include/glib-2.0 -I/usr/lib/glib-2.0/include -I/usr/include/gtk-4.0
	-I/usr/include/pango-1.0 -I/usr/include/harfbuzz -I/usr/include/gdk-pixbuf-2.0
	-I/usr/include/cairo -I/usr/include/freetype2 -I/usr/include/libpng16
	-I/usr/include/graphene-1.0 -I/usr/lib/graphene-1.0/include -I/usr/include/libadwaita-1
	-I/usr/include/libspelling-1 -I/usr/include/gtksourceview-5 -I/usr/include/libxml2
	-I/usr/include/gsettings-desktop-schemas -I/usr/include/libsoup-3.0
	-I/usr/include/json-glib-1.0 -fdiagnostics-color=always -D_FILE_OFFSET_BITS=64 -Wall
	-Winvalid-pch -O2 -g -DHAVE_CONFIG_H -DG_DISABLE_ASSERT -DG_DISABLE_CAST_CHECKS
	-pipe -frecord-gcc-switches -Wall -g -O2 -flto=auto -march=i586
	-mtune=generic -fPIC -pthread '-DG_LOG_DOMAIN="org.gnome.Gtranslator"'
	-MD -MQ src/libgtranslator.so.p/gtr-actions-search.c.o
	-MF src/libgtranslator.so.p/gtr-actions-search.c.o.d -o
	src/libgtranslator.so.p/gtr-actions-search.c.o -c ../src/gtr-actions-search.c
	In file included from ../src/gtr-actions-search.c:32:
	/usr/include/gtk-4.0/gdk/gdkkeysyms.h:32:2: error: #error "Only <gdk/gdk.h> can be
	included directly."
	32 | #error "Only <gdk/gdk.h> can be included directly."

ignition-adw-2.1.2-alt1
	[17/18] Generating src/typescript-compile with a custom command
	FAILED: [code=2] src/tsc-output
	/usr/bin/tsc -p /usr/src/RPM/BUILD/ignition-adw-2.1.2/tsconfig.json --outDir
	/usr/src/RPM/BUILD/ignition-adw-2.1.2/noarch-alt-linux/tsc-out

libuv-1.52.1-alt2
	ok 452 - tmpdir
	ok 453 - tty # SKIP Cannot open /dev/tty as read-only: No such file or directory
	ok 454 - tty_file
	--
	ok 506 - wtf8
	FAIL: test/run-tests
	1 of 1 test failed

podman-tui-1.11.3-alt1
	?	github.com/containers/podman-tui/ui/style	[no test files]
	?	github.com/containers/podman-tui/ui/system	[no test files]
	ok	github.com/containers/podman-tui/ui/system/sysdialogs	0.025s
	ok	github.com/containers/podman-tui/ui/utils	0.005s
	?	github.com/containers/podman-tui/ui/volumes	[no test files]
	ok	github.com/containers/podman-tui/ui/volumes/voldialogs	0.072s
	FAIL
	error: Bad exit status from /usr/src/tmp/rpmb-tmp.b7PPcH (%check)
	RPM build errors:
	Bad exit status from /usr/src/tmp/rpmb-tmp.b7PPcH (%check)

python3-module-chess-1.11.2-alt1
	return await command.result
	chess.engine.EngineTerminatedError: engine process died unexpectedly (exit code: -11)
	ERROR: test_sf_multipv (__main__.EngineTestCase.test_sf_multipv)
	Traceback (most recent call last):
	--
	return await command.result
	chess.engine.EngineTerminatedError: engine process died unexpectedly (exit code: -11)
	ERROR: test_sf_options (__main__.EngineTestCase.test_sf_options)
	Traceback (most recent call last):
	--
	return await command.result
	chess.engine.EngineTerminatedError: engine process died unexpectedly (exit code: -11)
	ERROR: test_sf_quit (__main__.EngineTestCase.test_sf_quit)
	Traceback (most recent call last):
	--
	return await command.result
	chess.engine.EngineTerminatedError: engine process died unexpectedly (exit code: -11)
	Ran 288 tests in 2.385s
	FAILED (errors=4, skipped=17)
	py3: exit 1 (2.71 seconds) /usr/src/RPM/BUILD/python3-module-chess-1.11.2> python
	test.py --verbose pid=3195030

python3-module-hypothesis-crosshair-0.0.30-alt1
	hypothesis_crosshair_provider/end_to_end_test.py::test_proxy_intolerance PASSED [ 89%]
	hypothesis_crosshair_provider/end_to_end_test.py::test_datetimes_can_generate_in_few_iterations
	FAILED [ 93%]
	hypothesis_crosshair_provider/end_to_end_test.py::test_nonrepresentable_float_bound_is_not_reported_as_invalid_argument
	PASSED [ 96%]
	--
	instants, nearest = _interesting_instants(tz, *self.instant_window)
	except TypeError:  # eg an unhashable tzinfo
	instants, nearest = (), 0
	--
	data.draw_integer(0, len(instants) - 1, shrink_towards=nearest)
	E	IndexError: tuple index out of range
	E	while generating 'n' from datetimes()
	--
	>	with pytest.raises(Exception, match="generated one"):
	E	AssertionError: Regex pattern did not match.
	E	  Expected regex: 'generated one'
	--
	=========================== short test summary info ============================
	FAILED
	hypothesis_crosshair_provider/end_to_end_test.py::test_datetimes_can_generate_in_few_iterations
	======================== 1 failed, 28 passed in 35.96s =========================
	INFO	 : Command's result: FAILURE
	INFO	 : Command's error: Command '['python3', '-m', 'pytest', '-vra']' returned
	non-zero exit status 1.
	error: Bad exit status from /usr/src/tmp/rpmb-tmp.UIAuCC (%check)

sfizz-1.2.3-alt5.g93da04262
	Unknown crossfade power curve: something
	Unknown velocity override: garbage
	Unknown/unsupported filter type: apf_1p
	Unknown/unsupported filter type: something
	Unknown EQ type: something
	test cases:   477 |   476 passed | 1 failed
	assertions: 52075 | 52074 passed | 1 failed
	error: Bad exit status from /usr/src/tmp/rpmb-tmp.p2gkTU (%check)
	RPM build errors:
	Bad exit status from /usr/src/tmp/rpmb-tmp.p2gkTU (%check)

squidmill-2.7.0-alt2
	Executing squidmill-test.d/25-insert-select... . . . . . . . . . OK
	Executing squidmill-test.d/26-insert-select-no-debug... . . FAILED:
	--- squidmill-test.d/26-insert-select-no-debug.log ---
	--
	Timeout check passed: 10s
	cat: squidmill-test.d/26-insert-select-no-debug.count: No such file or directory
	Wait for the Squidmill process to terminate...
	--
	--- END ---
	Some tests failed
	make: *** [Makefile:37: check] Error 1

television-0.15.9-alt1
	channels::channel::tests::test_load_candidates_large_input
	test result: FAILED. 187 passed; 2 failed; 1 ignored; 0 measured; 0 filtered out;
	finished in 0.07s
	error: test failed, to rerun pass `--lib`
	Running `/usr/src/RPM/BUILD/television-0.15.9/target/release/deps/tv-828a859ae6abc445`
	--
	test result: ok. 8 passed; 0 failed; 0 ignored; 0 measured; 0 filtered out; finished
	in 1.17s
	error: 1 target failed:
	`--lib`

	89 error logs REMOVED from the list
NetworkManager-1.58.1-alt1
adcli-0.9.2-alt1
adriconf-2.7.3-alt1
aeskulap-0.2.2-alt9.git8787e95
ardour-9.8-alt1
arpage-0.3.3-alt3_25
art-1.26.8-alt1
cdrdao-1.2.6-alt1
cherrytree-1.7.2-alt1
cpu-x-5.4.0-alt3
deepin-compressor-1:6.5.33-alt1
deepin-qt5integration-6.7.48-alt1
dufs-0.46.0-alt1
dune3d-1.4.0-alt1
eartag-1.0.3-alt1
eiciel-0.10.1-alt1_3
fcoe-utils-1.0.34-alt3
fontforge-20251009-alt1
gambit-4.9.7-alt5
gem-zeus-0.17.0-alt1
gimagereader-3.4.3-alt2
gip-1.7.0-alt3
gnome-quod-0.2.3-alt5
gnome-system-monitor-50.0-alt1
grub-customizer-5.2.8-alt1
gsmartcontrol-2.0.2-alt1
guitarix-0.47.0-alt2
horizon-2.7.2-alt1
imgdiff-1.0-alt3
infector-0.4-alt2.qa1.1
inkscape-1.4.4-alt2
itext-1:2.1.7-alt7_41jpp11
java-1.8.0-openjdk-0:1.8.0.504.b01-alt1
java-classmate-1.7.3-alt2
javacc-gradle-plugin-4.0.3-alt1
kronosnet-1.33-alt1
kubetui-1.12.1-alt1
kvmtool-3.18.0-alt9
libabigail-2.8-alt1
libflowcanvas-0.7.1-alt3
libglademm-2.6.7-alt3
libglibmm-2.66.9-alt1
libglibmm2.68-2.88.1-alt1
libgnomecanvasmm-2.26.0-alt3.2
libgtkmm3-3.24.11-alt1
libgtkmm4-4.22.0-alt1
libgtksourceviewmm3-3.21.3-alt1
libgtkspellmm3-3.0.5-alt1
libgupnp-igd-1.6.0-alt1
libnfs-5.0.3-alt1
libnotifymm-0.6.1-alt2
libtpms-0.10.2-alt1
lightdm-1.32.0-alt15
lxc-6.0.5-alt3
mapsoft2-2.10-alt1
mate-eiciel-1.20.1-alt1
mate-system-monitor-1:1.28.1-alt1
mazen-1.0.1-alt2
memcached-1.6.42-alt1
moc-2.6.0-alt0.9
nautilus-50.2.2-alt1
nitrogen-1.6.1-alt1
nwg-launchers-0.7.1.1-alt2
open-vm-tools-13.1.0-alt2
paman-0.9.4-alt4.qa3
paprefs-1.2-alt1
pavucontrol-6.2-alt1
pavumeter-0.9.3-alt3.qa3
python3-module-charset-normalizer-3.5.1-alt1
python3-module-django-compressor-2.4.1-alt1
python3-module-git-pandas-2.5.0-alt2.git2789b49d
python3-module-hdf5storage-0.2.2-alt1
python3-module-netbox-sdk-0.0.12-alt1
python3-module-numcodecs-0.16.5-alt1
python3-module-ollmcp-0.30.0-alt1
python3-module-websockets-16.1-alt1
radiotray-ng-0.2.10.1-alt1
rawtherapee-5.13-alt1
rdf-urdna-1.4-alt1
subtitleeditor-0.56.2-alt1
synfigstudio-1.5.5-alt1
terminator-2.1.5-alt1.1
transmission-4.1.3-alt2
vidcom-0.83-alt1
waybar-0.15.0-alt1
wayfire-config-manager-0.11.0-alt1
wf-shell-0.11.0-alt1
wl-screenrec-0.2.0-alt2
workrave-1.11.1-alt1

Total 335 error logs.


^ permalink raw reply	[flat|nested] only message in thread

only message in thread, other threads:[~2026-09-19 12:29 UTC | newest]

Thread overview: (only message) (download: mbox.gz / follow: Atom feed)
-- links below jump to the message on this page --
2026-09-19 12:29 [cyber] I: Sisyphus-20260919 i586 beehive_status: +14 -89 (335) ALT beekeeper

ALT Linux Sisyphus cybertalk

This inbox may be cloned and mirrored by anyone:

	git clone --mirror http://lore.altlinux.org/sisyphus-cybertalk/0 sisyphus-cybertalk/git/0.git

	# If you have public-inbox 1.1+ installed, you may
	# initialize and index your mirror using the following commands:
	public-inbox-init -V2 sisyphus-cybertalk sisyphus-cybertalk/ http://lore.altlinux.org/sisyphus-cybertalk \
		sisyphus-cybertalk@lists.altlinux.org sisyphus-cybertalk@lists.altlinux.ru sisyphus-cybertalk@lists.altlinux.com
	public-inbox-index sisyphus-cybertalk

Example config snippet for mirrors.
Newsgroup available over NNTP:
	nntp://lore.altlinux.org/org.altlinux.lists.sisyphus-cybertalk


AGPL code for this site: git clone https://public-inbox.org/public-inbox.git