ALT Linux Sisyphus cybertalk
 help / color / mirror / Atom feed
* [cyber] I: Sisyphus-20260919 x86_64 beehive_status: +18 -21 (365)
@ 2026-09-19  8:01 ALT beekeeper
  0 siblings, 0 replies; only message in thread
From: ALT beekeeper @ 2026-09-19  8:01 UTC (permalink / raw)
  To: sisyphus-cybertalk

	18 NEW error logs

casr-2.13.1-alt2
	test test_safe_func32 ... ignored
	test test_casr_ubsan ... FAILED
	test test_casr_lua ... ok
	--
	thread 'test_casr_ubsan' (3568291) panicked at casr/tests/tests.rs:3961:43:
	called `Result::unwrap()` on an `Err` value: Os { code: 2, kind: NotFound, message:
	"No such file or directory" }
	note: run with `RUST_BACKTRACE=1` environment variable to display a backtrace
	--
	test_casr_ubsan
	test result: FAILED. 22 passed; 1 failed; 4 ignored; 0 measured; 76 filtered out;
	finished in 52.68s
	error: test failed, to rerun pass `-p casr --test tests`
	Running unittests src/lib.rs (target/release/deps/libcasr-cd0206c960f194c9)
	--
	test result: ok. 0 passed; 0 failed; 0 ignored; 0 measured; 0 filtered out; finished
	in 0.00s
	error: 1 target failed:
	`-p casr --test tests`

dm-secdel-1.0.12-alt1
	systemctl daemon-reload
	make: systemctl: No such file or directory
	make: [Makefile:24: install-bin] Error 127 (ignored)
	systemctl enable secdeltab
	make: systemctl: No such file or directory
	make: [Makefile:25: install-bin] Error 127 (ignored)
	--
	make[2]: Entering directory '/usr/src/RPM/BUILD/dm-secdel-1.0.12'
	make[3]: /usr/src/linux-7.1.13-7.1-alt1/scripts/pahole-version.sh: No such file or
	directory
	make[2]: Leaving directory '/usr/src/RPM/BUILD/dm-secdel-1.0.12'
	--
	make[2]: Entering directory '/usr/src/RPM/BUILD/dm-secdel-1.0.12'
	make[3]: /usr/src/linux-7.1.13-7.1-alt1/scripts/pahole-version.sh: No such file or
	directory
	warning: pahole version differs from the one used to build the kernel

fonts-ttf-Iosevka-34.8.1-alt1
	[ACTION] Create TTF 'dist/Iosevka/TTF-Unhinted/Iosevka-Thin.ttf'
	[ACTION] Create TTF 'dist/Iosevka/TTF-Unhinted/Iosevka-ExtendedThin.ttf'
	[ACTION] Create TTF 'dist/Iosevka/TTF-Unhinted/Iosevka-ThinOblique.ttf'
	[ACTION] Create TTF 'dist/Iosevka/TTF-Unhinted/Iosevka-ExtendedThinOblique.ttf'
	[ACTION] Hint TTF 'dist/Iosevka/TTF/Iosevka-Heavy.ttf' <-
	'dist/Iosevka/TTF-Unhinted/Iosevka-Heavy.ttf'
	[ACTION] Hint TTF 'dist/Iosevka/TTF/Iosevka-ExtraLight.ttf' <-
	'dist/Iosevka/TTF-Unhinted/Iosevka-ExtraLight.ttf'
	/usr/src/tmp/rpmb-tmp.0Dgw1e: line 134: 1966937 CPU time limit exceeded npm run build
	-- ttf::Iosevka
	error: Bad exit status from /usr/src/tmp/rpmb-tmp.0Dgw1e (%build)
	RPM build errors:
	Bad exit status from /usr/src/tmp/rpmb-tmp.0Dgw1e (%build)

grex-1.4.6-alt1
	running 45 tests
	test matching_regexes_with_case_insensitive_matching ... FAILED
	test matching_regexes_with_case_insensitive_matching_and_verbose_mode ... ok
	--
	thread 'matching_regexes_with_case_insensitive_matching' (1812489) panicked at
	tests/property_tests.rs:23:1:
	Test failed: assertion failed: test_cases.iter().all(|test_case|
	compiled_regexp.is_match(test_case)) at tests/property_tests.rs:281.
	minimal failing input: test_cases = {
	--
	matching_regexes_with_case_insensitive_matching
	test result: FAILED. 44 passed; 1 failed; 0 ignored; 0 measured; 0 filtered out;
	finished in 2.98s
	error: test failed, to rerun pass `--test property_tests`
	error: Bad exit status from /usr/src/tmp/rpmb-tmp.OPvcaa (%check)

libopenimageio-3.1.17.0-alt1
	from
	/usr/src/RPM/BUILD/libopenimageio-3.1.17.0/testsuite/texture-device/devicecheck_main.cpp:5:
	/usr/include/cuda_fp16.h:5319:16: error: conflicting declaration 'typedef struct
	__half half'
	5319 | typedef __half half;
	--
	from
	/usr/src/RPM/BUILD/libopenimageio-3.1.17.0/testsuite/texture-device/device_tests.cpp:5:
	/usr/include/cuda_fp16.h:5319:16: error: conflicting declaration 'typedef struct
	__half half'
	5319 | typedef __half half;
	--
	from /usr/src/RPM/BUILD/libopenimageio-3.1.17.0/testsuite/texture-device/blend.cpp:5:
	/usr/include/cuda_fp16.h:5319:16: error: conflicting declaration 'typedef struct
	__half half'
	5319 | typedef __half half;

lore-0.8.6-alt1
	test lore-server/src/hooks/traits.rs - hooks::traits::Hook (line 420) ... ok
	test lore-server/src/hooks/traits.rs - hooks::traits::HookError::rejected (line 267) ... ok
	test lore-server/src/server.rs - server::server_main (line 164) - compile ... ok
	--
	test lore-server/src/hooks/mod.rs - hooks (line 155) ... ok
	test lore-server/src/hooks/traits.rs - hooks::traits::HookError::rejected_default
	(line 294) ... ok
	test lore-server/src/store/configuration.rs - store::configuration::resolve_plugin_config
	(line 186) ... ok
	--
	test result: ok. 0 passed; 0 failed; 0 ignored; 0 measured; 0 filtered out; finished
	in 0.00s
	error: 1 target failed:
	`-p lore-revision --test clone`

openFPGALoader-1.1.1-alt1
	doctree = pickle.loads(serialised)
	EOFError: Ran out of input
	The above exception was the direct cause of the following exception:
	--
	) from exc
	sphinx.errors.ExtensionError: Handler <bound method TocTreeCollector.get_updated_docs
	of <sphinx.environment.collectors.toctree.TocTreeCollector object at 0x7f81be2f6510>>
	for event 'env-get-updated' threw an exception (exception: Ran out of input)
	The full traceback has been saved in:

openmotif-2.3.8-alt3
	make[4]: Entering directory
	'/usr/src/RPM/BUILD/openmotif-2.3.8/demos/programs/hellomotifi18n'
	x86_64-alt-linux-gcc -DHAVE_CONFIG_H -I. -I../../../include -I../../../lib/Xm
	-I../../../lib -I../../../lib	 -I/usr/include/freetype2 -I/usr/include/libpng16
	-I/usr/include/harfbuzz -I/usr/include/glib-2.0 -I/usr/lib64/glib-2.0/include
	-I/usr/include/freetype2 -I/usr/include/libpng16 -I/usr/include/harfbuzz
	-I/usr/include/glib-2.0 -I/usr/lib64/glib-2.0/include  -pipe -frecord-gcc-switches
	-Wall -g -O2 -flto=auto -std=gnu17  -Wall -g -fno-strict-aliasing -Wno-unused
	-Wno-comment -I/usr/include/freetype2 -I/usr/include/libpng16 -I/usr/include/harfbuzz
	-I/usr/include/glib-2.0 -I/usr/lib64/glib-2.0/include	-c -o helloint.o helloint.c
	make[4]: Leaving directory
	'/usr/src/RPM/BUILD/openmotif-2.3.8/demos/programs/hellomotifi18n'
	make[3]: *** [Makefile:578: all-recursive] Error 1
	make[2]: *** [Makefile:431: all-recursive] Error 1
	make[1]: *** [Makefile:398: all-recursive] Error 1
	make: *** [Makefile:457: all-recursive] Error 1
	error: Bad exit status from /usr/src/tmp/rpmb-tmp.TVqo01 (%build)
	RPM build errors:
	Bad exit status from /usr/src/tmp/rpmb-tmp.TVqo01 (%build)

openshadinglanguage-1.15.5.0-alt2
	In file included from
	/usr/lib/llvm-21.1/lib64/clang/21/include/__clang_cuda_runtime_wrapper.h:209:
	/usr/include/crt/math_functions.hpp:2987:40: error: expected function body after
	function declarator
	2987 | __func__(double rsqrt(const double a)) _NV_RSQRT_SPECIFIER
	In file included from <built-in>:1:
	/usr/lib/llvm-21.1/lib64/clang/21/include/__clang_cuda_runtime_wrapper.h:388:10: fatal
	error: 'texture_fetch_functions.h' file not found
	388 | #include "texture_fetch_functions.h"

projectlibre-1.9.8-alt2
	file /etc/java/security/security.d/2000-org.bouncycastle.jce.provider.BouncyCastleProvider
	conflicts between attempted installs of bouncycastle1.65-0:1.65-alt4_4jpp11.noarch and
	bouncycastle-0:1.84-alt1.noarch
	hsh-install: Packages installation failed.

python3-module-crosshair-tool-0.0.110-alt1
	==================================== ERRORS ====================================
	____________________________ ERROR collecting gw20 _____________________________
	Different tests were collected between gw6 and gw20. The difference is:
	--
	To see why this happens see 'Known limitations' in documentation for pytest-xdist
	_____________________________ ERROR collecting gw0 _____________________________
	Different tests were collected between gw6 and gw0. The difference is:
	--
	=========================== short test summary info ============================
	ERROR gw20 - Different tests were collected between gw6 and gw20. The differe...
	ERROR gw0 - Different tests were collected between gw6 and gw0. The differenc...
	======================== 32 warnings, 2 errors in 9.56s ========================
	INFO	 : Command's result: FAILURE
	INFO	 : Command's error: Command '['python3',
	'-m', 'pytest', '-vra', '-n', '32', '--deselect',
	'crosshair/libimpl/datetimelib_ch_test.py::test_builtin[check_timedelta_new]',
	'--deselect', 'crosshair/libimpl/datetimelib_test.py::test_leap_year']' returned non-zero
	exit status 1.
	error: Bad exit status from /usr/src/tmp/rpmb-tmp.Qzc6nF (%check)

python3-module-fabio-2025.10.0-alt1
	+ cd /usr/src/RPM/BUILD
	+ cd python3-module-fabio-2025.10.0
	+ env
	PYTHONPATH=/usr/src/tmp/python3-module-fabio-buildroot/usr/lib64/python3/site-packages
	python3 run_tests.py --installed
	WARNING:py.warnings:/usr/lib64/python3/site-packages/h5py/__init__.py:36: UserWarning:
	h5py is running against HDF5 2.2.0 when it was built against 2.1.1, this may cause problems
	_warn(("h5py is running against HDF5 {0} when it was built against {1}, "
	WARNING:run_tests:Test fabio 2025.10.0 from
	/usr/src/tmp/python3-module-fabio-buildroot/usr/lib64/python3/site-packages/fabio
	.........................................................sssssssssssssssssss...............................s........ssssssssss.........sssssssssss.....s..................sss....ssssssssssssssssssssss...sss...sssssss...ss.ssssss.sssssssssssssssssssssssssss...sssss/usr/src/tmp/rpmb-tmp.GUp8vt:
	line 138: 2212796 Illegal instruction	  env
	PYTHONPATH=/usr/src/tmp/python3-module-fabio-buildroot/usr/lib64/python3/site-packages
	python3 run_tests.py --installed
	error: Bad exit status from /usr/src/tmp/rpmb-tmp.GUp8vt (%check)
	RPM build errors:
	Bad exit status from /usr/src/tmp/rpmb-tmp.GUp8vt (%check)

python3-module-hypothesis-crosshair-0.0.30-alt1
	hypothesis_crosshair_provider/end_to_end_test.py::test_proxy_intolerance PASSED [ 89%]
	hypothesis_crosshair_provider/end_to_end_test.py::test_datetimes_can_generate_in_few_iterations
	FAILED [ 93%]
	hypothesis_crosshair_provider/end_to_end_test.py::test_nonrepresentable_float_bound_is_not_reported_as_invalid_argument
	PASSED [ 96%]
	--
	instants, nearest = _interesting_instants(tz, *self.instant_window)
	except TypeError:  # eg an unhashable tzinfo
	instants, nearest = (), 0
	--
	data.draw_integer(0, len(instants) - 1, shrink_towards=nearest)
	E	IndexError: tuple index out of range
	E	while generating 'n' from datetimes()
	--
	>	with pytest.raises(Exception, match="generated one"):
	E	AssertionError: Regex pattern did not match.
	E	  Expected regex: 'generated one'
	--
	=========================== short test summary info ============================
	FAILED
	hypothesis_crosshair_provider/end_to_end_test.py::test_datetimes_can_generate_in_few_iterations
	======================== 1 failed, 28 passed in 24.39s =========================
	INFO	 : Command's result: FAILURE
	INFO	 : Command's error: Command '['python3', '-m', 'pytest', '-vra']' returned
	non-zero exit status 1.
	error: Bad exit status from /usr/src/tmp/rpmb-tmp.GcqBfI (%check)

python3-module-pytest-httpbin-2.1.0-alt1.1
	is not None
	E	AssertionError: assert None is not None
	E	 +  where None = <function match at 0x7fcac4391430>('pytest-httpbin server hit
	an exception serving request:.* The handshake operation timed out\nattempting to ignore
	so the rest of the tests can run\n', '')
	--
	=========================== short test summary info ============================
	FAILED tests/test_server.py::test_dont_crash_on_handshake_timeout - Assertion...
	========================= 1 failed, 22 passed in 3.11s =========================
	INFO	 : Command's result: FAILURE
	INFO	 : Command's error: Command '['python3', '-m', 'pytest', '-ra', '-Wignore']'
	returned non-zero exit status 1.
	error: Bad exit status from /usr/src/tmp/rpmb-tmp.0VKc89 (%check)

python3-module-qtconsole-5.7.2-alt1.1
	INFO	 : Running command: ['xvfb-run', '-s', '-nolisten local', 'pytest', '-v',
	'qtconsole', '--ignore', 'qtconsole/tests/test_inprocess_kernel.py']
	_XSERVTransmkdir: ERROR: euid != 0,directory /tmp/.X11-unix will not be created.
	============================= test session starts ==============================
	--
	qtconsole/tests/test_00_console_widget.py::test_input PASSED		 [  6%]
	qtconsole/tests/test_00_console_widget.py::test_debug FAILED		 [  8%]
	qtconsole/tests/test_00_console_widget.py::test_input_and_print PASSED	 [ 10%]
	--
	timeout=SHELL_TIMEOUT)
	E	pytestqt.exceptions.TimeoutError: waitUntil timed out in 20000 milliseconds
	qtconsole/tests/test_00_console_widget.py:188: TimeoutError
	--
	=========================== short test summary info ============================
	FAILED qtconsole/tests/test_00_console_widget.py::test_debug - pytestqt.excep...
	============= 1 failed, 46 passed, 1 skipped in 135.47s (0:02:15) ==============
	INFO	 : Command's result: FAILURE
	INFO	 : Command's error: Command '['xvfb-run', '-s', '-nolisten local', 'pytest',
	'-v', 'qtconsole', '--ignore', 'qtconsole/tests/test_inprocess_kernel.py']' returned
	non-zero exit status 1.
	error: Bad exit status from /usr/src/tmp/rpmb-tmp.i88BSA (%check)

python3-module-rapidfuzz-3.14.6-alt1


stockfish-18-alt1
	+ umask 022
	+ /bin/mkdir -p /usr/src/RPM/BUILD
	+ cd /usr/src/RPM/BUILD
	+ cd stockfish-18
	+ ./src/stockfish bench
	Stockfish 18 by the Stockfish developers (see AUTHORS file)
	/usr/src/tmp/rpmb-tmp.bcNBcm: line 137: 2561970 Segmentation fault	./src/stockfish
	bench
	error: Bad exit status from /usr/src/tmp/rpmb-tmp.bcNBcm (%check)
	RPM build errors:
	Bad exit status from /usr/src/tmp/rpmb-tmp.bcNBcm (%check)

uutils-coreutils-0.9.0-alt1
	test_stdbuf::test_stdbuf_unbuffered_stdout
	test result: FAILED. 5126 passed; 5 failed; 85 ignored; 0 measured; 48 filtered out;
	finished in 11.54s
	error: test failed, to rerun pass `--test tests`
	Doc-tests coreutils
	--
	test result: ok. 0 passed; 0 failed; 0 ignored; 0 measured; 0 filtered out; finished
	in 0.00s
	error: 1 target failed:
	`--test tests`

	21 error logs REMOVED from the list
deepin-qt5integration-6.7.48-alt1
fonts-ttf-IosevkaTermCurly-34.8.1-alt1
gz-gui-10.0.0-alt3
gz-rendering-10.0.2-alt1
jigasi-1.1-alt0.3
jitsi-videobridge-1:2.3.9258-alt1
libgupnp-igd-1.6.0-alt1
lomiri-ui-extras-0.8.2-alt1
perl-Net-SIP-0.840-alt1
perl-Sane-0.05-alt3.2
perl-Server-Starter-0.35-alt1.1
perl-Starlet-0.31-alt1_22
perl-Tie-DBI-1.08-alt1
prometheus-jmx_exporter-1.0.1-alt6
python3-module-chess-1.11.2-alt1
python3-module-django-compressor-2.4.1-alt1
python3-module-filelock-3.25.2-alt1.1
python3-module-mdp-3.6.0.15.g64f14eee-alt7
python3-module-paho-2.1.0-alt2
python3-module-websockets-16.1-alt1
rng-tools-6.17-alt1.1

Total 365 error logs.


^ permalink raw reply	[flat|nested] only message in thread

only message in thread, other threads:[~2026-09-19  8:01 UTC | newest]

Thread overview: (only message) (download: mbox.gz / follow: Atom feed)
-- links below jump to the message on this page --
2026-09-19  8:01 [cyber] I: Sisyphus-20260919 x86_64 beehive_status: +18 -21 (365) ALT beekeeper

ALT Linux Sisyphus cybertalk

This inbox may be cloned and mirrored by anyone:

	git clone --mirror http://lore.altlinux.org/sisyphus-cybertalk/0 sisyphus-cybertalk/git/0.git

	# If you have public-inbox 1.1+ installed, you may
	# initialize and index your mirror using the following commands:
	public-inbox-init -V2 sisyphus-cybertalk sisyphus-cybertalk/ http://lore.altlinux.org/sisyphus-cybertalk \
		sisyphus-cybertalk@lists.altlinux.org sisyphus-cybertalk@lists.altlinux.ru sisyphus-cybertalk@lists.altlinux.com
	public-inbox-index sisyphus-cybertalk

Example config snippet for mirrors.
Newsgroup available over NNTP:
	nntp://lore.altlinux.org/org.altlinux.lists.sisyphus-cybertalk


AGPL code for this site: git clone https://public-inbox.org/public-inbox.git