ALT Linux Sisyphus cybertalk
 help / color / mirror / Atom feed
* [cyber] I: Sisyphus-20260905 i586 beehive_status: +116 -31 (408)
@ 2026-09-05 11:56 ALT beekeeper
  0 siblings, 0 replies; only message in thread
From: ALT beekeeper @ 2026-09-05 11:56 UTC (permalink / raw)
  To: sisyphus-cybertalk

[-- Warning: decoded text below may be mangled, UTF-8 assumed --]
[-- Attachment #1: Type: text/plain; charset=unknown-8bit, Size: 93726 bytes --]

	116 NEW error logs

antlr32-3.2-alt1_28jpp11
	[ERROR] Re-run Maven using the -X switch to enable full debug logging.
	[ERROR]
	[ERROR] For more information about the errors and possible solutions, please read the
	following articles:
	[ERROR] [Help 1]
	http://cwiki.apache.org/confluence/display/MAVEN/PluginIncompatibleException
	[ERROR]
	[ERROR] After correcting the problems, you can resume the build with the command
	[ERROR]   mvn <args> -rf :antlr-runtime
	error: Bad exit status from /usr/src/tmp/rpmb-tmp.mPH6Ka (%build)
	RPM build errors:
	Bad exit status from /usr/src/tmp/rpmb-tmp.mPH6Ka (%build)

apache-commons-lang-0:2.6-alt5_32jpp11
	[ERROR] -> [Help 1]
	[ERROR]
	[ERROR] To see the full stack trace of the errors, re-run Maven with the -e switch.
	[ERROR] Re-run Maven using the -X switch to enable full debug logging.
	[ERROR]
	[ERROR] For more information about the errors and possible solutions, please read the
	following articles:
	[ERROR] [Help 1]
	http://cwiki.apache.org/confluence/display/MAVEN/PluginIncompatibleException
	error: Bad exit status from /usr/src/tmp/rpmb-tmp.Drexa1 (%build)
	RPM build errors:
	Bad exit status from /usr/src/tmp/rpmb-tmp.Drexa1 (%build)

apache-commons-modeler-1:2.0.1-alt1_28jpp11
	[ERROR] -> [Help 1]
	[ERROR]
	[ERROR] To see the full stack trace of the errors, re-run Maven with the -e switch.
	[ERROR] Re-run Maven using the -X switch to enable full debug logging.
	[ERROR]
	[ERROR] For more information about the errors and possible solutions, please read the
	following articles:
	[ERROR] [Help 1]
	http://cwiki.apache.org/confluence/display/MAVEN/PluginIncompatibleException
	error: Bad exit status from /usr/src/tmp/rpmb-tmp.Q4rQHN (%build)
	RPM build errors:
	Bad exit status from /usr/src/tmp/rpmb-tmp.Q4rQHN (%build)

attoparser-2.0.7-alt1
	[ERROR] -> [Help 1]
	[ERROR]
	[ERROR] To see the full stack trace of the errors, re-run Maven with the -e switch.
	[ERROR] Re-run Maven using the -X switch to enable full debug logging.
	[ERROR]
	[ERROR] For more information about the errors and possible solutions, please read the
	following articles:
	[ERROR] [Help 1]
	http://cwiki.apache.org/confluence/display/MAVEN/PluginIncompatibleException
	error: Bad exit status from /usr/src/tmp/rpmb-tmp.LWrCbX (%build)
	RPM build errors:
	Bad exit status from /usr/src/tmp/rpmb-tmp.LWrCbX (%build)

compile-command-annotations-1.2.1-alt1_10jpp11
	[ERROR] -> [Help 1]
	[ERROR]
	[ERROR] To see the full stack trace of the errors, re-run Maven with the -e switch.
	[ERROR] Re-run Maven using the -X switch to enable full debug logging.
	[ERROR]
	[ERROR] For more information about the errors and possible solutions, please read the
	following articles:
	[ERROR] [Help 1]
	http://cwiki.apache.org/confluence/display/MAVEN/PluginIncompatibleException
	error: Bad exit status from /usr/src/tmp/rpmb-tmp.TGxyzu (%build)
	RPM build errors:
	Bad exit status from /usr/src/tmp/rpmb-tmp.TGxyzu (%build)

deepin-appearance-1.1.85-alt1
	[131/132] : && /usr/bin/c++ -pipe -frecord-gcc-switches -Wall
	-g -O2 -flto=auto -march=i586 -mtune=generic -O2 -g -DNDEBUG
	-Wl,--dependency-file=fakewm/CMakeFiles/dde-fakewm.dir/link.d
	fakewm/CMakeFiles/dde-fakewm.dir/dde-fakewm_autogen/mocs_compilation.cpp.o
	fakewm/CMakeFiles/dde-fakewm.dir/dbus/deepinwmfaker.cpp.o
	fakewm/CMakeFiles/dde-fakewm.dir/main.cpp.o
	fakewm/CMakeFiles/dde-fakewm.dir/wmadaptor.cpp.o -o fakewm/dde-fakewm
	-Wl,-rpath,/usr/lib/dqt6/lib:  /usr/lib/dqt6/lib/libQt6Concurrent.so.6.10.3
	/usr/lib/libdtk6gui.so.6.7.48  /usr/lib/libKF6ConfigCore.so.6.29.0
	/usr/lib/libKF6WindowSystem.so.6.29.0  /usr/lib/libKF6GlobalAccel.so.6.29.0
	/usr/lib/libdtk6core.so.6.7.48	/usr/lib/dqt6/lib/libQt6Xml.so.6.10.3
	/usr/lib/libdtk6log.so.0.7.48  /usr/lib/dqt6/lib/libQt6Network.so.6.10.3
	-lwayland-client  /usr/lib/libX11.so  /usr/lib/dqt6/lib/libQt6Widgets.so.6.10.3
	/usr/lib/dqt6/lib/libQt6Gui.so.6.10.3  /usr/lib/dqt6/lib/libQt6DBus.so.6.10.3
	/usr/lib/dqt6/lib/libQt6Core.so.6.10.3	/usr/lib/libGLX.so  /usr/lib/libOpenGL.so && :
	FAILED: [code=1] fakewm/dde-fakewm
	: && /usr/bin/c++ -pipe -frecord-gcc-switches -Wall -g
	-O2 -flto=auto -march=i586 -mtune=generic -O2 -g -DNDEBUG
	-Wl,--dependency-file=fakewm/CMakeFiles/dde-fakewm.dir/link.d
	fakewm/CMakeFiles/dde-fakewm.dir/dde-fakewm_autogen/mocs_compilation.cpp.o
	fakewm/CMakeFiles/dde-fakewm.dir/dbus/deepinwmfaker.cpp.o
	fakewm/CMakeFiles/dde-fakewm.dir/main.cpp.o
	fakewm/CMakeFiles/dde-fakewm.dir/wmadaptor.cpp.o -o fakewm/dde-fakewm
	-Wl,-rpath,/usr/lib/dqt6/lib:  /usr/lib/dqt6/lib/libQt6Concurrent.so.6.10.3
	/usr/lib/libdtk6gui.so.6.7.48  /usr/lib/libKF6ConfigCore.so.6.29.0
	/usr/lib/libKF6WindowSystem.so.6.29.0  /usr/lib/libKF6GlobalAccel.so.6.29.0
	/usr/lib/libdtk6core.so.6.7.48	/usr/lib/dqt6/lib/libQt6Xml.so.6.10.3
	/usr/lib/libdtk6log.so.0.7.48  /usr/lib/dqt6/lib/libQt6Network.so.6.10.3
	-lwayland-client  /usr/lib/libX11.so  /usr/lib/dqt6/lib/libQt6Widgets.so.6.10.3
	/usr/lib/dqt6/lib/libQt6Gui.so.6.10.3  /usr/lib/dqt6/lib/libQt6DBus.so.6.10.3
	/usr/lib/dqt6/lib/libQt6Core.so.6.10.3	/usr/lib/libGLX.so  /usr/lib/libOpenGL.so && :
	ld: /usr/lib/libKF6ConfigCore.so.6.29.0: undefined reference to `qt_version_tag@Qt_6.11'
	ld: /usr/lib/libKF6WindowSystem.so.6.29.0: undefined reference to
	`QFutureInterfaceBase::isAddResultsIfCanceledEnabled() const@Qt_6'
	collect2: error: ld returned 1 exit status
	[132/132] : && /usr/bin/c++ -fPIC -pipe -frecord-gcc-switches -Wall
	-g -O2 -flto=auto -march=i586 -mtune=generic -O2 -g -DNDEBUG  -shared
	-Wl,--dependency-file=src/service/CMakeFiles/plugin-dde-appearance.dir/link.d
	-o src/service/libplugin-dde-appearance.so
	src/service/CMakeFiles/plugin-dde-appearance.dir/plugin-dde-appearance_autogen/mocs_compilation.cpp.o
	src/service/CMakeFiles/plugin-dde-appearance.dir/appearance1adaptor.cpp.o
	src/service/CMakeFiles/plugin-dde-appearance.dir/plugin.cpp.o
	src/service/CMakeFiles/plugin-dde-appearance.dir/dbus/scaleFactors.cpp.o
	src/service/CMakeFiles/plugin-dde-appearance.dir/dbus/appearancedbusproxy.cpp.o
	src/service/CMakeFiles/plugin-dde-appearance.dir/dbus/appearanceproperty.cpp.o
	src/service/CMakeFiles/plugin-dde-appearance.dir/dbus/appearance1thread.cpp.o
	src/service/CMakeFiles/plugin-dde-appearance.dir/dbus/appearance1.cpp.o
	src/service/CMakeFiles/plugin-dde-appearance.dir/impl/appearancemanager.cpp.o
	src/service/CMakeFiles/plugin-dde-appearance.dir/impl/fsnotify.cpp.o
	src/service/CMakeFiles/plugin-dde-appearance.dir/impl/appearancesyncconfig.cpp.o
	src/service/CMakeFiles/plugin-dde-appearance.dir/modules/background/background.cpp.o
	src/service/CMakeFiles/plugin-dde-appearance.dir/modules/fonts/fontsmanager.cpp.o
	src/service/CMakeFiles/plugin-dde-appearance.dir/modules/subthemes/subthemes.cpp.o
	src/service/CMakeFiles/plugin-dde-appearance.dir/modules/subthemes/scanner.cpp.o
	src/service/CMakeFiles/plugin-dde-appearance.dir/modules/subthemes/theme.cpp.o
	src/service/CMakeFiles/plugin-dde-appearance.dir/modules/subthemes/customtheme.cpp.o
	src/service/CMakeFiles/plugin-dde-appearance.dir/modules/api/themes.cpp.o
	src/service/CMakeFiles/plugin-dde-appearance.dir/modules/api/keyfile.cpp.o
	src/service/CMakeFiles/plugin-dde-appearance.dir/modules/api/locale.cpp.o
	src/service/CMakeFiles/plugin-dde-appearance.dir/modules/api/themethumb.cpp.o
	src/service/CMakeFiles/plugin-dde-appearance.dir/modules/api/dfile.cpp.o
	src/service/CMakeFiles/plugin-dde-appearance.dir/modules/api/utils.cpp.o
	src/service/CMakeFiles/plugin-dde-appearance.dir/modules/api/syncconfig.cpp.o
	src/service/CMakeFiles/plugin-dde-appearance.dir/modules/api/sunrisesunset.cpp.o
	src/service/CMakeFiles/plugin-dde-appearance.dir/modules/api/compatibleengine.cpp.o
	src/service/CMakeFiles/plugin-dde-appearance.dir/modules/background/format.cpp.o
	src/service/CMakeFiles/plugin-dde-appearance.dir/modules/background/backgrounds.cpp.o
	src/service/CMakeFiles/plugin-dde-appearance.dir/modules/dconfig/dconfigsettings.cpp.o
	src/service/CMakeFiles/plugin-dde-appearance.dir/modules/dconfig/phasewallpaper.cpp.o
	-Wl,-rpath,/usr/lib/dqt6/lib:  /usr/lib/dqt6/lib/libQt6Concurrent.so.6.10.3
	/usr/lib/libdtk6gui.so.6.7.48  /usr/lib/libKF6WindowSystem.so.6.29.0
	/usr/lib/libdtk6core.so.6.7.48	/usr/lib/dqt6/lib/libQt6Xml.so.6.10.3
	/usr/lib/libdtk6log.so.0.7.48  /usr/lib/dqt6/lib/libQt6Network.so.6.10.3
	-lwayland-client  /usr/lib/libgtk-3.so	/usr/lib/libatk-1.0.so	/usr/lib/libgdk-3.so
	/usr/lib/libpangocairo-1.0.so  /usr/lib/libpango-1.0.so  /usr/lib/libharfbuzz.so
	/usr/lib/libgdk_pixbuf-2.0.so  /usr/lib/libz.so  /usr/lib/libcairo-gobject.so
	/usr/lib/libcairo.so  /usr/lib/libXcursor.so  /usr/lib/libXfixes.so  /usr/lib/libX11.so
	/usr/lib/libxcb-render.so  /usr/lib/libxcb-randr.so  /usr/lib/libxcb-cursor.so
	/usr/lib/libxcb.so  /usr/lib/libssl.so	/usr/lib/libcrypto.so  /usr/lib/libfontconfig.so
	/usr/lib/libfreetype.so  /usr/lib/dqt6/lib/libgsettings-qt6.so	/usr/lib/libgio-2.0.so
	/usr/lib/libgobject-2.0.so  /usr/lib/libglib-2.0.so  /usr/lib/dqt6/lib/libQt6Gui.so.6.10.3
	/usr/lib/dqt6/lib/libQt6DBus.so.6.10.3	/usr/lib/dqt6/lib/libQt6Core.so.6.10.3
	/usr/lib/libGLX.so  /usr/lib/libOpenGL.so  /usr/lib/libX11.so && :

deepin-compressor-1:6.5.33-alt1
	[180/180] : && /usr/bin/c++ -pipe -frecord-gcc-switches -Wall -g -O2
	-flto=auto -march=i586 -mtune=generic -std=c++11 -Wl,--as-needed -fPIE -fPIC
	-O3 -Wl,-O1,-rpath=/usr/lib/deepin-compressor/plugins -fstack-protector-strong
	-D_FORTIFY_SOURCE=2 -z noexecstack -pie -fPIC -z lazy -Wl,-z,relro -Wl,-z,now -O2
	-g -DNDEBUG -pie -Wl,--dependency-file=src/CMakeFiles/deepin-compressor.dir/link.d
	src/CMakeFiles/deepin-compressor.dir/deepin-compressor_autogen/mocs_compilation.cpp.o
	src/CMakeFiles/deepin-compressor.dir/main.cpp.o
	src/CMakeFiles/deepin-compressor.dir/source/DebugTimeManager.cpp.o
	src/CMakeFiles/deepin-compressor.dir/source/archivemanager/archivejob.cpp.o
	src/CMakeFiles/deepin-compressor.dir/source/archivemanager/archivemanager.cpp.o
	src/CMakeFiles/deepin-compressor.dir/source/archivemanager/batchjob.cpp.o
	src/CMakeFiles/deepin-compressor.dir/source/archivemanager/singlejob.cpp.o
	src/CMakeFiles/deepin-compressor.dir/source/common/calculatesizethread.cpp.o
	src/CMakeFiles/deepin-compressor.dir/source/common/customwidget.cpp.o
	src/CMakeFiles/deepin-compressor.dir/source/common/dbusadpator.cpp.o
	src/CMakeFiles/deepin-compressor.dir/source/common/ddesktopservicesthread.cpp.o
	src/CMakeFiles/deepin-compressor.dir/source/common/eventlogutils.cpp.o
	src/CMakeFiles/deepin-compressor.dir/source/common/mimetypedisplaymanager.cpp.o
	src/CMakeFiles/deepin-compressor.dir/source/common/mimetypes.cpp.o
	src/CMakeFiles/deepin-compressor.dir/source/common/openFileWatcher.cpp.o
	src/CMakeFiles/deepin-compressor.dir/source/common/plugin.cpp.o
	src/CMakeFiles/deepin-compressor.dir/source/common/pluginmanager.cpp.o
	src/CMakeFiles/deepin-compressor.dir/source/common/processopenthread.cpp.o
	src/CMakeFiles/deepin-compressor.dir/source/common/uitools.cpp.o
	src/CMakeFiles/deepin-compressor.dir/source/compressorapplication.cpp.o
	src/CMakeFiles/deepin-compressor.dir/source/dialog/openwithdialog/desktopfile.cpp.o
	src/CMakeFiles/deepin-compressor.dir/source/dialog/openwithdialog/dfmstandardpaths.cpp.o
	src/CMakeFiles/deepin-compressor.dir/source/dialog/openwithdialog/dmimedatabase.cpp.o
	src/CMakeFiles/deepin-compressor.dir/source/dialog/openwithdialog/durl.cpp.o
	src/CMakeFiles/deepin-compressor.dir/source/dialog/openwithdialog/mimesappsmanager.cpp.o
	src/CMakeFiles/deepin-compressor.dir/source/dialog/openwithdialog/openwithdialog.cpp.o
	src/CMakeFiles/deepin-compressor.dir/source/dialog/openwithdialog/properties.cpp.o
	src/CMakeFiles/deepin-compressor.dir/source/dialog/popupdialog.cpp.o
	src/CMakeFiles/deepin-compressor.dir/source/dialog/progressdialog.cpp.o
	src/CMakeFiles/deepin-compressor.dir/source/dialog/settingdialog.cpp.o
	src/CMakeFiles/deepin-compressor.dir/source/dialog/settings_translation.cpp.o
	src/CMakeFiles/deepin-compressor.dir/source/mainwindow.cpp.o
	src/CMakeFiles/deepin-compressor.dir/source/page/compresspage.cpp.o
	src/CMakeFiles/deepin-compressor.dir/source/page/compresssettingpage.cpp.o
	src/CMakeFiles/deepin-compressor.dir/source/page/failurepage.cpp.o
	src/CMakeFiles/deepin-compressor.dir/source/page/homepage.cpp.o
	src/CMakeFiles/deepin-compressor.dir/source/page/loadingpage.cpp.o
	src/CMakeFiles/deepin-compressor.dir/source/page/progresspage.cpp.o
	src/CMakeFiles/deepin-compressor.dir/source/page/successpage.cpp.o
	src/CMakeFiles/deepin-compressor.dir/source/page/uncompresspage.cpp.o
	src/CMakeFiles/deepin-compressor.dir/source/tree/compressview.cpp.o
	src/CMakeFiles/deepin-compressor.dir/source/tree/datamodel.cpp.o
	src/CMakeFiles/deepin-compressor.dir/source/tree/datatreeview.cpp.o
	src/CMakeFiles/deepin-compressor.dir/source/tree/itemviewrowhoverproxystyle.cpp.o
	src/CMakeFiles/deepin-compressor.dir/source/tree/treeheaderview.cpp.o
	src/CMakeFiles/deepin-compressor.dir/source/tree/uncompressview.cpp.o
	src/CMakeFiles/deepin-compressor.dir/qrc_config.cpp.o
	src/CMakeFiles/deepin-compressor.dir/qrc_deepin-compressor.cpp.o -o
	src/deepin-compressor  -Wl,-rpath,/usr/lib/dqt6/lib  /usr/lib/libdtk6widget.so.6.7.48
	/usr/lib/libKF6Codecs.so.6.29.0  /usr/lib/dqt6/lib/libQt6Core5Compat.so.6.10.3
	-lgobject-2.0  -lglib-2.0  -lgio-2.0  -lgobject-2.0  -lglib-2.
	FAILED: [code=1] src/deepin-compressor
	: && /usr/bin/c++ -pipe -frecord-gcc-switches -Wall -g -O2 -flto=auto
	-march=i586 -mtune=generic -std=c++11 -Wl,--as-needed -fPIE -fPIC -O3
	-Wl,-O1,-rpath=/usr/lib/deepin-compressor/plugins -fstack-protector-strong
	-D_FORTIFY_SOURCE=2 -z noexecstack -pie -fPIC -z lazy -Wl,-z,relro -Wl,-z,now -O2
	-g -DNDEBUG -pie -Wl,--dependency-file=src/CMakeFiles/deepin-compressor.dir/link.d
	src/CMakeFiles/deepin-compressor.dir/deepin-compressor_autogen/mocs_compilation.cpp.o
	src/CMakeFiles/deepin-compressor.dir/main.cpp.o
	src/CMakeFiles/deepin-compressor.dir/source/DebugTimeManager.cpp.o
	src/CMakeFiles/deepin-compressor.dir/source/archivemanager/archivejob.cpp.o
	src/CMakeFiles/deepin-compressor.dir/source/archivemanager/archivemanager.cpp.o
	src/CMakeFiles/deepin-compressor.dir/source/archivemanager/batchjob.cpp.o
	src/CMakeFiles/deepin-compressor.dir/source/archivemanager/singlejob.cpp.o
	src/CMakeFiles/deepin-compressor.dir/source/common/calculatesizethread.cpp.o
	src/CMakeFiles/deepin-compressor.dir/source/common/customwidget.cpp.o
	src/CMakeFiles/deepin-compressor.dir/source/common/dbusadpator.cpp.o
	src/CMakeFiles/deepin-compressor.dir/source/common/ddesktopservicesthread.cpp.o
	src/CMakeFiles/deepin-compressor.dir/source/common/eventlogutils.cpp.o
	src/CMakeFiles/deepin-compressor.dir/source/common/mimetypedisplaymanager.cpp.o
	src/CMakeFiles/deepin-compressor.dir/source/common/mimetypes.cpp.o
	src/CMakeFiles/deepin-compressor.dir/source/common/openFileWatcher.cpp.o
	src/CMakeFiles/deepin-compressor.dir/source/common/plugin.cpp.o
	src/CMakeFiles/deepin-compressor.dir/source/common/pluginmanager.cpp.o
	src/CMakeFiles/deepin-compressor.dir/source/common/processopenthread.cpp.o
	src/CMakeFiles/deepin-compressor.dir/source/common/uitools.cpp.o
	src/CMakeFiles/deepin-compressor.dir/source/compressorapplication.cpp.o
	src/CMakeFiles/deepin-compressor.dir/source/dialog/openwithdialog/desktopfile.cpp.o
	src/CMakeFiles/deepin-compressor.dir/source/dialog/openwithdialog/dfmstandardpaths.cpp.o
	src/CMakeFiles/deepin-compressor.dir/source/dialog/openwithdialog/dmimedatabase.cpp.o
	src/CMakeFiles/deepin-compressor.dir/source/dialog/openwithdialog/durl.cpp.o
	src/CMakeFiles/deepin-compressor.dir/source/dialog/openwithdialog/mimesappsmanager.cpp.o
	src/CMakeFiles/deepin-compressor.dir/source/dialog/openwithdialog/openwithdialog.cpp.o
	src/CMakeFiles/deepin-compressor.dir/source/dialog/openwithdialog/properties.cpp.o
	src/CMakeFiles/deepin-compressor.dir/source/dialog/popupdialog.cpp.o
	src/CMakeFiles/deepin-compressor.dir/source/dialog/progressdialog.cpp.o
	src/CMakeFiles/deepin-compressor.dir/source/dialog/settingdialog.cpp.o
	src/CMakeFiles/deepin-compressor.dir/source/dialog/settings_translation.cpp.o
	src/CMakeFiles/deepin-compressor.dir/source/mainwindow.cpp.o
	src/CMakeFiles/deepin-compressor.dir/source/page/compresspage.cpp.o
	src/CMakeFiles/deepin-compressor.dir/source/page/compresssettingpage.cpp.o
	src/CMakeFiles/deepin-compressor.dir/source/page/failurepage.cpp.o
	src/CMakeFiles/deepin-compressor.dir/source/page/homepage.cpp.o
	src/CMakeFiles/deepin-compressor.dir/source/page/loadingpage.cpp.o
	src/CMakeFiles/deepin-compressor.dir/source/page/progresspage.cpp.o
	src/CMakeFiles/deepin-compressor.dir/source/page/successpage.cpp.o
	src/CMakeFiles/deepin-compressor.dir/source/page/uncompresspage.cpp.o
	src/CMakeFiles/deepin-compressor.dir/source/tree/compressview.cpp.o
	src/CMakeFiles/deepin-compressor.dir/source/tree/datamodel.cpp.o
	src/CMakeFiles/deepin-compressor.dir/source/tree/datatreeview.cpp.o
	src/CMakeFiles/deepin-compressor.dir/source/tree/itemviewrowhoverproxystyle.cpp.o
	src/CMakeFiles/deepin-compressor.dir/source/tree/treeheaderview.cpp.o
	src/CMakeFiles/deepin-compressor.dir/source/tree/uncompressview.cpp.o
	src/CMakeFiles/deepin-compressor.dir/qrc_config.cpp.o
	src/CMakeFiles/deepin-compressor.dir/qrc_deepin-compressor.cpp.o -o
	src/deepin-compressor  -Wl,-rpath,/usr/lib/dqt6/lib  /usr/lib/libdtk6widget.so.6.7.48
	/usr/lib/libKF6Codecs.so.6.29.0  /usr/lib/dqt6/lib/libQt6Core5Compat.so.6.10.3
	-lgobject-2.0  -lglib-2.0  -lgio-2.0  -lgobject-2.0  -lglib-2.0  3rdpart
	ld: /usr/lib/libKF6Codecs.so.6.29.0: undefined reference to `qt_version_tag@Qt_6.11'
	collect2: error: ld returned 1 exit status
	ninja: build stopped: subcommand failed.

deepin-editor-6.5.58-alt1
	[106/106] : && /usr/bin/c++ -pipe -frecord-gcc-switches -Wall
	-g -O2 -flto=auto -march=i586 -mtune=generic -Wall -O3 -O2 -g
	-DNDEBUG -Wl,--dependency-file=src/CMakeFiles/deepin-editor.dir/link.d
	src/CMakeFiles/deepin-editor.dir/deepin-editor_autogen/mocs_compilation.cpp.o
	src/CMakeFiles/deepin-editor.dir/basepub/load_libs.c.o
	src/CMakeFiles/deepin-editor.dir/common/CSyntaxHighlighter.cpp.o
	src/CMakeFiles/deepin-editor.dir/common/config.cpp.o
	src/CMakeFiles/deepin-editor.dir/common/dbusinterface.cpp.o
	src/CMakeFiles/deepin-editor.dir/common/encoding.cpp.o
	src/CMakeFiles/deepin-editor.dir/common/eventlogutils.cpp.o
	src/CMakeFiles/deepin-editor.dir/common/fileloadthread.cpp.o
	src/CMakeFiles/deepin-editor.dir/common/iflytek_ai_assistant.cpp.o
	src/CMakeFiles/deepin-editor.dir/common/performancemonitor.cpp.o
	src/CMakeFiles/deepin-editor.dir/common/settings.cpp.o
	src/CMakeFiles/deepin-editor.dir/common/text_file_saver.cpp.o
	src/CMakeFiles/deepin-editor.dir/common/utils.cpp.o
	src/CMakeFiles/deepin-editor.dir/controls/findbar.cpp.o
	src/CMakeFiles/deepin-editor.dir/controls/fontitemdelegate.cpp.o
	src/CMakeFiles/deepin-editor.dir/controls/jumplinebar.cpp.o
	src/CMakeFiles/deepin-editor.dir/controls/linebar.cpp.o
	src/CMakeFiles/deepin-editor.dir/controls/replacebar.cpp.o
	src/CMakeFiles/deepin-editor.dir/controls/settingsdialog.cpp.o
	src/CMakeFiles/deepin-editor.dir/controls/tabbar.cpp.o
	src/CMakeFiles/deepin-editor.dir/controls/toolbar.cpp.o
	src/CMakeFiles/deepin-editor.dir/controls/warningnotices.cpp.o
	src/CMakeFiles/deepin-editor.dir/editor/FlashTween.cpp.o
	src/CMakeFiles/deepin-editor.dir/editor/bookmarkwidget.cpp.o
	src/CMakeFiles/deepin-editor.dir/editor/changemarkcommand.cpp.o
	src/CMakeFiles/deepin-editor.dir/editor/codeflodarea.cpp.o
	src/CMakeFiles/deepin-editor.dir/editor/deletebackcommond.cpp.o
	src/CMakeFiles/deepin-editor.dir/editor/deletetextundocommand.cpp.o
	src/CMakeFiles/deepin-editor.dir/editor/dtextedit.cpp.o
	src/CMakeFiles/deepin-editor.dir/editor/editwrapper.cpp.o
	src/CMakeFiles/deepin-editor.dir/editor/endlineformatcommond.cpp.o
	src/CMakeFiles/deepin-editor.dir/editor/indenttextcommond.cpp.o
	src/CMakeFiles/deepin-editor.dir/editor/insertblockbytextcommond.cpp.o
	src/CMakeFiles/deepin-editor.dir/editor/inserttextundocommand.cpp.o
	src/CMakeFiles/deepin-editor.dir/editor/leftareaoftextedit.cpp.o
	src/CMakeFiles/deepin-editor.dir/editor/linenumberarea.cpp.o
	src/CMakeFiles/deepin-editor.dir/editor/replaceallcommond.cpp.o
	src/CMakeFiles/deepin-editor.dir/editor/showflodcodewidget.cpp.o
	src/CMakeFiles/deepin-editor.dir/editor/uncommentselection.cpp.o
	src/CMakeFiles/deepin-editor.dir/editor/undolist.cpp.o
	src/CMakeFiles/deepin-editor.dir/editorapplication.cpp.o
	src/CMakeFiles/deepin-editor.dir/encodes/detectcode.cpp.o
	src/CMakeFiles/deepin-editor.dir/main.cpp.o
	src/CMakeFiles/deepin-editor.dir/startmanager.cpp.o
	src/CMakeFiles/deepin-editor.dir/thememodule/themeitemdelegate.cpp.o
	src/CMakeFiles/deepin-editor.dir/thememodule/themelistmodel.cpp.o
	src/CMakeFiles/deepin-editor.dir/thememodule/themelistview.cpp.o
	src/CMakeFiles/deepin-editor.dir/thememodule/themepanel.cpp.o
	src/CMakeFiles/deepin-editor.dir/widgets/ColorSelectWdg.cpp.o
	src/CMakeFiles/deepin-editor.dir/widgets/bottombar.cpp.o
	src/CMakeFiles/deepin-editor.dir/widgets/ddropdownmenu.cpp.o
	src/CMakeFiles/deepin-editor.dir/widgets/pathsettintwgt.cpp.o
	src/CMakeFiles/deepin-editor.dir/widgets/window.cpp.o
	src/CMakeFiles/deepin-editor.dir/deepin-editor_autogen/EWIEGA46WW/qrc_deepin-editor.cpp.o
	-o src/deepin-editor  -Wl,-rpath,/usr/lib/dqt6/lib:  /usr/lib/libdtk6widget.so.6.7.48
	/usr/lib/libKF6Codecs.so.6.29.0  /usr/lib/libKF6SyntaxHighlighting.so.6.29.0
	/usr/lib/dqt6/lib/libQt6Core5Compat.so.6.10.3  /usr/lib/libicui18n.so
	/usr/lib/libicuuc.so  -lm  -luchardet  -ldl  -lchardet
	/usr/lib/dqt6/lib/libQt6Svg.so.6.10.3  /usr/lib/dqt6/lib/libQt6Concurrent.so.6.10.3
	/usr/lib/dqt6/lib/libQt6PrintSupport.so.6.10.3	/usr/lib/dqt6/lib/libQt6Widgets.so.6.10.3
	/usr/lib/libdtk6gui.so.6.7.48  /usr/lib/libdtk6core.so.6.7.48
	/usr/lib/dqt6/lib/libQt6Xml.so.6.10.3  /usr/lib/libdtk6log
	FAILED: [code=1] src/deepin-editor
	: && /usr/bin/c++ -pipe -frecord-gcc-switches -Wall -g -O2
	-flto=auto -march=i586 -mtune=generic -Wall -O3 -O2 -g -DNDEBUG
	-Wl,--dependency-file=src/CMakeFiles/deepin-editor.dir/link.d
	src/CMakeFiles/deepin-editor.dir/deepin-editor_autogen/mocs_compilation.cpp.o
	src/CMakeFiles/deepin-editor.dir/basepub/load_libs.c.o
	src/CMakeFiles/deepin-editor.dir/common/CSyntaxHighlighter.cpp.o
	src/CMakeFiles/deepin-editor.dir/common/config.cpp.o
	src/CMakeFiles/deepin-editor.dir/common/dbusinterface.cpp.o
	src/CMakeFiles/deepin-editor.dir/common/encoding.cpp.o
	src/CMakeFiles/deepin-editor.dir/common/eventlogutils.cpp.o
	src/CMakeFiles/deepin-editor.dir/common/fileloadthread.cpp.o
	src/CMakeFiles/deepin-editor.dir/common/iflytek_ai_assistant.cpp.o
	src/CMakeFiles/deepin-editor.dir/common/performancemonitor.cpp.o
	src/CMakeFiles/deepin-editor.dir/common/settings.cpp.o
	src/CMakeFiles/deepin-editor.dir/common/text_file_saver.cpp.o
	src/CMakeFiles/deepin-editor.dir/common/utils.cpp.o
	src/CMakeFiles/deepin-editor.dir/controls/findbar.cpp.o
	src/CMakeFiles/deepin-editor.dir/controls/fontitemdelegate.cpp.o
	src/CMakeFiles/deepin-editor.dir/controls/jumplinebar.cpp.o
	src/CMakeFiles/deepin-editor.dir/controls/linebar.cpp.o
	src/CMakeFiles/deepin-editor.dir/controls/replacebar.cpp.o
	src/CMakeFiles/deepin-editor.dir/controls/settingsdialog.cpp.o
	src/CMakeFiles/deepin-editor.dir/controls/tabbar.cpp.o
	src/CMakeFiles/deepin-editor.dir/controls/toolbar.cpp.o
	src/CMakeFiles/deepin-editor.dir/controls/warningnotices.cpp.o
	src/CMakeFiles/deepin-editor.dir/editor/FlashTween.cpp.o
	src/CMakeFiles/deepin-editor.dir/editor/bookmarkwidget.cpp.o
	src/CMakeFiles/deepin-editor.dir/editor/changemarkcommand.cpp.o
	src/CMakeFiles/deepin-editor.dir/editor/codeflodarea.cpp.o
	src/CMakeFiles/deepin-editor.dir/editor/deletebackcommond.cpp.o
	src/CMakeFiles/deepin-editor.dir/editor/deletetextundocommand.cpp.o
	src/CMakeFiles/deepin-editor.dir/editor/dtextedit.cpp.o
	src/CMakeFiles/deepin-editor.dir/editor/editwrapper.cpp.o
	src/CMakeFiles/deepin-editor.dir/editor/endlineformatcommond.cpp.o
	src/CMakeFiles/deepin-editor.dir/editor/indenttextcommond.cpp.o
	src/CMakeFiles/deepin-editor.dir/editor/insertblockbytextcommond.cpp.o
	src/CMakeFiles/deepin-editor.dir/editor/inserttextundocommand.cpp.o
	src/CMakeFiles/deepin-editor.dir/editor/leftareaoftextedit.cpp.o
	src/CMakeFiles/deepin-editor.dir/editor/linenumberarea.cpp.o
	src/CMakeFiles/deepin-editor.dir/editor/replaceallcommond.cpp.o
	src/CMakeFiles/deepin-editor.dir/editor/showflodcodewidget.cpp.o
	src/CMakeFiles/deepin-editor.dir/editor/uncommentselection.cpp.o
	src/CMakeFiles/deepin-editor.dir/editor/undolist.cpp.o
	src/CMakeFiles/deepin-editor.dir/editorapplication.cpp.o
	src/CMakeFiles/deepin-editor.dir/encodes/detectcode.cpp.o
	src/CMakeFiles/deepin-editor.dir/main.cpp.o
	src/CMakeFiles/deepin-editor.dir/startmanager.cpp.o
	src/CMakeFiles/deepin-editor.dir/thememodule/themeitemdelegate.cpp.o
	src/CMakeFiles/deepin-editor.dir/thememodule/themelistmodel.cpp.o
	src/CMakeFiles/deepin-editor.dir/thememodule/themelistview.cpp.o
	src/CMakeFiles/deepin-editor.dir/thememodule/themepanel.cpp.o
	src/CMakeFiles/deepin-editor.dir/widgets/ColorSelectWdg.cpp.o
	src/CMakeFiles/deepin-editor.dir/widgets/bottombar.cpp.o
	src/CMakeFiles/deepin-editor.dir/widgets/ddropdownmenu.cpp.o
	src/CMakeFiles/deepin-editor.dir/widgets/pathsettintwgt.cpp.o
	src/CMakeFiles/deepin-editor.dir/widgets/window.cpp.o
	src/CMakeFiles/deepin-editor.dir/deepin-editor_autogen/EWIEGA46WW/qrc_deepin-editor.cpp.o
	-o src/deepin-editor  -Wl,-rpath,/usr/lib/dqt6/lib:  /usr/lib/libdtk6widget.so.6.7.48
	/usr/lib/libKF6Codecs.so.6.29.0  /usr/lib/libKF6SyntaxHighlighting.so.6.29.0
	/usr/lib/dqt6/lib/libQt6Core5Compat.so.6.10.3  /usr/lib/libicui18n.so
	/usr/lib/libicuuc.so  -lm  -luchardet  -ldl  -lchardet
	/usr/lib/dqt6/lib/libQt6Svg.so.6.10.3  /usr/lib/dqt6/lib/libQt6Concurrent.so.6.10.3
	/usr/lib/dqt6/lib/libQt6PrintSupport.so.6.10.3	/usr/lib/dqt6/lib/libQt6Widgets.so.6.10.3
	/usr/lib/libdtk6gui.so.6.7.48  /usr/lib/libdtk6core.so.6.7.48
	/usr/lib/dqt6/lib/libQt6Xml.so.6.10.3  /usr/lib/libdtk6log.so.0.7.48
	ld: warning: libicui18n.so.76, needed by /usr/lib/dqt6/lib/libQt6Core.so.6.10.3, may
	conflict with libicui18n.so.78
	ld: /usr/lib/libKF6Codecs.so.6.29.0: undefined reference to `qt_version_tag@Qt_6.11'
	collect2: error: ld returned 1 exit status
	ninja: build stopped: subcommand failed.

deepin-qt5integration-6.7.48-alt1
	/usr/share/cmake/qt6xdgiconloader/qt6xdgiconloader-config.cmake:31 (find_dependency)
	/usr/share/cmake/Modules/CMakeFindDependencyMacro.cmake:93 (find_package)
	/usr/share/cmake/Modules/CMakeFindDependencyMacro.cmake:125 (__find_dependency_common)
	/usr/share/cmake/qt6xdg/qt6xdg-config.cmake:33 (find_dependency)
	CMakeLists.txt:121 (find_package)
	-- Configuring incomplete, errors occurred!
	error: Bad exit status from /usr/src/tmp/rpmb-tmp.rNuhMQ (%build)
	RPM build errors:
	File /usr/src/RPM/SOURCES/qt5integration-6.7.48-alt1.patch is smaller than 8 bytes
	Bad exit status from /usr/src/tmp/rpmb-tmp.rNuhMQ (%build)

disruptor-3.4.4-alt1_3jpp11
	[ERROR] -> [Help 1]
	[ERROR]
	[ERROR] To see the full stack trace of the errors, re-run Maven with the -e switch.
	[ERROR] Re-run Maven using the -X switch to enable full debug logging.
	[ERROR]
	[ERROR] For more information about the errors and possible solutions, please read the
	following articles:
	[ERROR] [Help 1]
	http://cwiki.apache.org/confluence/display/MAVEN/PluginIncompatibleException
	error: Bad exit status from /usr/src/tmp/rpmb-tmp.Pzq66k (%build)
	RPM build errors:
	Bad exit status from /usr/src/tmp/rpmb-tmp.Pzq66k (%build)

drumgizmo-0.9.20-alt3
	make[3]: Entering directory '/usr/src/RPM/BUILD/drumgizmo-0.9.20/plugin'
	./ttlgen .libs/drumgizmo.so manifest.ttl X11UI > /dev/null
	make[3]: *** [Makefile:1192: manifest.ttl] Error 139
	make[3]: Leaving directory '/usr/src/RPM/BUILD/drumgizmo-0.9.20/plugin'
	make[2]: *** [Makefile:888: all-recursive] Error 1
	make[1]: *** [Makefile:473: all-recursive] Error 1
	make: *** [Makefile:405: all] Error 2
	error: Bad exit status from /usr/src/tmp/rpmb-tmp.GifWNN (%build)
	RPM build errors:
	Bad exit status from /usr/src/tmp/rpmb-tmp.GifWNN (%build)

dtkmultimedia-6.0.4-alt3
	from
	/usr/src/RPM/BUILD/dtkmultimedia-6.0.4/src/multimedia/camera/libcam/libcam/camview.h:32,
	from
	/usr/src/RPM/BUILD/dtkmultimedia-6.0.4/BUILD/src/multimedia/dtk6multimedia_autogen/WKBOVG5PNP/../../../../../src/multimedia/camera/libcam/majorimageprocessingthread.h:21,
	from
	/usr/src/RPM/BUILD/dtkmultimedia-6.0.4/BUILD/src/multimedia/dtk6multimedia_autogen/WKBOVG5PNP/moc_majorimageprocessingthread.cpp:9,
	from
	/usr/src/RPM/BUILD/dtkmultimedia-6.0.4/BUILD/src/multimedia/dtk6multimedia_autogen/mocs_compilation.cpp:27:
	/usr/include/libavcodec/packet.h:726:6: note: declared here
	726 | void av_init_packet(AVPacket *pkt);
	ninja: build stopped: subcommand failed.
	error: Bad exit status from /usr/src/tmp/rpmb-tmp.174exC (%build)
	RPM build errors:
	Bad exit status from /usr/src/tmp/rpmb-tmp.174exC (%build)

eartag-1.0.3-alt1
	stderr:
	Fatal Python error: Segmentation fault
	Thread 0xf33b8b40 [asyncio_0] (most recent call first):

felix-gogo-runtime-1.1.6-alt1
	[ERROR] -> [Help 1]
	[ERROR]
	[ERROR] To see the full stack trace of the errors, re-run Maven with the -e switch.
	[ERROR] Re-run Maven using the -X switch to enable full debug logging.
	[ERROR]
	[ERROR] For more information about the errors and possible solutions, please read the
	following articles:
	[ERROR] [Help 1]
	http://cwiki.apache.org/confluence/display/MAVEN/PluginIncompatibleException
	error: Bad exit status from /usr/src/tmp/rpmb-tmp.lQjiXn (%build)
	RPM build errors:
	Bad exit status from /usr/src/tmp/rpmb-tmp.lQjiXn (%build)

felix-gogo-shell-1.1.4-alt1_1jpp11
	[ERROR] -> [Help 1]
	[ERROR]
	[ERROR] To see the full stack trace of the errors, re-run Maven with the -e switch.
	[ERROR] Re-run Maven using the -X switch to enable full debug logging.
	[ERROR]
	[ERROR] For more information about the errors and possible solutions, please read the
	following articles:
	[ERROR] [Help 1]
	http://cwiki.apache.org/confluence/display/MAVEN/PluginIncompatibleException
	error: Bad exit status from /usr/src/tmp/rpmb-tmp.4By4zj (%build)
	RPM build errors:
	Bad exit status from /usr/src/tmp/rpmb-tmp.4By4zj (%build)

gambit-4.9.7-alt5
	make[4]: Leaving directory '/usr/src/RPM/BUILD/gambit-4.9.7/lib/_irregex'
	make[4]: Entering directory '/usr/src/RPM/BUILD/gambit-4.9.7/lib'
	LD_LIBRARY_PATH=../lib:../gsi:../gsc:
	../gsc/gsc -:~~bin=../bin,~~lib=../lib,~~include=../include -f -target js  -prelude
	"(define-cond-expand-feature|enable-type-checking|)(define-cond-expand-feature|disable-auto-forcing|)(define-cond-expand-feature|enable-sharp-dot|)(define-cond-expand-feature|enable-bignum|)(define-cond-expand-feature|enable-ratnum|)(define-cond-expand-feature|enable-cpxnum|)(define-cond-expand-feature|enable-s8vector|)(define-cond-expand-feature|enable-u16vector|)(define-cond-expand-feature|enable-s16vector|)(define-cond-expand-feature|enable-u32vector|)(define-cond-expand-feature|enable-s32vector|)(define-cond-expand-feature|enable-u64vector|)(define-cond-expand-feature|enable-s64vector|)(define-cond-expand-feature|enable-f32vector|)(define-cond-expand-feature|disable-smp|)(##include\"../lib/header.scm\")"
	-label-namespace "" -c -o _gambit.js ../lib/_univlib.scm
	make[4]: Leaving directory '/usr/src/RPM/BUILD/gambit-4.9.7/lib'
	make[2]: *** [makefile:546: modules-recursive] Error 2
	make[1]: *** [makefile:373: modules] Error 2
	make: *** [makefile:107: all] Error 2
	error: Bad exit status from /usr/src/tmp/rpmb-tmp.9GlUWs (%build)
	RPM build errors:
	Bad exit status from /usr/src/tmp/rpmb-tmp.9GlUWs (%build)

gem-acts-as-list-1.2.6-alt1
	Wrote: /usr/src/in/nosrpm/gem-acts-as-list-1.2.6-alt1.nosrc.rpm (w1.gzdio)
	error: failed build dependencies:
	gem(minitest) >= 6 conflicts with gem-acts-as-list-1.2.6-alt1

gem-amazing-print-2.0.0-alt1
	Wrote: /usr/src/in/nosrpm/gem-amazing-print-2.0.0-alt1.nosrc.rpm (w1.gzdio)
	error: failed build dependencies:
	gem(fakefs) >= 3 conflicts with gem-amazing-print-2.0.0-alt1

gem-autotest-suffix-1.1.0-alt1
	Wrote: /usr/src/in/nosrpm/gem-autotest-suffix-1.1.0-alt1.nosrc.rpm (w1.gzdio)
	error: failed build dependencies:
	gem(minitest) >= 6 conflicts with gem-autotest-suffix-1.1.0-alt1

gem-benchmark-suite-1.0.0.4-alt0.1
	Processing files: benchmark-1.0.0.4-alt0.1
	error: No such file or directory:
	/usr/src/tmp/gem-benchmark-suite-buildroot/usr/lib/ruby/bin/benchmark
	Executing(%doc): /bin/sh -e /usr/src/tmp/rpmb-tmp.IhYCBJ
	--
	RPM build errors:
	No such file or directory:
	/usr/src/tmp/gem-benchmark-suite-buildroot/usr/lib/ruby/bin/benchmark

gem-cuprite-0.17-alt1
	Depends: gem(afm) (>= 0.2.1)
	E: Broken packages
	hsh-install: Failed to calculate package file list.

gem-dbi-dbrc-1.7.0.24-alt0.1
	Wrote: /usr/src/in/nosrpm/gem-dbi-dbrc-1.7.0.24-alt0.1.nosrc.rpm (w1.gzdio)
	error: failed build dependencies:
	gem(fakefs) >= 3 conflicts with gem-dbi-dbrc-1.7.0.24-alt0.1

gem-ferrum-0.17.1-alt1
	Depends: gem(afm) (>= 0.2.1)
	E: Broken packages
	hsh-install: Failed to calculate package file list.

gem-fission-0.5.0-alt2.1
	Wrote: /usr/src/in/nosrpm/gem-fission-0.5.0-alt2.1.nosrc.rpm (w1.gzdio)
	error: failed build dependencies:
	gem(fakefs) >= 3 conflicts with gem-fission-0.5.0-alt2.1

gem-friendly-id-5.5.1-alt1
	Wrote: /usr/src/in/nosrpm/gem-friendly-id-5.5.1-alt1.nosrc.rpm (w1.gzdio)
	error: failed build dependencies:
	gem(minitest) >= 6 conflicts with gem-friendly-id-5.5.1-alt1

gem-github-markup-4.0.0-alt1
	Selected version gem-minitest#6.0.6-alt1:sisyphus+429734.400.5.1@1787774550 for
	gem(minitest)>=5.4
	E: Version <'6' for 'gem(minitest)' was not found
	hsh-install: Failed to calculate package file list.

gem-goodcheck-3.1.0.30-alt1
	Wrote: /usr/src/in/nosrpm/gem-goodcheck-3.1.0.30-alt1.nosrc.rpm (w1.gzdio)
	error: failed build dependencies:
	gem(marcel) >= 2.0 conflicts with gem-goodcheck-3.1.0.30-alt1

gem-hammer-cli-3.18.0-alt1
	Wrote: /usr/src/in/nosrpm/gem-hammer-cli-3.18.0-alt1.nosrc.rpm (w1.gzdio)
	error: failed build dependencies:
	gem(minitest) >= 6 conflicts with gem-hammer-cli-3.18.0-alt1

gem-hammer-cli-foreman-3.18.1-alt1
	Wrote: /usr/src/in/nosrpm/gem-hammer-cli-foreman-3.18.1-alt1.nosrc.rpm (w1.gzdio)
	error: failed build dependencies:
	gem(minitest) >= 6 conflicts with gem-hammer-cli-foreman-3.18.1-alt1

gem-importmap-rails-2.1.0-alt1
	Wrote: /usr/src/in/nosrpm/gem-importmap-rails-2.1.0-alt1.nosrc.rpm (w1.gzdio)
	error: failed build dependencies:
	gem(sqlite3) >= 2 conflicts with gem-importmap-rails-2.1.0-alt1

gem-indexer-0.3.0-alt1
	Processing files: index-0.3.0-alt1
	error: No such file or directory: /usr/src/tmp/gem-indexer-buildroot/usr/bin/index
	Executing(%doc): /bin/sh -e /usr/src/tmp/rpmb-tmp.5TblSW
	--
	RPM build errors:
	No such file or directory: /usr/src/tmp/gem-indexer-buildroot/usr/bin/index

gem-k8s-ruby-0.17.2-alt1
	Wrote: /usr/src/in/nosrpm/gem-k8s-ruby-0.17.2-alt1.nosrc.rpm (w1.gzdio)
	error: failed build dependencies:
	gem(byebug) >= 13 conflicts with gem-k8s-ruby-0.17.2-alt1

gem-librarianp-1.1.2-alt1
	Wrote: /usr/src/in/nosrpm/gem-librarianp-1.1.2-alt1.nosrc.rpm (w1.gzdio)
	error: failed build dependencies:
	gem(fakefs) >= 3 conflicts with gem-librarianp-1.1.2-alt1

gem-license-finder-7.2.1-alt1.1
	Wrote: /usr/src/in/nosrpm/gem-license-finder-7.2.1-alt1.1.nosrc.rpm (w1.gzdio)
	error: failed build dependencies:
	gem(fakefs) >= 2.6 conflicts with gem-license-finder-7.2.1-alt1.1

gem-memoist3-1.0.0-alt1
	Wrote: /usr/src/in/nosrpm/gem-memoist3-1.0.0-alt1.nosrc.rpm (w1.gzdio)
	error: failed build dependencies:
	gem(minitest) >= 6 conflicts with gem-memoist3-1.0.0-alt1

gem-minitest-bonus-assertions-3.0.2-alt1
	Wrote: /usr/src/in/nosrpm/gem-minitest-bonus-assertions-3.0.2-alt1.nosrc.rpm (w1.gzdio)
	error: failed build dependencies:
	gem(minitest) >= 6 conflicts with gem-minitest-bonus-assertions-3.0.2-alt1

gem-mongrel-1.2.0-alt2
	/usr/lib/ruby/gemie/specifications/mongrel_upload_progress-0.2.2.gemspec
	error: File list check failed, terminating build
	RPM build errors:
	--
	Installed (but unpackaged) file(s) found:
	File list check failed, terminating build

gem-nokogiri-1.18.9-alt1
	Wrote: /usr/src/in/nosrpm/gem-nokogiri-1.18.9-alt1.nosrc.rpm (w1.gzdio)
	error: failed build dependencies:
	gem(minitest) >= 6 conflicts with gem-nokogiri-1.18.9-alt1

gem-pathspec-1.1.3-alt1
	Wrote: /usr/src/in/nosrpm/gem-pathspec-1.1.3-alt1.nosrc.rpm (w1.gzdio)
	error: failed build dependencies:
	gem(fakefs) >= 3 conflicts with gem-pathspec-1.1.3-alt1

gem-rbs-3.9.4-alt1
	gem-rubocop-on-rbs: Depends: gem(rbs-inline) (>= 0)
	E: Broken packages
	hsh-install: Failed to calculate package file list.

gem-resque-3.0.0-alt1
	Wrote: /usr/src/in/nosrpm/gem-resque-3.0.0-alt1.nosrc.rpm (w1.gzdio)
	error: failed build dependencies:
	gem(minitest) >= 6 conflicts with gem-resque-3.0.0-alt1

gem-rmagick-6.1.4-alt1
	gem-rubocop-on-rbs: Depends: gem(rbs-inline) (>= 0)
	E: Broken packages
	hsh-install: Failed to calculate package file list.

gem-rspec-retry-0.6.2.11-alt0.1
	Wrote: /usr/src/in/nosrpm/gem-rspec-retry-0.6.2.11-alt0.1.nosrc.rpm (w1.gzdio)
	error: failed build dependencies:
	gem(byebug) >= 13 conflicts with gem-rspec-retry-0.6.2.11-alt0.1

gem-rubocop-on-rbs-1.8.0-alt1
	gem-rbs-inline: Depends: gem(minitest) (>= 5.17.0)
	E: Broken packages
	hsh-install: Failed to calculate package file list.

gem-ruby-growl-4.1-alt1.1
	Wrote: /usr/src/in/nosrpm/gem-ruby-growl-4.1-alt1.1.nosrc.rpm (w1.gzdio)
	error: failed build dependencies:
	gem(minitest) >= 6 conflicts with gem-ruby-growl-4.1-alt1.1

gem-rugged-1.9.0-alt1
	Wrote: /usr/src/in/nosrpm/gem-rugged-1.9.0-alt1.nosrc.rpm (w1.gzdio)
	error: failed build dependencies:
	gem(minitest) >= 6 conflicts with gem-rugged-1.9.0-alt1

gem-sidekiq-7.3.8-alt1
	Wrote: /usr/src/in/nosrpm/gem-sidekiq-7.3.8-alt1.nosrc.rpm (w1.gzdio)
	error: failed build dependencies:
	gem(sqlite3) >= 2 conflicts with gem-sidekiq-7.3.8-alt1

gem-socksify-1.8.1-alt1
	Wrote: /usr/src/in/nosrpm/gem-socksify-1.8.1-alt1.nosrc.rpm (w1.gzdio)
	error: failed build dependencies:
	gem(minitest) >= 6 conflicts with gem-socksify-1.8.1-alt1

gem-tpm-key-attestation-0.14.1-alt1
	Wrote: /usr/src/in/nosrpm/gem-tpm-key-attestation-0.14.1-alt1.nosrc.rpm (w1.gzdio)
	error: failed build dependencies:
	gem(byebug) >= 13 conflicts with gem-tpm-key-attestation-0.14.1-alt1

gem-webauthn-3.4.3-alt1
	Wrote: /usr/src/in/nosrpm/gem-webauthn-3.4.3-alt1.nosrc.rpm (w1.gzdio)
	error: failed build dependencies:
	gem(byebug) >= 13 conflicts with gem-webauthn-3.4.3-alt1

gem-zeus-0.17.0-alt1
	Processing files: gem-vagrant-zeus-0.17.0-alt1
	error: No such file or directory:
	/usr/src/tmp/gem-zeus-buildroot/usr/lib/ruby/gemie/specifications/vagrant-zeus-0.17.0.gemspec
	error: No such file or directory:
	/usr/src/tmp/gem-zeus-buildroot/usr/lib/ruby/gemie/gems/vagrant-zeus-0.17.0
	error: No such file or directory:
	/usr/src/tmp/gem-zeus-buildroot/usr/lib/ruby/gemie/extensions/vagrant-zeus-0.17.0
	Executing(%doc): /bin/sh -e /usr/src/tmp/rpmb-tmp.kAIzC5
	--
	RPM build errors:
	No such file or directory:
	/usr/src/tmp/gem-zeus-buildroot/usr/lib/ruby/gemie/specifications/vagrant-zeus-0.17.0.gemspec
	No such file or directory:
	/usr/src/tmp/gem-zeus-buildroot/usr/lib/ruby/gemie/gems/vagrant-zeus-0.17.0
	No such file or directory:
	/usr/src/tmp/gem-zeus-buildroot/usr/lib/ruby/gemie/extensions/vagrant-zeus-0.17.0

geronimo-annotation-1.0-alt4_28jpp11
	[ERROR] -> [Help 1]
	[ERROR]
	[ERROR] To see the full stack trace of the errors, re-run Maven with the -e switch.
	[ERROR] Re-run Maven using the -X switch to enable full debug logging.
	[ERROR]
	[ERROR] For more information about the errors and possible solutions, please read the
	following articles:
	[ERROR] [Help 1]
	http://cwiki.apache.org/confluence/display/MAVEN/PluginIncompatibleException
	error: Bad exit status from /usr/src/tmp/rpmb-tmp.Dogdud (%build)
	RPM build errors:
	Bad exit status from /usr/src/tmp/rpmb-tmp.Dogdud (%build)

geronimo-osgi-support-1.0-alt2_28jpp11
	[ERROR] -> [Help 1]
	[ERROR]
	[ERROR] To see the full stack trace of the errors, re-run Maven with the -e switch.
	[ERROR] Re-run Maven using the -X switch to enable full debug logging.
	[ERROR]
	[ERROR] For more information about the errors and possible solutions, please read the
	following articles:
	[ERROR] [Help 1]
	http://cwiki.apache.org/confluence/display/MAVEN/PluginIncompatibleException
	error: Bad exit status from /usr/src/tmp/rpmb-tmp.XTjPDi (%build)
	RPM build errors:
	Bad exit status from /usr/src/tmp/rpmb-tmp.XTjPDi (%build)

geronimo-parent-poms-1.6-alt3_33jpp11
	[ERROR] -> [Help 1]
	[ERROR]
	[ERROR] To see the full stack trace of the errors, re-run Maven with the -e switch.
	[ERROR] Re-run Maven using the -X switch to enable full debug logging.
	[ERROR]
	[ERROR] For more information about the errors and possible solutions, please read the
	following articles:
	[ERROR] [Help 1]
	http://cwiki.apache.org/confluence/display/MAVEN/PluginIncompatibleException
	error: Bad exit status from /usr/src/tmp/rpmb-tmp.ot83KN (%build)
	RPM build errors:
	Bad exit status from /usr/src/tmp/rpmb-tmp.ot83KN (%build)

ghostscript-10.06.0-alt1
	file /usr/share/man/man1/pdfjadetex.1.xz conflicts between attempted installs of
	jadetex-3.13-alt4_17.noarch and texlive-collection-basic-2022-alt0_14.noarch
	hsh-install: Packages installation failed.

glassfish-servlet-api3.1-3.1.0-alt4_18jpp11
	[ERROR] -> [Help 1]
	[ERROR]
	[ERROR] To see the full stack trace of the errors, re-run Maven with the -e switch.
	[ERROR] Re-run Maven using the -X switch to enable full debug logging.
	[ERROR]
	[ERROR] For more information about the errors and possible solutions, please read the
	following articles:
	[ERROR] [Help 1]
	http://cwiki.apache.org/confluence/display/MAVEN/PluginIncompatibleException
	error: Bad exit status from /usr/src/tmp/rpmb-tmp.7Mkgwh (%build)
	RPM build errors:
	Bad exit status from /usr/src/tmp/rpmb-tmp.7Mkgwh (%build)

glaxnimate-0.5.5-alt4
	/usr/src/RPM/BUILD/glaxnimate-0.5.5/src/core/io/video/video_format.cpp: In constructor
	'glaxnimate::av::Video::Video(AVFormatContext*, glaxnimate::av::Dict, AVCodecID, int64_t,
	int, int, int)':
	/usr/src/RPM/BUILD/glaxnimate-0.5.5/src/core/io/video/video_format.cpp:428:67: error:
	'AVCodec' {aka 'struct AVCodec'} has no member named 'pix_fmts'
	428 |	      ost.codec_context->pix_fmt = best_pixel_format(ost.codec->pix_fmts);

helix-25.07.1-alt3
	warning: `helix-term` (lib) generated 5 warnings (run `cargo fix --lib -p helix-term`
	to apply 5 suggestions)
	error: failed to build archive from rlib at
	`/usr/src/RPM/BUILD/helix-25.07.1/target/release/deps/libhelix_term-b350ac7a359e1f35.rlib`:
	Cannot allocate memory (os error 12)
	error: could not compile `helix-term` (bin "hx") due to 1 previous error
	error: Bad exit status from /usr/src/tmp/rpmb-tmp.n9H8QR (%build)

jakarta-json-2.1.3-alt2
	[ERROR] -> [Help 1]
	[ERROR]
	[ERROR] To see the full stack trace of the errors, re-run Maven with the -e switch.
	[ERROR] Re-run Maven using the -X switch to enable full debug logging.
	[ERROR]
	[ERROR] For more information about the errors and possible solutions, please read the
	following articles:
	[ERROR] [Help 1]
	http://cwiki.apache.org/confluence/display/MAVEN/PluginIncompatibleException
	error: Bad exit status from /usr/src/tmp/rpmb-tmp.N4gsxG (%build)
	RPM build errors:
	Bad exit status from /usr/src/tmp/rpmb-tmp.N4gsxG (%build)

java-classmate-1.7.3-alt2
	[ERROR] -> [Help 1]
	[ERROR]
	[ERROR] To see the full stack trace of the errors, re-run Maven with the -e switch.
	[ERROR] Re-run Maven using the -X switch to enable full debug logging.
	[ERROR]
	[ERROR] For more information about the errors and possible solutions, please read the
	following articles:
	[ERROR] [Help 1]
	http://cwiki.apache.org/confluence/display/MAVEN/PluginIncompatibleException
	error: Bad exit status from /usr/src/tmp/rpmb-tmp.tFewhv (%build)
	RPM build errors:
	Bad exit status from /usr/src/tmp/rpmb-tmp.tFewhv (%build)

jboss-el-3.0-api-1.0.13-alt1_5jpp11
	[ERROR] -> [Help 1]
	[ERROR]
	[ERROR] To see the full stack trace of the errors, re-run Maven with the -e switch.
	[ERROR] Re-run Maven using the -X switch to enable full debug logging.
	[ERROR]
	[ERROR] For more information about the errors and possible solutions, please read the
	following articles:
	[ERROR] [Help 1]
	http://cwiki.apache.org/confluence/display/MAVEN/PluginIncompatibleException
	error: Bad exit status from /usr/src/tmp/rpmb-tmp.IJ8HAX (%build)
	RPM build errors:
	Bad exit status from /usr/src/tmp/rpmb-tmp.IJ8HAX (%build)

jboss-interceptors-1.2-api-1.0.1-alt1_2jpp11
	[ERROR] -> [Help 1]
	[ERROR]
	[ERROR] To see the full stack trace of the errors, re-run Maven with the -e switch.
	[ERROR] Re-run Maven using the -X switch to enable full debug logging.
	[ERROR]
	[ERROR] For more information about the errors and possible solutions, please read the
	following articles:
	[ERROR] [Help 1]
	http://cwiki.apache.org/confluence/display/MAVEN/PluginIncompatibleException
	error: Bad exit status from /usr/src/tmp/rpmb-tmp.sY8k32 (%build)
	RPM build errors:
	Bad exit status from /usr/src/tmp/rpmb-tmp.sY8k32 (%build)

jboss-jsp-2.3-api-1.0.3-alt1_2jpp11
	[ERROR] -> [Help 1]
	[ERROR]
	[ERROR] To see the full stack trace of the errors, re-run Maven with the -e switch.
	[ERROR] Re-run Maven using the -X switch to enable full debug logging.
	[ERROR]
	[ERROR] For more information about the errors and possible solutions, please read the
	following articles:
	[ERROR] [Help 1]
	http://cwiki.apache.org/confluence/display/MAVEN/PluginIncompatibleException
	error: Bad exit status from /usr/src/tmp/rpmb-tmp.aCiWiN (%build)
	RPM build errors:
	Bad exit status from /usr/src/tmp/rpmb-tmp.aCiWiN (%build)

jboss-servlet-3.1-api-1.0.2-alt1_2jpp11
	[ERROR] -> [Help 1]
	[ERROR]
	[ERROR] To see the full stack trace of the errors, re-run Maven with the -e switch.
	[ERROR] Re-run Maven using the -X switch to enable full debug logging.
	[ERROR]
	[ERROR] For more information about the errors and possible solutions, please read the
	following articles:
	[ERROR] [Help 1]
	http://cwiki.apache.org/confluence/display/MAVEN/PluginIncompatibleException
	error: Bad exit status from /usr/src/tmp/rpmb-tmp.wQ6neE (%build)
	RPM build errors:
	Bad exit status from /usr/src/tmp/rpmb-tmp.wQ6neE (%build)

jline2-0:2.14.6-alt2
	[ERROR] -> [Help 1]
	[ERROR]
	[ERROR] To see the full stack trace of the errors, re-run Maven with the -e switch.
	[ERROR] Re-run Maven using the -X switch to enable full debug logging.
	[ERROR]
	[ERROR] For more information about the errors and possible solutions, please read the
	following articles:
	[ERROR] [Help 1]
	http://cwiki.apache.org/confluence/display/MAVEN/PluginIncompatibleException
	error: Bad exit status from /usr/src/tmp/rpmb-tmp.xQorH0 (%build)
	RPM build errors:
	Bad exit status from /usr/src/tmp/rpmb-tmp.xQorH0 (%build)

jneuroml-core-1.6.1-alt1_4jpp11
	[ERROR] -> [Help 1]
	[ERROR]
	[ERROR] To see the full stack trace of the errors, re-run Maven with the -e switch.
	[ERROR] Re-run Maven using the -X switch to enable full debug logging.
	[ERROR]
	[ERROR] For more information about the errors and possible solutions, please read the
	following articles:
	[ERROR] [Help 1]
	http://cwiki.apache.org/confluence/display/MAVEN/PluginIncompatibleException
	error: Bad exit status from /usr/src/tmp/rpmb-tmp.e3Mzpk (%build)
	RPM build errors:
	Bad exit status from /usr/src/tmp/rpmb-tmp.e3Mzpk (%build)

jnr-constants-0.9.12-alt1_8jpp11
	[ERROR] -> [Help 1]
	[ERROR]
	[ERROR] To see the full stack trace of the errors, re-run Maven with the -e switch.
	[ERROR] Re-run Maven using the -X switch to enable full debug logging.
	[ERROR]
	[ERROR] For more information about the errors and possible solutions, please read the
	following articles:
	[ERROR] [Help 1]
	http://cwiki.apache.org/confluence/display/MAVEN/PluginIncompatibleException
	error: Bad exit status from /usr/src/tmp/rpmb-tmp.ooRau8 (%build)
	RPM build errors:
	Bad exit status from /usr/src/tmp/rpmb-tmp.ooRau8 (%build)

jnr-enxio-0.19-alt1_8jpp11
	[ERROR] -> [Help 1]
	[ERROR]
	[ERROR] To see the full stack trace of the errors, re-run Maven with the -e switch.
	[ERROR] Re-run Maven using the -X switch to enable full debug logging.
	[ERROR]
	[ERROR] For more information about the errors and possible solutions, please read the
	following articles:
	[ERROR] [Help 1]
	http://cwiki.apache.org/confluence/display/MAVEN/PluginIncompatibleException
	error: Bad exit status from /usr/src/tmp/rpmb-tmp.V1DS9S (%build)
	RPM build errors:
	Bad exit status from /usr/src/tmp/rpmb-tmp.V1DS9S (%build)

jnr-unixsocket-0.21-alt1_8jpp11
	[ERROR] -> [Help 1]
	[ERROR]
	[ERROR] To see the full stack trace of the errors, re-run Maven with the -e switch.
	[ERROR] Re-run Maven using the -X switch to enable full debug logging.
	[ERROR]
	[ERROR] For more information about the errors and possible solutions, please read the
	following articles:
	[ERROR] [Help 1]
	http://cwiki.apache.org/confluence/display/MAVEN/PluginIncompatibleException
	error: Bad exit status from /usr/src/tmp/rpmb-tmp.kjKrTi (%build)
	RPM build errors:
	Bad exit status from /usr/src/tmp/rpmb-tmp.kjKrTi (%build)

jopt-simple-0:5.0.4-alt1_10jpp11
	[ERROR] -> [Help 1]
	[ERROR]
	[ERROR] To see the full stack trace of the errors, re-run Maven with the -e switch.
	[ERROR] Re-run Maven using the -X switch to enable full debug logging.
	[ERROR]
	[ERROR] For more information about the errors and possible solutions, please read the
	following articles:
	[ERROR] [Help 1]
	http://cwiki.apache.org/confluence/display/MAVEN/PluginIncompatibleException
	error: Bad exit status from /usr/src/tmp/rpmb-tmp.di6cKN (%build)
	RPM build errors:
	Bad exit status from /usr/src/tmp/rpmb-tmp.di6cKN (%build)

jsch-agent-proxy-0.0.8-alt1_15jpp11
	[ERROR] Re-run Maven using the -X switch to enable full debug logging.
	[ERROR]
	[ERROR] For more information about the errors and possible solutions, please read the
	following articles:
	[ERROR] [Help 1]
	http://cwiki.apache.org/confluence/display/MAVEN/PluginIncompatibleException
	[ERROR]
	[ERROR] After correcting the problems, you can resume the build with the command
	[ERROR]   mvn <args> -rf :jsch.agentproxy.core
	error: Bad exit status from /usr/src/tmp/rpmb-tmp.8v0KLw (%build)
	RPM build errors:
	Bad exit status from /usr/src/tmp/rpmb-tmp.8v0KLw (%build)

json_simple-1.1.1-alt2_23jpp11
	[ERROR] -> [Help 1]
	[ERROR]
	[ERROR] To see the full stack trace of the errors, re-run Maven with the -e switch.
	[ERROR] Re-run Maven using the -X switch to enable full debug logging.
	[ERROR]
	[ERROR] For more information about the errors and possible solutions, please read the
	following articles:
	[ERROR] [Help 1]
	http://cwiki.apache.org/confluence/display/MAVEN/PluginIncompatibleException
	error: Bad exit status from /usr/src/tmp/rpmb-tmp.2vOJOF (%build)
	RPM build errors:
	Bad exit status from /usr/src/tmp/rpmb-tmp.2vOJOF (%build)

kaidan-0.16.0-alt1
	19 | const QList<Emoji> &emojis()
	ld: /usr/lib/libQXmppQt6.so.1.16.2: undefined reference to
	`QUntypedPropertyBinding::QUntypedPropertyBinding(QPropertyBindingPrivate*)@Qt_6_PRIVATE_API'
	collect2: error: ld returned 1 exit status
	/usr/bin/c++ -pipe -frecord-gcc-switches -Wall -g -O2 -flto=auto -march=i586
	-mtune=generic -fno-operator-names -Wall -Wextra -Wcast-align -Wchar-subscripts
	-Wformat-security -Wno-long-long -Wpointer-arith -Wundef -Wnon-virtual-dtor
	-Woverloaded-virtual -Werror=return-type -Werror=init-self -Werror=undef -Wvla
	-Wdate-time -Wsuggest-override -Wlogical-op -pedantic -Wzero-as-null-pointer-constant
	-Wmissing-include-dirs -fexceptions -O2 -DNDEBUG -Wl,--enable-new-dtags -L/usr/lib
	-L/usr/lib/kf6/devel CMakeFiles/kaidan.dir/kaidan_autogen/mocs_compilation.cpp.o
	CMakeFiles/kaidan.dir/main.cpp.o "CMakeFiles/kaidan.dir/ECMQmLoader-kaidan_qt.cpp.o"
	CMakeFiles/kaidan.dir/KaidanLog.cpp.o -o ../../bin/kaidan  ../../lib/liblibkaidancore.a
	/usr/lib/libkdsingleapplication-qt6.so.1.2.1 /usr/lib/libicuuc.so -ldl
	/usr/lib/libKF6ItemModels.so.6.29.0 /usr/lib/libKF6KIOWidgets.so.6.29.0
	/usr/lib/libKF6KIOGui.so.6.29.0 /usr/lib/libKF6WindowSystem.so.6.29.0
	/usr/lib/libX11.so /usr/lib/libKF6KIOCore.so.6.29.0 /usr/lib/libKF6Crash.so.6.29.0
	/usr/lib/libKF6JobWidgets.so.6.29.0 /usr/lib/libKF6Service.so.6.29.0
	/usr/lib/libKF6CoreAddons.so.6.29.0 /usr/lib/libKF6Completion.so.6.29.0
	/usr/lib/libKF6WidgetsAddons.so.6.29.0 /usr/lib/libQt6Widgets.so.6.11.2
	/usr/lib/libKirigami.so.6.29.0 /usr/lib/libKirigamiPlatform.so.6.29.0
	/usr/lib/libKF6Prison.so.6.29.0 /usr/lib/libgstreamer-1.0.so
	/usr/lib/libgobject-2.0.so /usr/lib/libglib-2.0.so /usr/lib/libQt6Location.so.6.11.2
	/usr/lib/libQt6PositioningQuick.so.6.11.2 /usr/lib/libQt6Multimedia.so.6.11.2
	/usr/lib/libQt6Concurrent.so.6.11.2 /usr/lib/libQt6Positioning.so.6.11.2
	/usr/lib/libQt6QuickControls2.so.6.11.2 /usr/lib/libQt6Quick.so.6.11.2
	/usr/lib/libQt6OpenGL.so.6.11.2 /usr/lib/libQt6Qml.so.6.11.2 /usr/lib/libQt6Sql.so.6.11.2
	/usr/lib/libQt6Svg.so.6.11.2 /usr/lib/libqt6keychain.so.0.16.0
	/usr/lib/libQXmppOmemoQt6.so.1.16.2 /usr/lib/libQXmppQt6.so.1.16.2
	/usr/lib/libQt6Xml.so.6.11.2 /usr/lib/libKF6Notifications.so.6.29.0
	/usr/lib/libKF6ConfigCore.so.6.29.0 /usr/lib/libQt6Network.so.6.11.2
	/usr/lib/libQt6Gui.so.6.11.2 /usr/lib/libQt6DBus.so.6.11.2 /usr/lib/libGLX.so
	/usr/lib/libOpenGL.so /usr/lib/libQt6Core.so.6.11.2 /usr/lib/libxkbcommon.so

kernel-image-6.12-6.12.108-alt1
	init: mount sysfs to /sys
	init: no virtio_console device driver (1): No such file or directory
	init: mount 9p from virtio-9p:/ to /newroot flags
	'version=9p2000.L,trans=virtio,access=any,msize=262144'
	--
	+ cat /usr/lib/ltp/output/LTP_RUN_ON-out.failed
	cat: /usr/lib/ltp/output/LTP_RUN_ON-out.failed: No such file or directory
	error: Bad exit status from /usr/src/tmp/rpmb-tmp.7lfEAO (%check)

kernel-image-6.18-6.18.49-alt1
	init: mount sysfs to /sys
	init: no virtio_console device driver (1): No such file or directory
	init: mount 9p from virtio-9p:/ to /newroot flags
	'version=9p2000.L,trans=virtio,access=any,msize=262144'
	--
	+ cat /usr/lib/ltp/output/LTP_RUN_ON-out.failed
	cat: /usr/lib/ltp/output/LTP_RUN_ON-out.failed: No such file or directory
	error: Bad exit status from /usr/src/tmp/rpmb-tmp.cR0GyX (%check)

kernel-image-7.1-7.1.13-alt1
	init: mount sysfs to /sys
	init: no virtio_console device driver (1): No such file or directory
	init: mount 9p from virtio-9p:/ to /newroot flags
	'version=9p2000.L,trans=virtio,access=any,msize=262144'
	--
	+ cat /usr/lib/ltp/output/LTP_RUN_ON-out.failed
	cat: /usr/lib/ltp/output/LTP_RUN_ON-out.failed: No such file or directory
	error: Bad exit status from /usr/src/tmp/rpmb-tmp.xiZ3Ir (%check)

kernel-image-for-vm-6.18.49-alt1
	+ cat /usr/lib/ltp/output/LTP_RUN_ON-out.failed
	cat: /usr/lib/ltp/output/LTP_RUN_ON-out.failed: No such file or directory
	error: Bad exit status from /usr/src/tmp/rpmb-tmp.lMukbr (%check)

libdbi-drivers-1:0.9.0-alt7.1
	file /usr/share/man/man1/pdfjadetex.1.xz conflicts between attempted installs of
	jadetex-3.13-alt4_17.noarch and texlive-collection-basic-2022-alt0_14.noarch
	hsh-install: Packages installation failed.

libopencv-1:4.14.0-alt1
	cd /usr/src/RPM/BUILD/libopencv-4.14.0/BUILD/modules/features2d &&
	/usr/bin/cmake -E cmake_symlink_library ../../lib/libopencv_features2d.so.4.14.0
	../../lib/libopencv_features2d.so.414 ../../lib/libopencv_features2d.so
	gmake[2]: Leaving directory '/usr/src/RPM/BUILD/libopencv-4.14.0/BUILD'
	gmake[1]: Entering directory '/usr/src/RPM/BUILD/libopencv-4.14.0/BUILD'
	[ 25%] Built target opencv_features2d
	gmake[1]: Leaving directory '/usr/src/RPM/BUILD/libopencv-4.14.0/BUILD'
	gmake: *** [Makefile:169: all] Error 2
	error: Bad exit status from /usr/src/tmp/rpmb-tmp.2XN0wP (%build)
	RPM build errors:
	File /usr/src/RPM/SOURCES/libopencv-4.14.0-alt1.patch is smaller than 8 bytes
	Bad exit status from /usr/src/tmp/rpmb-tmp.2XN0wP (%build)

libopencv4.13-1:4.13.0-alt2
	cd /usr/src/RPM/BUILD/libopencv4.13-4.13.0/BUILD/modules/features2d &&
	/usr/bin/cmake -E cmake_symlink_library ../../lib/libopencv_features2d.so.4.13.0
	../../lib/libopencv_features2d.so.413 ../../lib/libopencv_features2d.so
	gmake[2]: Leaving directory '/usr/src/RPM/BUILD/libopencv4.13-4.13.0/BUILD'
	gmake[1]: Entering directory '/usr/src/RPM/BUILD/libopencv4.13-4.13.0/BUILD'
	[ 25%] Built target opencv_features2d
	gmake[1]: Leaving directory '/usr/src/RPM/BUILD/libopencv4.13-4.13.0/BUILD'
	gmake: *** [Makefile:169: all] Error 2
	error: Bad exit status from /usr/src/tmp/rpmb-tmp.OEg5fV (%build)
	RPM build errors:
	File /usr/src/RPM/SOURCES/libopencv4.13-4.13.0-alt2.patch is smaller than 8 bytes
	Bad exit status from /usr/src/tmp/rpmb-tmp.OEg5fV (%build)

libopenshot-0.7.0-alt1
	/usr/src/RPM/BUILD/libopenshot-0.7.0/src/Timeline.cpp:1377:40: warning: loop variable
	'change' creates a copy from type 'const Json::Value' [-Wrange-loop-construct]
	1377 |		       for (const Json::Value change : root) {
	/usr/src/RPM/BUILD/libopenshot-0.7.0/src/Timeline.cpp:1377:40: note: use reference type
	to prevent copying
	1377 |		       for (const Json::Value change : root) {
	gmake[2]: Leaving directory '/usr/src/RPM/BUILD/libopenshot-0.7.0/i586-alt-linux'
	gmake[1]: *** [CMakeFiles/Makefile2:1130: src/CMakeFiles/openshot.dir/all] Error 2
	gmake: *** [Makefile:166: all] Error 2
	error: Bad exit status from /usr/src/tmp/rpmb-tmp.31lLkY (%build)
	RPM build errors:
	Bad exit status from /usr/src/tmp/rpmb-tmp.31lLkY (%build)

libopentelemetry-1.22.0-alt2
	[Error] File:
	/usr/src/RPM/BUILD/libopentelemetry-1.22.0/exporters/prometheus/src/exporter.cc:38
	[Prometheus Exporter] Can't initialize prometheus exposer with endpoint: localhost:9464
	Error: null context when constructing CivetServer. Possible problem binding to port. Error:
	Failed to setup server ports
	/usr/src/RPM/BUILD/libopentelemetry-1.22.0/exporters/prometheus/test/exporter_test.cc:45:
	Failure
	--
	Expected: true
	[  FAILED  ] PrometheusExporter.ShutdownSetsIsShutdownToTrue (0 ms)
	[----------] 1 test from PrometheusExporter (0 ms total)
	--
	[  PASSED  ] 0 tests.
	[  FAILED  ] 1 test, listed below:
	[  FAILED  ] PrometheusExporter.ShutdownSetsIsShutdownToTrue
	1 FAILED TEST
	554/590 Test #565: exporter.PrometheusCollector.BasicTests
	..............................................................	 Passed    0.02 sec
	--
	590/590 Test #414: metrics.HistogramStress.UnsignedInt64
	................................................................   Passed   61.05 sec
	99% tests passed, 1 tests failed out of 586
	Total Test time (real) =  62.00 sec
	--
	588 - examples.metrics_simple (Disabled)
	The following tests FAILED:
	563 - exporter.PrometheusExporter.ShutdownSetsIsShutdownToTrue (Failed)

ltp-alt-lists-20-alt1
	+ cat syscalls syscalls-ipc crypto connectors containers fs_readonly ima kernel_misc
	net.features numa pty uevent
	cat: connectors: No such file or directory
	error: Bad exit status from /usr/src/tmp/rpmb-tmp.T9w6XV (%install)

m4b-tool-0.5.2-alt1
	file /usr/lib/tmpfiles.d/php.conf conflicts between attempted installs of
	php8.5-libs-8.5.10-alt1.i586 and php8.4-libs-8.4.24-alt1.i586
	hsh-install: Packages installation failed.

maven-artifact-resolver-1:1.0-alt3_25jpp11
	[ERROR] -> [Help 1]
	[ERROR]
	[ERROR] To see the full stack trace of the errors, re-run Maven with the -e switch.
	[ERROR] Re-run Maven using the -X switch to enable full debug logging.
	[ERROR]
	[ERROR] For more information about the errors and possible solutions, please read the
	following articles:
	[ERROR] [Help 1]
	http://cwiki.apache.org/confluence/display/MAVEN/PluginIncompatibleException
	error: Bad exit status from /usr/src/tmp/rpmb-tmp.l8RIPD (%build)
	RPM build errors:
	Bad exit status from /usr/src/tmp/rpmb-tmp.l8RIPD (%build)

maven-osgi-1:0.2.0-alt1_19jpp11
	[ERROR] -> [Help 1]
	[ERROR]
	[ERROR] To see the full stack trace of the errors, re-run Maven with the -e switch.
	[ERROR] Re-run Maven using the -X switch to enable full debug logging.
	[ERROR]
	[ERROR] For more information about the errors and possible solutions, please read the
	following articles:
	[ERROR] [Help 1]
	http://cwiki.apache.org/confluence/display/MAVEN/PluginIncompatibleException
	error: Bad exit status from /usr/src/tmp/rpmb-tmp.qpIEpy (%build)
	RPM build errors:
	Bad exit status from /usr/src/tmp/rpmb-tmp.qpIEpy (%build)

mlt7-7.36.1-alt1
	cd /usr/src/RPM/BUILD/mlt-7.36.1/BUILD/src/modules/rtaudio && /usr/bin/cmake -E
	cmake_link_script CMakeFiles/mltrtaudio.dir/link.txt --verbose=1
	/usr/bin/g++ -fPIC -pipe -frecord-gcc-switches -Wall -g -O2 -flto=auto -march=i586
	-mtune=generic -DAVDATADIR=/usr/share/ffmpeg/ -O2 -DNDEBUG -shared -L/usr/lib
	-L/usr/lib/kf5/devel -pthread -Wl,--dependency-file=CMakeFiles/mltrtaudio.dir/link.d  -o
	../../../out/lib/mlt/libmltrtaudio.so CMakeFiles/mltrtaudio.dir/consumer_rtaudio.cpp.o
	CMakeFiles/mltrtaudio.dir/RtAudio.cpp.o  ../../../out/lib/libmlt-7.so.7.36.1
	/usr/lib/libasound.so /usr/lib/libpulse-simple.so /usr/lib/libpulse.so
	make[2]: Leaving directory '/usr/src/RPM/BUILD/mlt-7.36.1/BUILD'
	make[1]: Entering directory '/usr/src/RPM/BUILD/mlt-7.36.1/BUILD'
	[ 60%] Built target mltrtaudio
	make[1]: Leaving directory '/usr/src/RPM/BUILD/mlt-7.36.1/BUILD'
	make: *** [Makefile:139: all] Error 2
	error: Bad exit status from /usr/src/tmp/rpmb-tmp.QBhEcS (%build)
	RPM build errors:
	Bad exit status from /usr/src/tmp/rpmb-tmp.QBhEcS (%build)

moonlight-qt-6.1.0-alt1
	streaming/video/ffmpeg.cpp: In member function ‘bool
	FFmpegVideoDecoder::tryInitializeRendererForUnknownDecoder(const AVCodec*,
	PDECODER_PARAMETERS, bool)’:
	streaming/video/ffmpeg.cpp:1144:18: error: ‘const AVCodec’ {aka ‘const struct
	AVCodec’} has no member named ‘pix_fmts’
	1144 |	   if (decoder->pix_fmts == NULL) {
	streaming/video/ffmpeg.cpp:1194:30: error: ‘const AVCodec’ {aka ‘const struct
	AVCodec’} has no member named ‘pix_fmts’
	1194 |	   for (int i = 0; decoder->pix_fmts[i] != AV_PIX_FMT_NONE; i++) {
	streaming/video/ffmpeg.cpp:1079:79: error: ‘const AVCodec’ {aka ‘const struct
	AVCodec’} has no member named ‘pix_fmts’
	1079 |	       if (renderer.getPreferredPixelFormat(params->videoFormat) ==
	decoder->pix_fmts[i]) { \
	--
	1202 |	       TRY_PREFERRED_PIXEL_FORMAT(SdlRenderer);
	streaming/video/ffmpeg.cpp:1082:49: error: ‘const AVCodec’ {aka ‘const struct
	AVCodec’} has no member named ‘pix_fmts’
	1082 |			       decoder->name, decoder->pix_fmts[i]); \
	--
	1202 |	       TRY_PREFERRED_PIXEL_FORMAT(SdlRenderer);
	streaming/video/ffmpeg.cpp:1083:57: error: ‘const AVCodec’ {aka ‘const struct
	AVCodec’} has no member named ‘pix_fmts’
	1083 |		   if (tryInitializeRenderer(decoder, decoder->pix_fmts[i], params,
	nullptr, nullptr, \
	--
	1202 |	       TRY_PREFERRED_PIXEL_FORMAT(SdlRenderer);
	streaming/video/ffmpeg.cpp:1087:53: error: ‘const AVCodec’ {aka ‘const struct
	AVCodec’} has no member named ‘pix_fmts’
	1087 |				   decoder->name, decoder->pix_fmts[i]); \
	--
	1202 |	       TRY_PREFERRED_PIXEL_FORMAT(SdlRenderer);
	streaming/video/ffmpeg.cpp:1207:30: error: ‘const AVCodec’ {aka ‘const struct
	AVCodec’} has no member named ‘pix_fmts’
	1207 |	   for (int i = 0; decoder->pix_fmts[i] != AV_PIX_FMT_NONE; i++) {
	streaming/video/ffmpeg.cpp:1096:22: error: ‘const AVCodec’ {aka ‘const struct
	AVCodec’} has no member named ‘pix_fmts’
	1096 |	       if (decoder->pix_fmts[i] !=
	renderer.getPreferredPixelFormat(params->videoFormat) && \
	--
	1215 |	       TRY_SUPPORTED_NON_PREFERRED_PIXEL_FORMAT(SdlRenderer);
	streaming/video/ffmpeg.cpp:1097:75: error: ‘const AVCodec’ {aka ‘const struct
	AVCodec’} has no member named ‘pix_fmts’
	1097 |		   renderer.isPixelFormatSupported(params->videoFormat,
	decoder->pix_fmts[i])) { \
	--
	1215 |	       TRY_SUPPORTED_NON_PREFERRED_PIXEL_FORMAT(SdlRenderer);
	streaming/video/ffmpeg.cpp:1100:49: error: ‘const AVCodec’ {aka ‘const struct
	AVCodec’} has no member named ‘pix_fmts’
	1100 |			       decoder->name, decoder->pix_fmts[i]); \

mplayer-1.5-alt3.g567631e
	/usr/include/bits/string_fortified.h:93:10: warning: argument 1 null where non-null
	expected because argument 3 is nonzero [-Wnonnull]
	93 |   return __builtin___strcpy_chk (__dest, __src, __glibc_objsize (__dest));
	/usr/include/bits/string_fortified.h:93:10: note: in a call to built-in function
	'__builtin_memcpy'
	loader/win32.c: In function 'expGetMonitorInfoA':
	loader/win32.c:2791:9: warning: '__builtin_strncpy' output truncated before terminating
	nul copying 8 bytes from a string of the same length [-Wstringop-truncation]
	2791 |	       strncpy(lpmiex->szDevice, "Monitor1", CCHDEVICENAME);
	make: Leaving directory '/usr/src/RPM/BUILD/mplayer-1.5'
	error: Bad exit status from /usr/src/tmp/rpmb-tmp.6ygnov (%build)
	RPM build errors:
	Bad exit status from /usr/src/tmp/rpmb-tmp.6ygnov (%build)

msv-1:2013.6.1-alt3_19jpp11
	[ERROR] -> [Help 1]
	[ERROR]
	[ERROR] To see the full stack trace of the errors, re-run Maven with the -e switch.
	[ERROR] Re-run Maven using the -X switch to enable full debug logging.
	[ERROR]
	[ERROR] For more information about the errors and possible solutions, please read the
	following articles:
	[ERROR] [Help 1]
	http://cwiki.apache.org/confluence/display/MAVEN/PluginIncompatibleException
	error: Bad exit status from /usr/src/tmp/rpmb-tmp.v7W35Z (%build)
	RPM build errors:
	Bad exit status from /usr/src/tmp/rpmb-tmp.v7W35Z (%build)

owasp-java-encoder-1.2.2-alt1_5jpp11
	[ERROR] Re-run Maven using the -X switch to enable full debug logging.
	[ERROR]
	[ERROR] For more information about the errors and possible solutions, please read the
	following articles:
	[ERROR] [Help 1]
	http://cwiki.apache.org/confluence/display/MAVEN/PluginIncompatibleException
	[ERROR]
	[ERROR] After correcting the problems, you can resume the build with the command
	[ERROR]   mvn <args> -rf :encoder
	error: Bad exit status from /usr/src/tmp/rpmb-tmp.95RNR6 (%build)
	RPM build errors:
	Bad exit status from /usr/src/tmp/rpmb-tmp.95RNR6 (%build)

podman-tui-1.11.3-alt1
	?	github.com/containers/podman-tui/ui/style	[no test files]
	?	github.com/containers/podman-tui/ui/system	[no test files]
	ok	github.com/containers/podman-tui/ui/system/sysdialogs	0.164s
	ok	github.com/containers/podman-tui/ui/utils	0.022s
	?	github.com/containers/podman-tui/ui/volumes	[no test files]
	ok	github.com/containers/podman-tui/ui/volumes/voldialogs	0.361s
	FAIL
	error: Bad exit status from /usr/src/tmp/rpmb-tmp.kdWZp9 (%check)
	RPM build errors:
	Bad exit status from /usr/src/tmp/rpmb-tmp.kdWZp9 (%check)

portlet-2.0-api-1.0-alt3_24jpp11
	[ERROR] -> [Help 1]
	[ERROR]
	[ERROR] To see the full stack trace of the errors, re-run Maven with the -e switch.
	[ERROR] Re-run Maven using the -X switch to enable full debug logging.
	[ERROR]
	[ERROR] For more information about the errors and possible solutions, please read the
	following articles:
	[ERROR] [Help 1]
	http://cwiki.apache.org/confluence/display/MAVEN/PluginIncompatibleException
	error: Bad exit status from /usr/src/tmp/rpmb-tmp.woZqkg (%build)
	RPM build errors:
	Bad exit status from /usr/src/tmp/rpmb-tmp.woZqkg (%build)

punesemu-0.111-alt1
	/usr/src/RPM/BUILD/punesemu-0.111/src/core/recording.c: In function
	'ffmpeg_audio_select_sample_fmt':
	/usr/src/RPM/BUILD/punesemu-0.111/src/core/recording.c:1454:45: error: 'AVCodec' has
	no member named 'sample_fmts'
	1454 |	       const enum AVSampleFormat *p = codec->sample_fmts;
	/usr/src/RPM/BUILD/punesemu-0.111/src/core/recording.c:1466:22: error: 'AVCodec' has
	no member named 'sample_fmts'
	1466 |	       return (codec->sample_fmts[0]);
	/usr/src/RPM/BUILD/punesemu-0.111/src/core/recording.c: In function
	'ffmpeg_audio_select_samplerate':
	/usr/src/RPM/BUILD/punesemu-0.111/src/core/recording.c:1472:19: error: 'AVCodec' has
	no member named 'supported_samplerates'
	1472 |	       if (!codec->supported_samplerates) {
	/usr/src/RPM/BUILD/punesemu-0.111/src/core/recording.c:1489:18: error: 'AVCodec' has
	no member named 'supported_samplerates'
	1489 |	       p = codec->supported_samplerates;
	/usr/src/RPM/BUILD/punesemu-0.111/src/core/recording.c:1495:18: error: 'AVCodec' has
	no member named 'supported_samplerates'
	1495 |	       p = codec->supported_samplerates;
	/usr/src/RPM/BUILD/punesemu-0.111/src/core/recording.c: In function
	'ffmpeg_audio_select_channel_layout':
	/usr/src/RPM/BUILD/punesemu-0.111/src/core/recording.c:1609:19: error: 'AVCodec' has
	no member named 'ch_layouts'
	1609 |	       if (!codec->ch_layouts) {
	/usr/src/RPM/BUILD/punesemu-0.111/src/core/recording.c:1629:18: error: 'AVCodec' has
	no member named 'ch_layouts'
	1629 |	       p = codec->ch_layouts;
	/usr/src/RPM/BUILD/punesemu-0.111/src/core/recording.c:1640:18: error: 'AVCodec' has
	no member named 'ch_layouts'
	1640 |	       p = codec->ch_layouts;

python3-module-chess-1.11.2-alt1
	return await command.result
	chess.engine.EngineTerminatedError: engine process died unexpectedly (exit code: -11)
	ERROR: test_sf_multipv (__main__.EngineTestCase.test_sf_multipv)
	Traceback (most recent call last):
	--
	return await command.result
	chess.engine.EngineTerminatedError: engine process died unexpectedly (exit code: -11)
	ERROR: test_sf_options (__main__.EngineTestCase.test_sf_options)
	Traceback (most recent call last):
	--
	return await command.result
	chess.engine.EngineTerminatedError: engine process died unexpectedly (exit code: -11)
	ERROR: test_sf_quit (__main__.EngineTestCase.test_sf_quit)
	Traceback (most recent call last):
	--
	return await command.result
	chess.engine.EngineTerminatedError: engine process died unexpectedly (exit code: -11)
	Ran 288 tests in 1.442s
	FAILED (errors=4, skipped=17)
	py3: exit 1 (1.74 seconds) /usr/src/RPM/BUILD/python3-module-chess-1.11.2> python
	test.py --verbose pid=2701336

python3-module-filelock-3.25.2-alt1.1
	>	    raise RuntimeError(msg)
	E	    RuntimeError: Cannot acquire write lock on
	/usr/src/tmp/pytest-of-builder/pytest-0/test_release_force0/test_lock.db (lock id:
	4126996040) from thread 4124891968 while it is held by thread 4104125248
	.run_venv/lib/python3/site-packages/filelock/_read_write.py:183: RuntimeError
	--
	SKIPPED [20] tests/test_filelock.py:108: Windows only
	FAILED tests/test_async_read_write.py::test_release_force - RuntimeError: Can...
	============ 1 failed, 353 passed, 20 skipped, 6 warnings in 50.45s ============
	INFO	 : Command's result: FAILURE
	INFO	 : Command's error: Command '['python3', '-m', 'pytest', '-vra', 'tests']'
	returned non-zero exit status 1.
	error: Bad exit status from /usr/src/tmp/rpmb-tmp.mxvW08 (%check)

python3-module-hdf5storage-0.2.2-alt1
	dtype=self.__MATLAB_classes_reverse[matlab_class],
	E		    ValueError: array is too big; `arr.size * arr.dtype.itemsize`
	is larger than the maximum possible size.
	hdf5storage/marshallers.py:1444: ValueError
	--
	=========================== short test summary info ============================
	FAILED tests/test_empty_matrix_matlab_metadata.py::test_read_empty - ValueErr...
	============= 1 failed, 2237 passed, 3 skipped, 1 warning in 7.84s =============
	INFO	 : Command's result: FAILURE
	INFO	 : Command's error: Command '['python3', '-m', 'pytest', '-v']' returned non-zero
	exit status 1.
	error: Bad exit status from /usr/src/tmp/rpmb-tmp.mCBu3Y (%check)

python3-module-mypy-2.3.1-alt1
	XFAIL
	mypyc/test/test_run.py::TestRun::run-singledispatch.test::testSingleDispatchMethodWithOtherDecorator
	FAILED
	mypy/test/test_nativeparse.py::NativeParserSuite::native-parser.test::testBytesLiteral
	===== 1 failed, 14205 passed, 361 skipped, 12 xfailed in 443.26s (0:07:23) =====
	INFO	 : Command's result: FAILURE
	INFO	 : Command's error: Command '['python3', '-m', 'pytest', '-ra', '--ignore',
	'mypyc/test']' returned non-zero exit status 1.
	error: Bad exit status from /usr/src/tmp/rpmb-tmp.jptHec (%check)

python3-module-paho-2.1.0-alt2
	==================================== ERRORS ====================================
	________________ ERROR at teardown of test_01_no_clean_session _________________
	def fin():
	--
	>	    raise RuntimeError(f"Client {name} exited with code {proc.returncode},
	expected {expected_returncode}")
	E	    RuntimeError: Client 01-no-clean-session.py exited with code -2, expected 0
	tests/lib/conftest.py:75: RuntimeError
	--
	KeyboardInterrupt
	_____________ ERROR at teardown of test_03_publish_helper_qos0_v5 ______________
	def fin():
	--
	>	    raise RuntimeError(f"Client {name} exited with code {proc.returncode},
	expected {expected_returncode}")
	E	    RuntimeError: Client 03-publish-helper-qos0-v5.py exited with code -2,
	expected 0
	tests/lib/conftest.py:75: RuntimeError
	--
	KeyboardInterrupt
	_________ ERROR at teardown of test_03_publish_helper_qos1_disconnect __________
	def fin():
	--
	>	    raise RuntimeError(f"Client {name} exited with code {proc.returncode},
	expected {expected_returncode}")
	E	    RuntimeError: Client 03-publish-helper-qos1-disconnect.py exited with code
	-2, expected 0
	tests/lib/conftest.py:75: RuntimeError
	--
	=========================== short test summary info ============================
	ERROR tests/lib/test_01_no_clean_session.py::test_01_no_clean_session - Runti...
	ERROR tests/lib/test_03_publish_helper_qos0_v5.py::test_03_publish_helper_qos0_v5
	ERROR
	tests/lib/test_03_publish_helper_qos1_disconnect.py::test_03_publish_helper_qos1_disconnect
	============ 136 passed, 26 skipped, 1 xfailed, 3 errors in 33.97s =============
	INFO	 : Command's result: FAILURE
	INFO	 : Command's error: Command '['python3', '-m', 'pytest', '-o', 'addopts=',
	'tests']' returned non-zero exit status 1.
	error: Bad exit status from /usr/src/tmp/rpmb-tmp.bNTpKl (%check)

python3-module-qtconsole-5.7.2-alt1.1
	INFO	 : Running command: ['xvfb-run', '-s', '-nolisten local', 'pytest', '-v',
	'qtconsole', '--ignore', 'qtconsole/tests/test_inprocess_kernel.py']
	_XSERVTransmkdir: ERROR: euid != 0,directory /tmp/.X11-unix will not be created.
	============================= test session starts ==============================
	--
	if obj == self._text_edit:
	AttributeError: 'CompletionHtml' object has no attribute '_text_edit'
	/usr/bin/xvfb-run: line 171: 3990272 Aborted		     DISPLAY=:"$SERVERNUM"
	XAUTHORITY="$AUTHFILE" "$@"
	INFO	 : Command's result: FAILURE
	INFO	 : Command's error: Command '['xvfb-run', '-s', '-nolisten local', 'pytest',
	'-v', 'qtconsole', '--ignore', 'qtconsole/tests/test_inprocess_kernel.py']' returned
	non-zero exit status 134.
	error: Bad exit status from /usr/src/tmp/rpmb-tmp.8w41S5 (%check)

python3-module-sentry-sdk-2.66.1-alt1
	=========================== short test summary info ============================
	FAILED tests/tracing/test_sampling.py::test_no_double_sampling_span_streaming - assert
	0 == 1
	+  where 0 = len([])
	--
	INFO	 : Command's result: FAILURE
	INFO	 : Command's error: Command '['python3', '-m', 'pytest', '--ignore',
	'tests/tracing/test_span_streaming.py', '--ignore', 'tests/tracing/test_span_batcher.py',
	'--deselect', 'tests/test_utils.py::test_default_release', '--deselect',
	'tests/tracing/test_decorator.py::test_span_templates_ai_dicts[True]', '--deselect',
	'tests/tracing/test_decorator.py::test_span_templates_ai_objects[True]', '--deselect',
	'tests/tracing/test_sampling.py::test_only_captures_segment_when_sampled_is_true_span_streaming[True]',
	'--deselect', 'tests/tracing/test_span_origin.py::test_span_origin_manual_span_streaming',
	'--deselect', 'tests/tracing/test_span_origin.py::test_span_origin_custom_span_streaming',
	'--deselect', 'tests/utils/test_contextvars.py::test_leaks[threads]', '--deselect',
	'tests/utils/test_contextvars.py::test_leaks_when_is_contextvars_broken_is_false']'
	returned non-zero exit status 1.
	error: Bad exit status from /usr/src/tmp/rpmb-tmp.ROzcoD (%check)

python3-module-shapely-2.1.2-alt1
	normalize=shapely.geos_version == (3, 9, 0),
	E	AssertionError:
	E	Geometries are not equal:
	--
	normalize=shapely.geos_version == (3, 9, 0),
	E	AssertionError:
	E	Geometries are not equal:
	--
	XFAIL
	.run_venv/lib/python3/site-packages/shapely/tests/legacy/test_wkb.py::test_dump_hex_load_binary
	- Not yet implemented for Shapely 2.0
	FAILED
	.run_venv/lib/python3/site-packages/shapely/tests/legacy/test_split.py::TestSplitLine::test_split_line_with_line
	FAILED
	.run_venv/lib/python3/site-packages/shapely/tests/legacy/test_split.py::TestSplitLine::test_split_line_with_multiline
	FAILED
	.run_venv/lib/python3/site-packages/shapely/tests/legacy/test_split.py::TestSplitLine::test_split_line_with_multipolygon
	FAILED
	.run_venv/lib/python3/site-packages/shapely/tests/legacy/test_split.py::TestSplitLine::test_split_line_with_polygon
	FAILED
	.run_venv/lib/python3/site-packages/shapely/tests/test_constructive.py::test_make_valid[geom1-expected1]
	FAILED
	.run_venv/lib/python3/site-packages/shapely/tests/test_constructive.py::test_remove_repeated_points_invalid_result[geom0-2]
	FAILED
	.run_venv/lib/python3/site-packages/shapely/tests/test_geometry.py::test_set_precision_collapse[geometry0-valid_output-expected0]
	FAILED
	.run_venv/lib/python3/site-packages/shapely/tests/test_geometry.py::test_set_precision_collapse[geometry2-keep_collapsed-expected2]
	============ 8 failed, 6253 passed, 99 skipped, 3 xfailed in 7.59s =============

python3-module-zict-3.0.0-alt1
	File "/usr/src/RPM/BUILD/python3-module-zict-3.0.0/zict/tests/utils_test.py", line 193,
	in check_different_keys_threadsafe
	f1.result()
	File "/usr/lib/python3.14/concurrent/futures/_base.py", line 449, in result
	self._condition.wait(timeout)
	File "/usr/lib/python3.14/threading.py", line 370, in wait
	waiter.acquire()
	+++++++++++++++++++++++++++++++++++ Timeout ++++++++++++++++++++++++++++++++++++
	error: Bad exit status from /usr/src/tmp/rpmb-tmp.sVdxxv (%check)
	RPM build errors:
	Bad exit status from /usr/src/tmp/rpmb-tmp.sVdxxv (%check)

qgroundcontrol-5.0.8-alt6
	with requested version range "6.8.3...6.10.3".
	The following configuration files were considered but not accepted:
	/usr/lib/cmake/Qt6/Qt6Config.cmake, version: 6.11.2
	The version found is not compatible with the version requested.
	/lib/cmake/Qt6/Qt6Config.cmake, version: 6.11.2
	The version found is not compatible with the version requested.
	-- Configuring incomplete, errors occurred!
	error: Bad exit status from /usr/src/tmp/rpmb-tmp.fKKv6O (%build)
	RPM build errors:
	Bad exit status from /usr/src/tmp/rpmb-tmp.fKKv6O (%build)

simplescreenrecorder-0.4.4.0.23.9559-alt4
	Package 'bzip2', required by 'freetype2', not found
	Package bzip2 was not found in the pkg-config search path.
	Perhaps you should add the directory containing `bzip2.pc'
	to the PKG_CONFIG_PATH environment variable
	Package 'bzip2', required by 'freetype2', not found
	Package bzip2 was not found in the pkg-config search path.
	Perhaps you should add the directory containing `bzip2.pc'
	to the PKG_CONFIG_PATH environment variable
	Package 'bzip2', required by 'freetype2', not found
	-- Found X11: /usr/include
	--
	--   Found libv4l2, version 1.32.0
	Package libjpeg was not found in the pkg-config search path.
	Perhaps you should add the directory containing `libjpeg.pc'
	to the PKG_CONFIG_PATH environment variable
	Package 'libjpeg', required by 'libv4lconvert', not found
	Package libjpeg was not found in the pkg-config search path.
	Perhaps you should add the directory containing `libjpeg.pc'
	to the PKG_CONFIG_PATH environment variable
	Package 'libjpeg', required by 'libv4lconvert', not found
	Package libjpeg was not found in the pkg-config search path.
	Perhaps you should add the directory containing `libjpeg.pc'

snapd-glib-2-1.72-alt1
	2/4 snapd-glib:Markdown tests (qt6) OK		      0.02s
	▶ 3/4 /find/cancel - ERROR:../tests/test-glib.c:4800:find_cancel_cb: assertion failed
	(error == (g-io-error-quark, 19)): snapd returned no content type (snapd - error -
	quark, 4) FAIL
	▶ 3/4				      ERROR
	3/4 snapd-glib:Tests		    ERROR	      0.93s   killed by signal 6 SIGABRT
	>>> MESON_TEST_ITERATION=1
	LD_LIBRARY_PATH=/usr/src/RPM/BUILD/snapd-glib-1.72/i586-alt-linux/snapd-glib
	UBSAN_OPTIONS=halt_on_error=1:abort_on_error=1:print_summary=1:print_stacktrace=1
	MSAN_OPTIONS=halt_on_error=1:abort_on_error=1:print_summary=1:print_stacktrace=1
	MALLOC_PERTURB_=157 ASAN_OPTIONS=halt_on_error=1:abort_on_error=1:print_summary=1
	/usr/src/RPM/BUILD/snapd-glib-1.72/i586-alt-linux/tests/test-glib
	stderr:
	ERROR:../tests/test-glib.c:4800:find_cancel_cb: assertion failed (error ==
	(g-io-error-quark, 19)): snapd returned no content type (snapd - error - quark, 4)
	(test program exited with status code -6)
	--
	Summary of Failures:
	3/4 snapd-glib:Tests		    ERROR	      0.93s   killed by signal 6 SIGABRT
	Ok:		   3

tomcat-taglibs-standard-0:1.2.5-alt1_12jpp11
	[ERROR] -> [Help 1]
	[ERROR]
	[ERROR] To see the full stack trace of the errors, re-run Maven with the -e switch.
	[ERROR] Re-run Maven using the -X switch to enable full debug logging.
	[ERROR]
	[ERROR] For more information about the errors and possible solutions, please read the
	following articles:
	[ERROR] [Help 1]
	http://cwiki.apache.org/confluence/display/MAVEN/PluginIncompatibleException
	error: Bad exit status from /usr/src/tmp/rpmb-tmp.11YIhF (%build)
	RPM build errors:
	Bad exit status from /usr/src/tmp/rpmb-tmp.11YIhF (%build)

treelayout-1.0.3-alt1_13jpp11
	[ERROR] -> [Help 1]
	[ERROR]
	[ERROR] To see the full stack trace of the errors, re-run Maven with the -e switch.
	[ERROR] Re-run Maven using the -X switch to enable full debug logging.
	[ERROR]
	[ERROR] For more information about the errors and possible solutions, please read the
	following articles:
	[ERROR] [Help 1]
	http://cwiki.apache.org/confluence/display/MAVEN/PluginIncompatibleException
	error: Bad exit status from /usr/src/tmp/rpmb-tmp.slnxIE (%build)
	RPM build errors:
	Bad exit status from /usr/src/tmp/rpmb-tmp.slnxIE (%build)

unbescape-1.1.6-alt1
	[ERROR] -> [Help 1]
	[ERROR]
	[ERROR] To see the full stack trace of the errors, re-run Maven with the -e switch.
	[ERROR] Re-run Maven using the -X switch to enable full debug logging.
	[ERROR]
	[ERROR] For more information about the errors and possible solutions, please read the
	following articles:
	[ERROR] [Help 1]
	http://cwiki.apache.org/confluence/display/MAVEN/PluginIncompatibleException
	error: Bad exit status from /usr/src/tmp/rpmb-tmp.IFNQIr (%build)
	RPM build errors:
	Bad exit status from /usr/src/tmp/rpmb-tmp.IFNQIr (%build)

wf-recorder-0.6.0-alt1
	[16/19] Compiling C++ object wf-recorder.p/src_frame-writer.cpp.o
	FAILED: [code=1] wf-recorder.p/src_frame-writer.cpp.o
	c++ -Iwf-recorder.p -I. -I.. -I/usr/include/libdrm -fdiagnostics-color=always
	-D_GLIBCXX_ASSERTIONS=1 -D_FILE_OFFSET_BITS=64 -Wall -Winvalid-pch -Wextra -std=c++17 -O2
	-g '-DWFRECORDER_VERSION="0.6.0"' -Wno-deprecated-declarations -pipe -frecord-gcc-switches
	-Wall -g -O2 -flto=auto -march=i586 -mtune=generic -D_REENTRANT -pthread -MD -MQ
	wf-recorder.p/src_frame-writer.cpp.o -MF wf-recorder.p/src_frame-writer.cpp.o.d -o
	wf-recorder.p/src_frame-writer.cpp.o -c ../src/frame-writer.cpp
	../src/frame-writer.cpp: In member function ‘AVPixelFormat
	FrameWriter::handle_buffersink_pix_fmt(const AVCodec*)’:
	../src/frame-writer.cpp:195:17: error: ‘const AVCodec’ {aka ‘const struct AVCodec’}
	has no member named ‘pix_fmts’
	195 |	  if (!codec->pix_fmts)
	../src/frame-writer.cpp:200:41: error: ‘const AVCodec’ {aka ‘const struct AVCodec’}
	has no member named ‘pix_fmts’
	200 |	  if (is_fmt_supported(in_fmt, codec->pix_fmts))
	../src/frame-writer.cpp:206:28: error: ‘const AVCodec’ {aka ‘const struct AVCodec’}
	has no member named ‘pix_fmts’
	206 |	  for (int i = 0; codec->pix_fmts[i] != AV_PIX_FMT_NONE; i++) {
	../src/frame-writer.cpp:209:20: error: ‘const AVCodec’ {aka ‘const struct AVCodec’}
	has no member named ‘pix_fmts’
	209 |		  codec->pix_fmts[i], in_fmt, false, &loss);
	../src/frame-writer.cpp: In function ‘uint64_t get_codec_channel_layout(const
	AVCodec*)’:
	../src/frame-writer.cpp:521:17: error: ‘const AVCodec’ {aka ‘const struct AVCodec’}
	has no member named ‘ch_layouts’
	521 |	  if (!codec->ch_layouts)
	../src/frame-writer.cpp:524:46: error: ‘const AVCodec’ {aka ‘const struct AVCodec’}
	has no member named ‘ch_layouts’
	524 |	      if (!av_channel_layout_check(&codec->ch_layouts[i]))
	../src/frame-writer.cpp:526:20: error: ‘const AVCodec’ {aka ‘const struct AVCodec’}
	has no member named ‘ch_layouts’
	526 |	      if (codec->ch_layouts[i].u.mask == AV_CH_LAYOUT_STEREO)
	../src/frame-writer.cpp:527:27: error: ‘const AVCodec’ {aka ‘const struct AVCodec’}
	has no member named ‘ch_layouts’
	527 |		  return codec->ch_layouts[i].u.mask;
	../src/frame-writer.cpp:530:19: error: ‘const AVCodec’ {aka ‘const struct AVCodec’}
	has no member named ‘ch_layouts’
	530 |	  return codec->ch_layouts[0].u.mask;

wl-screenrec-0.2.0-alt2
	For more information about an error, try `rustc --explain E0004`.
	error: could not compile `ffmpeg-next` (lib) due to 14 previous errors
	warning: build failed, waiting for other jobs to finish...

ws-commons-util-1:1.0.2-alt1_14jpp11
	[ERROR] -> [Help 1]
	[ERROR]
	[ERROR] To see the full stack trace of the errors, re-run Maven with the -e switch.
	[ERROR] Re-run Maven using the -X switch to enable full debug logging.
	[ERROR]
	[ERROR] For more information about the errors and possible solutions, please read the
	following articles:
	[ERROR] [Help 1]
	http://cwiki.apache.org/confluence/display/MAVEN/PluginIncompatibleException
	error: Bad exit status from /usr/src/tmp/rpmb-tmp.ZtYdhm (%build)
	RPM build errors:
	Bad exit status from /usr/src/tmp/rpmb-tmp.ZtYdhm (%build)

xfce4-power-manager-4.21.1-alt1
	[89/150] cc -Isrc/xfce4-power-manager.p -Isrc -I../src -I. -I.. -Iprotocols
	-I/usr/include/glib-2.0 -I/usr/lib/glib-2.0/include -I/usr/include/gio-unix-2.0
	-I/usr/include/gtk-3.0 -I/usr/include/pango-1.0 -I/usr/include/harfbuzz
	-I/usr/include/atk-1.0 -I/usr/include/cairo -I/usr/include/freetype2
	-I/usr/include/gdk-pixbuf-2.0 -I/usr/include/libpng16 -I/usr/include/xfce4/libxfce4ui-2
	-I/usr/include/xfce4/xfconf-0 -I/usr/include/xfce4 -I/usr/include/libupower-glib
	-I/usr/include/polkit-1 -fdiagnostics-color=always -D_FILE_OFFSET_BITS=64 -Wall
	-Winvalid-pch -Wextra -std=gnu11 -O2 -g -Wmissing-declarations -Wmissing-noreturn
	-Wold-style-definition -Wredundant-decls -Wpointer-arith -Wcast-align -Winit-self -Wshadow
	-Wmissing-include-dirs -Wundef -Wformat -Wformat-security -Wformat-y2k -Wnested-externs
	-Wno-unused-parameter -Wno-declaration-after-statement -Wno-missing-field-initializers
	-Werror=implicit-function-declaration -Wno-error=deprecated-declarations
	-DGLIB_VERSION_MIN_REQUIRED=GLIB_VERSION_2_72 -DGLIB_VERSION_MAX_ALLOWED=GLIB_VERSION_2_72
	-DG_LOG_USE_STRUCTURED=1 '-DPACKAGE="xfce4-power-manager"'
	'-DPACKAGE_NAME="xfce4-power-manager"' '-DPACKAGE_VERSION="4.21.1"'
	'-DVERSION="4.21.1"' '-DVERSION_SHORT="4.21"' '-DPACKAGE_STRING="xfce4-power-manager
	4.21.1"' '-DPACKAGE_DATADIR="/usr/share/xfce4-power-manager"'
	'-DCOPYRIGHT_YEAR="2025"' '-DPACKAGE_LOCALE_DIR="/usr/share/locale"'
	'-DPACKAGE_BUGREPORT="https://gitlab.xfce.org/xfce/xfce4-power-manager/-/issues"'
	'-DGETTEXT_PACKAGE="xfce4-power-manager"' '-DPREFIX="/usr"' '-DBINDIR="/usr/bin"'
	'-DDATADIR="/usr/share"' '-DINCLUDEDIR="/usr/include"' '-DLIBDIR="/usr/lib"'
	'-DLIBEXECDIR="/usr/lib"' '-DLOCALEDIR="/usr/share/locale"' '-DLOCALSTATEDIR="/var"'
	'-DSBINDIR="/usr/sbin"' '-DSYSCONFDIR="/etc"' -DHAVE_XFCE_REVISION_H=1
	-DENABLE_X11=1 -DHAVE_XF86XK_SUSPEND=1 -DHAVE_XF86XK_HIBERNATE=1 -DENABLE_WAYLAND=1
	-DHAVE_POLKIT=1 -DBACKEND_TYPE_LINUX=1 -DHAVE_SETSID=1 -DHAVE_SIGPROCMASK=1
	-DHAVE_SYS_PARAM_H=1 -DHAVE_SYS_RESOURCE_H=1 -DHAVE_SYS_STAT_H=1 -DHAVE_SYS_TYPES_H=1
	-DHAVE_SYS_USER_H=1 -DHAVE_SYS_WAIT_H=1 -DHAVE_ERRNO_H=1 -DHAVE_MATH_H=1
	-DHAVE_MEMORY_H=1 -DHAVE_STDLIB_H=1 -DHAVE_SIGNAL_H=1 -DHAVE_STRING_H=1
	-DHAVE_UNISTD_H=1 -pipe -frecord-gcc-switches -Wall -g -O2 -flto=auto
	-march=i586 -mtune=generic -pthread '-DG_LOG_DOMAIN="xfce4-power-manager"' -MD -MQ
	src/xfce4-power-manager.p/xfpm-button.c.o -MF src/xfce4-power-manager.p/xfpm-button.c.o.d
	-o src/xfce4-power-manager.p/xfpm-button.c.o -c ../src/xfpm-button.c
	FAILED: [code=1] src/xfce4-power-manager.p/xfpm-button.c.o
	cc -Isrc/xfce4-power-manager.p -Isrc -I../src -I. -I.. -Iprotocols
	-I/usr/include/glib-2.0 -I/usr/lib/glib-2.0/include -I/usr/include/gio-unix-2.0
	-I/usr/include/gtk-3.0 -I/usr/include/pango-1.0 -I/usr/include/harfbuzz
	-I/usr/include/atk-1.0 -I/usr/include/cairo -I/usr/include/freetype2
	-I/usr/include/gdk-pixbuf-2.0 -I/usr/include/libpng16 -I/usr/include/xfce4/libxfce4ui-2
	-I/usr/include/xfce4/xfconf-0 -I/usr/include/xfce4 -I/usr/include/libupower-glib
	-I/usr/include/polkit-1 -fdiagnostics-color=always -D_FILE_OFFSET_BITS=64 -Wall
	-Winvalid-pch -Wextra -std=gnu11 -O2 -g -Wmissing-declarations -Wmissing-noreturn
	-Wold-style-definition -Wredundant-decls -Wpointer-arith -Wcast-align -Winit-self -Wshadow
	-Wmissing-include-dirs -Wundef -Wformat -Wformat-security -Wformat-y2k -Wnested-externs
	-Wno-unused-parameter -Wno-declaration-after-statement -Wno-missing-field-initializers
	-Werror=implicit-function-declaration -Wno-error=deprecated-declarations
	-DGLIB_VERSION_MIN_REQUIRED=GLIB_VERSION_2_72 -DGLIB_VERSION_MAX_ALLOWED=GLIB_VERSION_2_72
	-DG_LOG_USE_STRUCTURED=1 '-DPACKAGE="xfce4-power-manager"'
	'-DPACKAGE_NAME="xfce4-power-manager"' '-DPACKAGE_VERSION="4.21.1"'
	'-DVERSION="4.21.1"' '-DVERSION_SHORT="4.21"' '-DPACKAGE_STRING="xfce4-power-manager
	4.21.1"' '-DPACKAGE_DATADIR="/usr/share/xfce4-power-manager"'
	'-DCOPYRIGHT_YEAR="2025"' '-DPACKAGE_LOCALE_DIR="/usr/share/locale"'
	'-DPACKAGE_BUGREPORT="https://gitlab.xfce.org/xfce/xfce4-power-manager/-/issues"'
	'-DGETTEXT_PACKAGE="xfce4-power-manager"' '-DPREFIX="/usr"' '-DBINDIR="/usr/bin"'
	'-DDATADIR="/usr/share"' '-DINCLUDEDIR="/usr/include"' '-DLIBDIR="/usr/lib"'
	'-DLIBEXECDIR="/usr/lib"' '-DLOCALEDIR="/usr/share/locale"' '-DLOCALSTATEDIR="/var"'
	'-DSBINDIR="/usr/sbin"' '-DSYSCONFDIR="/etc"' -DHAVE_XFCE_REVISION_H=1
	-DENABLE_X11=1 -DHAVE_XF86XK_SUSPEND=1 -DHAVE_XF86XK_HIBERNATE=1 -DENABLE_WAYLAND=1
	-DHAVE_POLKIT=1 -DBACKEND_TYPE_LINUX=1 -DHAVE_SETSID=1 -DHAVE_SIGPROCMASK=1
	-DHAVE_SYS_PARAM_H=1 -DHAVE_SYS_RESOURCE_H=1 -DHAVE_SYS_STAT_H=1 -DHAVE_SYS_TYPES_H=1
	-DHAVE_SYS_USER_H=1 -DHAVE_SYS_WAIT_H=1 -DHAVE_ERRNO_H=1 -DHAVE_MATH_H=1
	-DHAVE_MEMORY_H=1 -DHAVE_STDLIB_H=1 -DHAVE_SIGNAL_H=1 -DHAVE_STRING_H=1
	-DHAVE_UNISTD_H=1 -pipe -frecord-gcc-switches -Wall -g -O2 -flto=auto
	-march=i586 -mtune=generic -pthread '-DG_LOG_DOMAIN="xfce4-power-manager"' -MD -MQ
	src/xfce4-power-manager.p/xfpm-button.c.o -MF src/xfce4-power-manager.p/xfpm-button.c.o.d
	-o src/xfce4-power-manager.p/xfpm-button.c.o -c ../src/xfpm-button.c
	../src/xfpm-button.c:31:10: fatal error: common/xfpm-enum-types.h: No such file or
	directory
	31 | #include "common/xfpm-enum-types.h"

xmlstreambuffer-2.1.0-alt1
	[ERROR] -> [Help 1]
	[ERROR]
	[ERROR] To see the full stack trace of the errors, re-run Maven with the -e switch.
	[ERROR] Re-run Maven using the -X switch to enable full debug logging.
	[ERROR]
	[ERROR] For more information about the errors and possible solutions, please read the
	following articles:
	[ERROR] [Help 1]
	http://cwiki.apache.org/confluence/display/MAVEN/PluginIncompatibleException
	error: Bad exit status from /usr/src/tmp/rpmb-tmp.cljms6 (%build)
	RPM build errors:
	Bad exit status from /usr/src/tmp/rpmb-tmp.cljms6 (%build)

xmltool-0:3.3-alt4_28jpp11
	[ERROR] -> [Help 1]
	[ERROR]
	[ERROR] To see the full stack trace of the errors, re-run Maven with the -e switch.
	[ERROR] Re-run Maven using the -X switch to enable full debug logging.
	[ERROR]
	[ERROR] For more information about the errors and possible solutions, please read the
	following articles:
	[ERROR] [Help 1]
	http://cwiki.apache.org/confluence/display/MAVEN/PluginIncompatibleException
	error: Bad exit status from /usr/src/tmp/rpmb-tmp.M6dZTF (%build)
	RPM build errors:
	Bad exit status from /usr/src/tmp/rpmb-tmp.M6dZTF (%build)

xorg-docs-1:1.7.3-alt2
	file /usr/share/man/man1/pdfjadetex.1.xz conflicts between attempted installs of
	jadetex-3.13-alt4_17.noarch and texlive-collection-basic-2022-alt0_14.noarch
	hsh-install: Packages installation failed.

	31 error logs REMOVED from the list
dvdauthor-0.7.2-alt5.1
gem-google-cloud-env-2.3.1-alt1
gem-hotwater-0.1.2.1-alt0.1
gem-llhttp-ffi-0.5.1.16-alt0.1
gem-signet-0.21.0-alt1
generics-resolver-3.0.3-alt1
glpk-5.0-alt1_1
grpc-1.80.0-alt1.1
gucharmap7-2.32.1-alt1
kubetui-1.12.1-alt1
libmozjs140-140.13.0-alt1
libmozjs153-153.0-alt1
lombok-1.18.44-alt1
ltp-20220930-alt6
perl-POE-Component-SSLify-1.012-alt1_17
postgresql16-16.15-alt1
python3-module-alt-pytest-asyncio-0.9.5-alt1
python3-module-devpi-server-6.20.3-alt1
python3-module-flask-restx-1.3.2-alt1.1
python3-module-influxdb-5.3.2-alt2
python3-module-jupyter_server-2.20.0-alt1
python3-module-mdp-3.6.0.15.g64f14eee-alt6
python3-module-msgspec-0.21.1-alt1
python3-module-nose-of-yeti-2.4.9-alt2
python3-module-pdoc-16.0.0-alt1
python3-module-pytest-xdist-3.8.0-alt2
python3-module-textdistance-4.6.3-alt1
python3-module-tox-uv-bare-1.36.0-alt1
python3-module-webrtc-noise-gain-1.3.0-alt1
subversion-1.14.5-alt2
telepathy-qt5-0.9.8-alt3

Total 408 error logs.


^ permalink raw reply	[flat|nested] only message in thread

only message in thread, other threads:[~2026-09-05 11:56 UTC | newest]

Thread overview: (only message) (download: mbox.gz / follow: Atom feed)
-- links below jump to the message on this page --
2026-09-05 11:56 [cyber] I: Sisyphus-20260905 i586 beehive_status: +116 -31 (408) ALT beekeeper

ALT Linux Sisyphus cybertalk

This inbox may be cloned and mirrored by anyone:

	git clone --mirror http://lore.altlinux.org/sisyphus-cybertalk/0 sisyphus-cybertalk/git/0.git

	# If you have public-inbox 1.1+ installed, you may
	# initialize and index your mirror using the following commands:
	public-inbox-init -V2 sisyphus-cybertalk sisyphus-cybertalk/ http://lore.altlinux.org/sisyphus-cybertalk \
		sisyphus-cybertalk@lists.altlinux.org sisyphus-cybertalk@lists.altlinux.ru sisyphus-cybertalk@lists.altlinux.com
	public-inbox-index sisyphus-cybertalk

Example config snippet for mirrors.
Newsgroup available over NNTP:
	nntp://lore.altlinux.org/org.altlinux.lists.sisyphus-cybertalk


AGPL code for this site: git clone https://public-inbox.org/public-inbox.git