ALT Linux Sisyphus cybertalk
 help / color / mirror / Atom feed
* [cyber] I: p10-20260906 x86_64 beehive_status: +12 -17 (102)
@ 2026-09-06 20:54 ALT beekeeper
  0 siblings, 0 replies; only message in thread
From: ALT beekeeper @ 2026-09-06 20:54 UTC (permalink / raw)
  To: sisyphus-cybertalk

	12 NEW error logs

atlas-3.9.35-alt1.qa1
	make[2]: Leaving directory '/usr/src/RPM/BUILD/ATLAS/BUILD/bin'
	ERROR 845 DURING CACHE EDGE DETECTION!!.
	make[2]: Entering directory '/usr/src/RPM/BUILD/ATLAS/BUILD/bin'
	--
	gcc -V 2>&1  >> bin/INSTALL_LOG/ERROR.LOG
	x86_64-alt-linux-gcc: error: unrecognized command-line option '-V'
	x86_64-alt-linux-gcc: fatal error: no input files
	compilation terminated.
	--
	directory.  Be sure to include this file in any help request.
	cat: ../../CONFIG/error.txt: No such file or directory
	nu=1 ku=20,

btrfs-progs-6.3.1-alt1.P10.1
	0inputs+0outputs (0major+36420minor)pagefaults 0swaps
	Error: no exit code is found, failure.

dropbear-2022.83-alt2
	0inputs+0outputs (0major+37802minor)pagefaults 0swaps
	Error: no exit code is found, failure.

fsverity-utils-1.4-alt1
	0inputs+0outputs (0major+36865minor)pagefaults 0swaps
	Error: no exit code is found, failure.

kernel-image-un-def-1:6.1.186-alt1
	0inputs+0outputs (0major+35400minor)pagefaults 0swaps
	Error: no exit code is found, failure.

kernel-modules-dm-secdel-un-def-2:1.0.9-alt1.393658.1
	0inputs+0outputs (0major+36408minor)pagefaults 0swaps
	Error: no exit code is found, failure.

kernel-modules-ipt-so-std-def-1.0-alt9.330508.1
	0inputs+0outputs (0major+36295minor)pagefaults 0swaps
	Error: no exit code is found, failure.
	error: Bad exit status from /usr/src/tmp/rpm-tmp.31865 (%check)

perl-Crypt-Random-1.54-alt1
	There's a <1% chance that this data is random.
	# Failed test 1 in t/chisquare.t at line 39
	#  t/chisquare.t line 39 is:	 ok($chi =~ m/\>[1-9]/);
	--
	t/chisquare.t	   (Wstat: 0 Tests: 1 Failed: 1)
	Failed test:  1
	Files=6, Tests=21,  0 wallclock secs ( 0.02 usr  0.00 sys +  0.09 cusr	0.01 csys =
	0.12 CPU)
	Result: FAIL
	Failed 1/6 test programs. 1/21 subtests failed.
	make: *** [Makefile:794: test_dynamic] Error 255

perl-Gearman-2.004.015-alt1_5
	t/40-prefix.t ................... ok
	#   Failed test 'timeout'
	#   at /usr/share/perl5/Test/Timer.pm line 31.
	--
	# Looks like you failed 1 test of 10.
	#   Failed test 'wait with timeout'
	#   at t/50-wait_timeout.t line 65.
	--
	t/50-wait_timeout.t	      (Wstat: 256 Tests: 4 Failed: 1)
	Failed test:  3
	Non-zero exit status: 1
	--
	Result: FAIL
	Failed 1/24 test programs. 1/337 subtests failed.
	make: *** [Makefile:781: test_dynamic] Error 255

php8.2-pcntl-8.2.31-alt1
	0inputs+0outputs (0major+37276minor)pagefaults 0swaps
	Error: no exit code is found, failure.

psmisc-23.3-alt2
	0inputs+0outputs (0major+37471minor)pagefaults 0swaps
	Error: no exit code is found, failure.

tclx-1:8.4.4-alt1
	(but everything is probably ok)
	==== nice-1.5 nice tests FAILED
	==== Contents of test case:
	--
	23 23
	==== nice-1.5 FAILED
	pipe.test
	--
	profile.test
	==== profile-10.1 profile CPU time tests FAILED
	==== Contents of test case:
	--
	---- errorCode: NONE
	==== profile-10.1 FAILED
	==== profile-10.2 profile CPU time tests FAILED
	==== Contents of test case:
	--
	---- errorCode: NONE
	==== profile-10.2 FAILED
	==== profile-12.1 profile namespace tests FAILED
	==== Contents of test case:
	--
	---- errorCode: NONE
	==== profile-12.1 FAILED
	==== profile-12.2 profile namespace tests FAILED
	==== Contents of test case:
	--
	---- errorCode: NONE
	==== profile-12.2 FAILED
	==== profile-12.3 profile namespace tests FAILED

	17 error logs REMOVED from the list
bind-9.16.50-alt3
casr-2.12.1-alt0.p10.1
glibc-6:2.32-alt5.p10.7
kernel-image-std-def-2:5.10.264-alt1
kernel-image-un-def-1:6.1.182-alt1
kernel-modules-dm-secdel-un-def-2:1.0.9-alt1.393654.1
kernel-modules-ipt-so-std-def-1.0-alt9.330504.1
kernel-modules-lkrg-un-def-0.9.8-alt3.393654.1
litmus-0.14.0-alt1.git.9fbc73d
php7-7.4.33-alt1.p10.1
php8.1-pcntl-8.1.34-alt1
php8.3-pcntl-8.3.31-alt1
python3-module-mkdocs-1.4.0-alt1
python3-module-pyshark-0.6-alt2
python3-module-simple_timer-0.2-alt2
trace-cmd-3.1.6-alt2
tuned-2.22.1-alt1

Total 102 error logs.


^ permalink raw reply	[flat|nested] only message in thread

only message in thread, other threads:[~2026-09-06 20:54 UTC | newest]

Thread overview: (only message) (download: mbox.gz / follow: Atom feed)
-- links below jump to the message on this page --
2026-09-06 20:54 [cyber] I: p10-20260906 x86_64 beehive_status: +12 -17 (102) ALT beekeeper

ALT Linux Sisyphus cybertalk

This inbox may be cloned and mirrored by anyone:

	git clone --mirror http://lore.altlinux.org/sisyphus-cybertalk/0 sisyphus-cybertalk/git/0.git

	# If you have public-inbox 1.1+ installed, you may
	# initialize and index your mirror using the following commands:
	public-inbox-init -V2 sisyphus-cybertalk sisyphus-cybertalk/ http://lore.altlinux.org/sisyphus-cybertalk \
		sisyphus-cybertalk@lists.altlinux.org sisyphus-cybertalk@lists.altlinux.ru sisyphus-cybertalk@lists.altlinux.com
	public-inbox-index sisyphus-cybertalk

Example config snippet for mirrors.
Newsgroup available over NNTP:
	nntp://lore.altlinux.org/org.altlinux.lists.sisyphus-cybertalk


AGPL code for this site: git clone https://public-inbox.org/public-inbox.git