ALT Linux Sisyphus cybertalk
 help / color / mirror / Atom feed
* [cyber] I: Sisyphus-20260906 x86_64 beehive_status: +17 -30 (442)
@ 2026-09-06 14:35 ALT beekeeper
  0 siblings, 0 replies; only message in thread
From: ALT beekeeper @ 2026-09-06 14:35 UTC (permalink / raw)
  To: sisyphus-cybertalk

[-- Warning: decoded text below may be mangled, UTF-8 assumed --]
[-- Attachment #1: Type: text/plain; charset=unknown-8bit, Size: 11487 bytes --]

	17 NEW error logs

binwalk3-3.1.0-alt1
	test src/binwalk.rs - binwalk::Binwalk::analyze (line 639) ... ok
	test src/binwalk.rs - binwalk::Binwalk::extract (line 537) ... FAILED
	test src/binwalk.rs - binwalk::Binwalk (line 42) ... ok
	--
	thread 'main' (3327434) panicked at src/binwalk.rs:18:60:
	Unable to read file: Os { code: 2, kind: NotFound, message: "No such file or directory" }
	stack backtrace:
	--
	src/binwalk.rs - binwalk::Binwalk::extract (line 537)
	test result: FAILED. 28 passed; 1 failed; 3 ignored; 0 measured; 0 filtered out;
	finished in 0.74s
	error: doctest failed, to rerun pass `--doc`
	error: Bad exit status from /usr/src/tmp/rpmb-tmp.u0gpKH (%check)

edk2-20260201-alt1
	68 |   ParserBlackBox<CVfrDLGLexer, EfiVfrParser, ANTLRToken> VfrParser(File);
	Pccts/h/PBlackBox.h:88:14: error: no matching function for call to
	'ANTLRTokenBuffer::ANTLRTokenBuffer(CVfrDLGLexer*&)'
	88 |	   pipe = new ANTLRTokenBuffer(scan);
	--
	Pccts/h/ATokenBuffer.h:55:22: note: no known conversion for argument 1 from 'CVfrDLGLexer*'
	to 'const ANTLRTokenBuffer&'
	Pccts/h/PBlackBox.h:90:13: error: 'class CVfrDLGLexer' has no member named 'setToken'
	90 |	   scan->setToken(tok);

foundry-1.0.1-alt5
	Summary of Failures:
	8/8 foundry:test-settings		  TIMEOUT	 30.11s   killed by signal
	15 SIGTERM
	Ok:		   7
	Fail:		   0
	Timeout:	   1
	Full log written to
	/usr/src/RPM/BUILD/foundry-1.0.1/x86_64-alt-linux/meson-logs/testlog.txt
	error: Bad exit status from /usr/src/tmp/rpmb-tmp.W4SPTN (%check)
	RPM build errors:
	File /usr/src/RPM/SOURCES/foundry-1.0.1-alt.patch is smaller than 8 bytes
	Bad exit status from /usr/src/tmp/rpmb-tmp.W4SPTN (%check)

gambit-4.9.7-alt5
	make[4]: Leaving directory '/usr/src/RPM/BUILD/gambit-4.9.7/lib/_irregex'
	make[4]: Entering directory '/usr/src/RPM/BUILD/gambit-4.9.7/lib'
	LD_LIBRARY_PATH=../lib:../gsi:../gsc:
	../gsc/gsc -:~~bin=../bin,~~lib=../lib,~~include=../include -f -target js  -prelude
	"(define-cond-expand-feature|enable-type-checking|)(define-cond-expand-feature|disable-auto-forcing|)(define-cond-expand-feature|enable-sharp-dot|)(define-cond-expand-feature|enable-bignum|)(define-cond-expand-feature|enable-ratnum|)(define-cond-expand-feature|enable-cpxnum|)(define-cond-expand-feature|enable-s8vector|)(define-cond-expand-feature|enable-u16vector|)(define-cond-expand-feature|enable-s16vector|)(define-cond-expand-feature|enable-u32vector|)(define-cond-expand-feature|enable-s32vector|)(define-cond-expand-feature|enable-u64vector|)(define-cond-expand-feature|enable-s64vector|)(define-cond-expand-feature|enable-f32vector|)(define-cond-expand-feature|disable-smp|)(##include\"../lib/header.scm\")"
	-label-namespace "" -c -o _gambit.js ../lib/_univlib.scm
	make[4]: Leaving directory '/usr/src/RPM/BUILD/gambit-4.9.7/lib'
	make[2]: *** [makefile:546: modules-recursive] Error 2
	make[1]: *** [makefile:373: modules] Error 2
	make: *** [makefile:107: all] Error 2
	error: Bad exit status from /usr/src/tmp/rpmb-tmp.zKCzom (%build)
	RPM build errors:
	Bad exit status from /usr/src/tmp/rpmb-tmp.zKCzom (%build)

gem-ffi-1.17.0-alt2
	Wrote: /usr/src/in/nosrpm/gem-ffi-1.17.0-alt2.nosrc.rpm (w1.gzdio)
	error: failed build dependencies:
	gem(rbs) >= 4 conflicts with gem-ffi-1.17.0-alt2

gem-mutex-m-0.3.0-alt1
	Wrote: /usr/src/in/nosrpm/gem-mutex-m-0.3.0-alt1.nosrc.rpm (w1.gzdio)
	error: failed build dependencies:
	gem(rbs) >= 4 conflicts with gem-mutex-m-0.3.0-alt1

gem-solargraph-0.50.0-alt1.1
	Wrote: /usr/src/in/nosrpm/gem-solargraph-0.50.0-alt1.1.nosrc.rpm (w1.gzdio)
	error: failed build dependencies:
	gem(rbs) >= 4 conflicts with gem-solargraph-0.50.0-alt1.1

gem-turbo-rails-2.0.5-alt1
	gem-cuprite: Depends: gem(ferrum) (>= 0.17.0)
	E: Broken packages
	hsh-install: Failed to calculate package file list.

podman-tui-1.11.3-alt1
	^[[38;5;243m------------------------------^[[0m
	^[[38;5;9m• [FAILED] [0.004 seconds]^[[0m
	^[[0mvolume import ^[[38;5;9m^[[1m[It] import source^[[0m
	^[[38;5;243m/usr/src/RPM/BUILD/podman-tui-1.11.3/ui/volumes/voldialogs/import_test.go:88^[[0m
	^[[38;5;9m[FAILED] Expected
	<string>: ource.tar
	--
	^[[38;5;9m^[[1mFAIL!^[[0m -- ^[[38;5;10m^[[1m18 Passed^[[0m | ^[[38;5;9m^[[1m1 Failed^[[0m |
	^[[38;5;11m^[[1m0 Pending^[[0m | ^[[38;5;14m^[[1m1 Skipped^[[0m
	--- FAIL: TestVoldialogs (0.05s)
	FAIL

python3-module-isort-8.0.1-alt1
	>	    assert str(tmpdir.join("file2.py")) in out
	E	    AssertionError: assert
	'/usr/src/tmp/pytest-of-builder/pytest-0/test_command_line_True_0/file2.py' in 'Fixing
	/usr/src/tmp/pytest-of-builder/pytest-0/test_command_line_True_0/file1.py\n'
	E	     +	where
	'/usr/src/tmp/pytest-of-builder/pytest-0/test_command_line_True_0/file2.py' =
	str(local('/usr/src/tmp/pytest-of-builder/pytest-0/test_command_line_True_0/file2.py'))
	--
	SKIPPED [1] tests/unit/test_ticketed_features.py:242: Requires example_shared_isort_profile
	FAILED tests/unit/test_isort.py::test_command_line[True] - AssertionError: as...
	=================== 1 failed, 544 passed, 2 skipped in 3.79s ===================
	INFO	 : Command's result: FAILURE
	INFO	 : Command's error: Command '['python3', '-m', 'pytest', '-vra', 'tests/unit/']'
	returned non-zero exit status 1.
	error: Bad exit status from /usr/src/tmp/rpmb-tmp.USQ60B (%check)

python3-module-netbox-sdk-0.0.11-alt1
	raise AttributeError(attribute)
	E   AttributeError: __pydantic_core_schema__
	During handling of the above exception, another exception occurred:
	--
	=========================== short test summary info ============================
	FAILED
	tests/test_eval_harness.py::test_preview_then_write_is_distinguishable_from_writing_twice
	====== 1 failed, 1380 passed, 17 skipped, 2 warnings in 210.46s (0:03:30) ======
	INFO	 : Command's result: FAILURE
	INFO	 : Command's error: Command '['python3', '-m', 'pytest', '-k',
	'not ( \tTestDevHttpInputValidation or \ttest_parse_select_requires_value or
	\ttest_parse_columns_requires_value or \ttest_parse_max_columns_requires_value
	or \ttest_parse_max_columns_invalid or \ttest_parse_max_columns_zero_raises
	or \ttest_main_handles_unknown_command_without_traceback or
	\ttest_metadata_generation_rejects_source_version_mismatch or
	\ttest_metadata_generation_rejects_materially_different_same_version_ancestor
	or \ttest_release_commit_must_already_be_on_canonical_main or
	\ttest_immutable_tag_requires_exact_annotated_object_and_commit
	or \ttest_built_wheel_exposes_the_catalog_outside_the_checkout
	or \ttest_v46_typed_regeneration_matches_committed_artifact
	or \ttest_v47_typed_regeneration_matches_committed_artifact)',
	'--ignore=tests/test_gitea_release.py', '--ignore=tests/test_mcp.py',
	'--ignore=tests/test_mcp_connected_line.py', '--ignore=tests/test_mcp_plugin_bridge.py']'
	returned non-zero exit status 1.
	error: Bad exit status from /usr/src/tmp/rpmb-tmp.kSzdEE (%check)

python3-module-qtconsole-5.7.2-alt1.1
	raise ZMQError(ENOTSOCK)
	zmq.error.ZMQError: Socket operation on non-socket
	--------------------------- Captured stderr teardown ---------------------------
	[IPKernelApp] ERROR | Exception in message handler:
	Traceback (most recent call last):
	--
	raise ZMQError(ENOTSOCK)
	zmq.error.ZMQError: Socket operation on non-socket
	--------------------------- Captured stderr teardown ---------------------------
	[IPKernelApp] ERROR | Exception in message handler:
	Traceback (most recent call last):
	--
	raise ZMQError(ENOTSOCK)
	zmq.error.ZMQError: Socket operation on non-socket
	--------------------------- Captured stderr teardown ---------------------------
	[IPKernelApp] ERROR | Exception in message handler:
	Traceback (most recent call last):
	--
	raise ZMQError(ENOTSOCK)
	zmq.error.ZMQError: Socket operation on non-socket
	--------------------------- Captured stderr teardown ---------------------------
	[IPKernelApp] ERROR | Exception in message handler:
	Traceback (most recent call last):
	--
	raise ZMQError(ENOTSOCK)
	zmq.error.ZMQError: Socket operation on non-socket
	===Flaky Test Report===
	--
	=========================== short test summary info ============================
	FAILED qtconsole/tests/test_00_console_widget.py::test_input - pytestqt.excep...
	============== 1 failed, 46 passed, 1 skipped in 96.05s (0:01:36) ==============

python3-module-rapidfuzz-3.14.5-alt1
	=========================== short test summary info ============================
	FAILED tests/test_hypothesis.py::test_jaro_winkler_random - AssertionError
	======================== 1 failed, 387 passed in 22.94s ========================

python3-module-zict-3.0.0-alt1
	File "/usr/src/RPM/BUILD/python3-module-zict-3.0.0/zict/tests/utils_test.py", line 193,
	in check_different_keys_threadsafe
	f1.result()
	File "/usr/lib64/python3.14/concurrent/futures/_base.py", line 449, in result
	self._condition.wait(timeout)
	File "/usr/lib64/python3.14/threading.py", line 370, in wait
	waiter.acquire()
	+++++++++++++++++++++++++++++++++++ Timeout ++++++++++++++++++++++++++++++++++++
	error: Bad exit status from /usr/src/tmp/rpmb-tmp.USPWiZ (%check)
	RPM build errors:
	Bad exit status from /usr/src/tmp/rpmb-tmp.USPWiZ (%check)

qt5-pim-5.15-alt1
	make[3]: Leaving directory '/usr/src/RPM/BUILD/qt5-pim-5.15/build/tests/auto/contacts'
	make[2]: *** [Makefile:581: sub-contacts-check] Error 2
	make[2]: Leaving directory '/usr/src/RPM/BUILD/qt5-pim-5.15/build/tests/auto'
	make[1]: *** [Makefile:369: sub-auto-check] Error 2
	make[1]: Leaving directory '/usr/src/RPM/BUILD/qt5-pim-5.15/build/tests'
	make: *** [Makefile:438: sub-tests-check] Error 2
	make: Leaving directory '/usr/src/RPM/BUILD/qt5-pim-5.15/build'
	error: Bad exit status from /usr/src/tmp/rpmb-tmp.If2MgY (%check)
	RPM build errors:
	Bad exit status from /usr/src/tmp/rpmb-tmp.If2MgY (%check)

rustconn-0.19.3-alt1
	properties::encrypted_file_backend_tests::delete_one_entry_leaves_others_intact
	test result: FAILED. 1462 passed; 1 failed; 0 ignored; 0 measured; 0 filtered out;
	finished in 12.76s
	error: test failed, to rerun pass `-p rustconn-core --test property_tests`
	Running unittests src/lib.rs (target/release/deps/rustconn_pty_sys-cbc1d16ceef50680)
	--
	test result: ok. 0 passed; 0 failed; 0 ignored; 0 measured; 0 filtered out; finished
	in 0.00s
	error: 1 target failed:
	`-p rustconn-core --test property_tests`

selenium-4.38.0-alt1
	Wrote: /usr/src/in/nosrpm/selenium-4.38.0-alt1.nosrc.rpm (w1.gzdio)
	error: failed build dependencies:
	gem(steep) >= 2 conflicts with selenium-4.38.0-alt1

	30 error logs REMOVED from the list
SimplyHTML-0.19.2-alt1
basilisk-1:2025.10.10-alt1
casr-2.13.1-alt2
codex-0.146.0-alt1
dufs-0.46.0-alt1
gem-ferrum-0.17.1-alt1
gem-goodcheck-3.1.0.30-alt1
gem-rbs-3.9.4-alt1
gem-rmagick-6.1.4-alt1
gem-rubocop-on-rbs-1.8.0-alt1
gnuplot-1:6.0.4-alt1
jaranalyzer-0:1.2-alt1_0jpp6
javahelp2-0:2.0.05-alt6
libfprint2-1.94.100-alt1
lightningview-3.0.0-alt1
lore-0.8.6-alt1
mnemonicsetter-0.6-alt1
mplayer-1.5-alt3.g567631e
openmotif-2.3.8-alt3
pcsx2-2.8.1-alt1
perl-Tie-DBI-1.08-alt1
php8.2-8.2.33-alt1
python3-module-crosshair-tool-0.0.110-alt1
python3-module-graphene-django-3.2.3-alt2
python3-module-httpdbg-2.1.8-alt1
python3-module-oscrypto-1.3.0-alt1.1
python3-module-paho-2.1.0-alt2
snapd-glib-2-1.72-alt1
telepathy-qt5-0.9.8-alt3
tuxclocker-1.5.1-alt3

Total 442 error logs.


^ permalink raw reply	[flat|nested] only message in thread

only message in thread, other threads:[~2026-09-06 14:35 UTC | newest]

Thread overview: (only message) (download: mbox.gz / follow: Atom feed)
-- links below jump to the message on this page --
2026-09-06 14:35 [cyber] I: Sisyphus-20260906 x86_64 beehive_status: +17 -30 (442) ALT beekeeper

ALT Linux Sisyphus cybertalk

This inbox may be cloned and mirrored by anyone:

	git clone --mirror http://lore.altlinux.org/sisyphus-cybertalk/0 sisyphus-cybertalk/git/0.git

	# If you have public-inbox 1.1+ installed, you may
	# initialize and index your mirror using the following commands:
	public-inbox-init -V2 sisyphus-cybertalk sisyphus-cybertalk/ http://lore.altlinux.org/sisyphus-cybertalk \
		sisyphus-cybertalk@lists.altlinux.org sisyphus-cybertalk@lists.altlinux.ru sisyphus-cybertalk@lists.altlinux.com
	public-inbox-index sisyphus-cybertalk

Example config snippet for mirrors.
Newsgroup available over NNTP:
	nntp://lore.altlinux.org/org.altlinux.lists.sisyphus-cybertalk


AGPL code for this site: git clone https://public-inbox.org/public-inbox.git