* [cyber] I: p11-20260906 x86_64 beehive_status: +13 -5 (97)
@ 2026-09-06 7:05 ALT beekeeper
0 siblings, 0 replies; only message in thread
From: ALT beekeeper @ 2026-09-06 7:05 UTC (permalink / raw)
To: sisyphus-cybertalk
[-- Warning: decoded text below may be mangled, UTF-8 assumed --]
[-- Attachment #1: Type: text/plain; charset=unknown-8bit, Size: 9593 bytes --]
13 NEW error logs
doctest-2.4.11-alt2
155/155 Test #155: playground_junit ........................... Passed 0.01 sec
99% tests passed, 1 tests failed out of 155
Total Test time (real) = 1.13 sec
The following tests FAILED:
121 - order_1 (Failed)
givaro-4.2.0-alt3
Parsing file /usr/src/RPM/BUILD/givaro-4.2.0/src/kernel/gmp++/gmp++_int_div.C...
Preprocessing /usr/src/RPM/BUILD/givaro-4.2.0/src/kernel/gmp++/gmp++_int_gcd.C...
Parsing file /usr/src/RPM/BUILD/givaro-4.2.0/src/kernel/gmp++/gmp++_int_gcd.C...
Pmake[1]: *** [Makefile:496: docs] Segmentation fault
make[1]: Leaving directory '/usr/src/RPM/BUILD/givaro-4.2.0/docs'
make: *** [Makefile:606: install-recursive] Error 1
make: Leaving directory '/usr/src/RPM/BUILD/givaro-4.2.0'
error: Bad exit status from /usr/src/tmp/rpmb-tmp.e2Sxac (%install)
RPM build errors:
Bad exit status from /usr/src/tmp/rpmb-tmp.e2Sxac (%install)
gz-gui-10.0.0-alt2
54/54 Test #54: check_INTEGRATION_transport_scene_manager ... Passed 0.01 sec
94% tests passed, 3 tests failed out of 54
Total Test time (real) = 112.52 sec
The following tests FAILED:
1 - UNIT_Application_TEST (Subprocess aborted)
--
0inputs+0outputs (0major+12863572minor)pagefaults 0swaps
hasher-privd: parent: handle_io: idle time limit (3600 seconds) exceeded
gz-sim-10.1.0-alt1
236/236 Test #236: check_PERFORMANCE_level_manager ........................ Passed
0.01 sec
99% tests passed, 1 tests failed out of 236
Total Test time (real) = 524.88 sec
The following tests FAILED:
107 - INTEGRATION_entity_system (Failed)
--
0inputs+0outputs (0major+52695922minor)pagefaults 0swaps
hasher-privd: parent: handle_io: idle time limit (3600 seconds) exceeded
libcacard-2.8.1-alt1
# libcacard-DEBUG: vreader_xfr_bytes: status=27013 sw1=0x69 sw2=0x85 len=0 (total=2)
not ok /hw-tests/decipher - ERROR:../tests/hwtests.c:148:do_login: assertion failed
(pbRecvBuffer[0] == VCARD7816_SW1_SUCCESS): (0x00000069 == 0x00000090)
Bail out!
stderr:
ERROR:../tests/hwtests.c:148:do_login: assertion failed (pbRecvBuffer[0] ==
VCARD7816_SW1_SUCCESS): (0x00000069 == 0x00000090)
7/8 libcacard OK 0.02s
--
Full log written to
/usr/src/RPM/BUILD/libcacard-2.8.1/x86_64-alt-linux/meson-logs/testlog.txt
FAILED: meson-internal__test
/usr/bin/meson test --no-rebuild --print-errorlogs
litmus-0.14.0-alt2.git.9fbc73d
checking for a BSD-compatible install... /usr/bin/ginstall -c
./configure: line 3491: syntax error near unexpected token `0,'
./configure: line 3491: `NE_REQUIRE_VERSIONS(0, 26 27 28 29 30 31 32)'
nushell-0.114.1-alt1
commands::network::port::port_with_already_usage
test result: FAILED. 2455 passed; 1 failed; 28 ignored; 0 filtered out; across 9 groups,
finished in 36.18s
error: test failed, to rerun pass `-p nu-command --test tests`
Caused by:
podman-tui-1.11.3-alt1
^[[38;5;243m------------------------------^[[0m
^[[38;5;9m• [FAILED] [0.001 seconds]^[[0m
^[[0mprogress bar dialog ^[[38;5;9m^[[1m[It] progress value^[[0m
^[[38;5;243m/usr/src/RPM/BUILD/podman-tui-1.11.3/ui/dialogs/progress_test.go:74^[[0m
^[[38;5;9m[FAILED] Expected
<int>: 1
--
^[[38;5;9m^[[1mFAIL!^[[0m -- ^[[38;5;10m^[[1m51 Passed^[[0m | ^[[38;5;9m^[[1m1 Failed^[[0m |
^[[38;5;11m^[[1m0 Pending^[[0m | ^[[38;5;14m^[[1m1 Skipped^[[0m
--- FAIL: TestDialogs (0.02s)
FAIL
python3-module-aiohttp-3.14.1-alt0.p11.1
==================================== ERRORS ====================================
_____________ ERROR at teardown of test_release_not_opened[pyloop] _____________
[gw32] linux -- Python 3.12.13
/usr/src/RPM/BUILD/python3-module-aiohttp-3.14.1/.run_venv/bin/python3
--
SKIPPED [1] tests/test_multipart_helpers.py:99: need more smart parser which respects
quoted text
SKIPPED [1] tests/test_multipart_helpers.py:446: should raise decoding error: %82 is
invalid for latin1
SKIPPED [1] tests/test_multipart_helpers.py:455: should raise decoding error: %E4 is
invalid for utf-8
SKIPPED [1] tests/test_multipart_helpers.py:510: urllib.parse.unquote is tolerate to
standalone % chars
--
XFAIL
tests/test_http_parser.py::test_http_request_parser_utf8_request_line[c-parser-pyloop]
- Regression test for Py parser. May match C behaviour later.
ERROR tests/test_connector.py::test_release_not_opened[pyloop] - pytest.Pytes...
FAILED tests/test_connector.py::test_release_not_started[pyloop] - assert 403...
== 1 failed, 4678 passed, 25 skipped, 5 xfailed, 1 error in 93.61s (0:01:33) ===
INFO : Command's result: FAILURE
INFO : Command's error: Command '['pytest', '-m', 'not dev_mode and not
internal', '-vra', '-o=addopts=', '-n', 'auto', '--ignore=tests/autobahn',
'--ignore=tests/test_proxy_functional.py', '--ignore-glob=tests/test_benchmarks_*',
'--deselect=tests/test_web_functional.py::test_keepalive_expires_on_time', 'tests']'
returned non-zero exit status 1.
error: Bad exit status from /usr/src/tmp/rpmb-tmp.96iKAN (%check)
python3-module-hid-tools-0.9-alt1
> source = self.uhid_device.hidraw_nodes[0]\r
E IndexError: list index out of range\r
tests/test_cli_decode.py:263: IndexError\r
=========================== short test summary info ============================\r
FAILED tests/test_cli_decode.py::TestHidrawSysfsReportDescriptor::test_pass_hidraw\r
======================== 1 failed, 460 passed in 2.41s =========================\r
INFO : Command's result: FAILURE\r
INFO : Command's error: Command '['python3', '-m', 'pytest', '-vra', 'tests']'
returned non-zero exit status 1.\r
7.80user 14.65system 0:08.91elapsed 252%CPU (0avgtext+0avgdata 13657644maxresident)k
python3-module-sanic-25.3.0-alt1
tests/test_cli.py .....................................................
hasher-privd: parent: handle_io: idle time limit (3600 seconds) exceeded
tbb-2022.1.0-alt1.2
138/138 Test #138: test_malloc_new_handler .................. Passed 0.00 sec
99% tests passed, 1 tests failed out of 138
Total Test time (real) = 114.70 sec
The following tests FAILED:
25 - test_task_arena (Failed)
zstd-1.5.5-alt2
test209 : thread pool API tests :
thread pool test : threadPool re-use roundtrips: OK
thread pool test : threadPool simultaneous usage: OK
thread pool tests OK
1 \r 18 \r 41 \r 63 \r 66 \r 71
\r 99 \r 116 \r 119 \r 134 \r 144 \r
175 \r 204 \r 217 \r 239 \r 250 \r 269
\r 300 \r 310 \r 367 \r 384 \r 401 \r
437 \r 441 \r 453 \r 469 \r 490 \r 501
\r 514 \r 519 \r 522 \r 551 \r 573 \r
587 \r 608 \r 619 \r 637 \r 663 \r 678
\r 685 \r 691 \r 715 \r 752 \r 755 \r
772 \r 786 \r 803 \r 810 \r 812 \r 816
\r 829 \r 846 \r 870 \r 877 \r 883 \r
892 \r 902 \r 920 \r 943 \r 956 \r 965
\r 996 \r 1009 \r 1013 \r 1024 \r 1041 \r
1044 \r 1049 \r 1074 \r 1087 \r 1100 \r
1106 \r 1126 \r 1133 \r 1143 \r 1175 \r
1183 \r 1196 \r 1215 \r 1222 \r 1232 \r
1248 \r 1250 \r 1261 \r 1266 \r 1278 \r
1288 \r 1301 \r 1310 \r 1331 \r 1334 \r
1342 \r 1346 \r 1365 \r 1377 \r 1394 \r
1401 \r 1412 \r 1431 \r 1433 \r 1448 \r
1454 \r 1457 \r 1465 \r 1474 \r 1477 \r
1486 \r 1497 \r 1513 \r 1529 \r 1550 \r
1552 \r 1558 \r 1561 \r 1583 \r 1613 \r
1624 \r 1639 \r 1641 \r 1666 \r 1669 \r
1688 \r 1703 \r 1736 \r 1742 \r 1746 \r
1754 \r 1762 \r 1777 \r 1802 \r 1815 \r
1817 \r 1835 \r 1859 \r 1864 \r 1885 \r
1907 \r 1931 \r 1941 \r 1957 \r 1960 \r
1987 \r 2007 \r 2012 \r 2032 \r 2045 \r
2063 \r 2076 \r 2087 \r 2088 \r 2092 \r
2098 \r 2105 \r 2108 \r 2128 \r 2145 \r
2162 \r 2171 \r 2188 \r 2203 \r 2215 \r
2248 \r 2269 \r 2287 \r 2289 \r 2305 \r
2328 \r 2338 \r 2345 \r 2381 \r 2400 \r
2415 \r 2427 \r 2445 \r 2466 \r 2467 \r
2489 \r 2507 \r 2521 \r 2528 \r 2552 \r
2563 \r 2584 \r 2596 \r 2611 \r 2626 \r
2628 \r 2648 \r 2659 \r 2681 \r 2687 \r
2688 \r 2706 \r 2721 \r 2737 \r 2761 \r
2803 \r 2815 \r 2841 \r 2855 \r 2864 \r
2883 \r 2900 \r 2905 \r 2915 \r 2934 \r
2946 \r 2963 \r 2980 \r 3005 \r 3036 \r
3056 \r 3077 \r 3083 \r 3102 \r 3106 \r
3143 \r 3161 \r 3175 \r 3178 \r 3186 \r
3207 \r 3229 \r 3252 \r 3256 \r 3270 \r
3273 \r 3307 \r 3310 \r 3335 \r 3365 \r
3379 \r 3400 \r 3409 \r 3422 \r 3441 \r
3456 \r 3470 \r 3472 \r 3499 \r 3506
make: Leaving directory '/usr/src/RPM/BUILD/zstd-1.5.5-alt2/tests'
make: Target 'test' not remade because of errors.
error: Bad exit status from /usr/src/tmp/rpmb-tmp.aFlEgP (%check)
RPM build errors:
Bad exit status from /usr/src/tmp/rpmb-tmp.aFlEgP (%check)
5 error logs REMOVED from the list
kernel-modules-aic8800-6.18-0.0.40.3a09-alt2.397864.1
libdesock-2.0-alt1
openblas-0.3.27-alt1
python3-module-loky-3.5.6-alt1.1
qemu-9.1.2-alt1
Total 97 error logs.
^ permalink raw reply [flat|nested] only message in thread
only message in thread, other threads:[~2026-09-06 7:05 UTC | newest]
Thread overview: (only message) (download: mbox.gz / follow: Atom feed)
-- links below jump to the message on this page --
2026-09-06 7:05 [cyber] I: p11-20260906 x86_64 beehive_status: +13 -5 (97) ALT beekeeper
ALT Linux Sisyphus cybertalk
This inbox may be cloned and mirrored by anyone:
git clone --mirror http://lore.altlinux.org/sisyphus-cybertalk/0 sisyphus-cybertalk/git/0.git
# If you have public-inbox 1.1+ installed, you may
# initialize and index your mirror using the following commands:
public-inbox-init -V2 sisyphus-cybertalk sisyphus-cybertalk/ http://lore.altlinux.org/sisyphus-cybertalk \
sisyphus-cybertalk@lists.altlinux.org sisyphus-cybertalk@lists.altlinux.ru sisyphus-cybertalk@lists.altlinux.com
public-inbox-index sisyphus-cybertalk
Example config snippet for mirrors.
Newsgroup available over NNTP:
nntp://lore.altlinux.org/org.altlinux.lists.sisyphus-cybertalk
AGPL code for this site: git clone https://public-inbox.org/public-inbox.git