ALT Linux Sisyphus cybertalk
 help / color / mirror / Atom feed
* [cyber] I: p10-20260712 x86_64 beehive_status: +22 -16 (101)
@ 2026-07-12 16:38 ALT beekeeper
  0 siblings, 0 replies; only message in thread
From: ALT beekeeper @ 2026-07-12 16:38 UTC (permalink / raw)
  To: sisyphus-cybertalk

[-- Warning: decoded text below may be mangled, UTF-8 assumed --]
[-- Attachment #1: Type: text/plain; charset=unknown-8bit, Size: 16913 bytes --]

	22 NEW error logs

SNNS-4.3-alt1.1.1.1
	make[1]: Entering directory '/usr/src/RPM/BUILD/SNNSv4.3/tools/sources'
	x86_64-alt-linux-gcc   snnsbat.o ../../kernel/sources/libkernel.a
	../../kernel/sources/libfunc.a -lm -lfl  -o snnsbat
	ld: snnsbat.o: in function `main':
	/usr/src/RPM/BUILD/SNNSv4.3/tools/sources/snnsbat.c:1785: warning: the use of `tempnam'
	is dangerous, better use `mkstemp'
	make[1]: Leaving directory '/usr/src/RPM/BUILD/SNNSv4.3/tools/sources'
	make[1]: Entering directory '/usr/src/RPM/BUILD/SNNSv4.3/tools/sources'
	x86_64-alt-linux-gcc   batchman.o gram1.tab.o lex.yyz.o icopjmp.o ictab.o symtab.o
	backpatch.o memory.o ic_snns.o error.o arglist.o snns_intfce.o special_jacket.o lex.yyy.o
	../../kernel/sources/libkernel.a ../../kernel/sources/libfunc.a -lm -lfl  -o batchman
	ld: ic_snns.o: in function `pruneNet':
	/usr/src/RPM/BUILD/SNNSv4.3/tools/sources/ic_snns.c:1770: warning: the use of `tempnam'
	is dangerous, better use `mkstemp'
	make[1]: Leaving directory '/usr/src/RPM/BUILD/SNNSv4.3/tools/sources'

btrfs-progs-6.3.1-alt1.P10.1
	0inputs+0outputs (0major+37139minor)pagefaults 0swaps
	Error: no exit code is found, failure.

dropbear-2022.83-alt2
	0inputs+0outputs (0major+38820minor)pagefaults 0swaps
	Error: no exit code is found, failure.

fscrypt-0.3.0.0.5.e479779-alt1
	make: Entering directory '/usr/src/RPM/BUILD/fscrypt-0.3.0.0.5.e479779'
	make: git: No such file or directory
	make: Leaving directory '/usr/src/RPM/BUILD/fscrypt-0.3.0.0.5.e479779'
	--
	make: Entering directory '/usr/src/RPM/BUILD/fscrypt-0.3.0.0.5.e479779'
	make: git: No such file or directory
	make: Leaving directory '/usr/src/RPM/BUILD/fscrypt-0.3.0.0.5.e479779'
	--
	0inputs+0outputs (0major+36954minor)pagefaults 0swaps
	Error: no exit code is found, failure.

gettext-0.21-alt1
	# SKIP:  23
	# XFAIL: 0
	# FAIL:  0
	# XPASS: 0
	# ERROR: 0
	make[7]: Leaving directory '/usr/src/RPM/BUILD/gettext-0.21/gettext-tools/gnulib-tests'

ima-evm-utils-1.3.2-alt1
	0inputs+0outputs (0major+35579minor)pagefaults 0swaps
	Error: no exit code is found, failure.

kernel-image-rt-5.10.255-alt1.rt151
	0inputs+0outputs (0major+35439minor)pagefaults 0swaps
	Error: no exit code is found, failure.

kernel-image-xenomai-4.19.252-alt1.cip78.23
	[    4.411582] PEAK-Dongle: Please specify type=epp or type=sp
	[    4.417011] ERROR! No devices specified! Use io=<port1>[,...] irq=<irq1>[,...]
	[    4.419741] ERROR! No devices specified! Use mem=<port1>[,...] irq=<irq1>[,...]
	init: glob: 9p mount_tag not found (ret: 3): File exists
	--
	0inputs+0outputs (0major+36135minor)pagefaults 0swaps
	Error: no exit code is found, failure.

kernel-modules-dm-secdel-std-def-2:1.0.9-alt1.330498.1
	0inputs+0outputs (0major+36784minor)pagefaults 0swaps
	Error: no exit code is found, failure.

kernel-modules-ipt-so-std-def-1.0-alt9.330498.1
	0inputs+0outputs (0major+35847minor)pagefaults 0swaps
	Error: no exit code is found, failure.
	error: Bad exit status from /usr/src/tmp/rpm-tmp.62070 (%check)

kernel-modules-lkrg-un-def-0.9.8-alt3.393647.1
	0inputs+0outputs (0major+35742minor)pagefaults 0swaps
	Error: no exit code is found, failure.
	+ exit 1

litmus-0.14.0-alt1.git.9fbc73d
	checking for a BSD-compatible install... /bin/install -c
	./configure: line 2846: syntax error near unexpected token `0,'
	./configure: line 2846: `NE_REQUIRE_VERSIONS(0, 26 27 28 29 30 31)'

openblas-0.3.23-alt1.2
	gemv.c: In function 'sgemv_':
	gemv.c:229:29: error: 'GEMM_MULTITHREAD_THRESHOLD' undeclared (first use in this function)
	229 |	if ( 1L * m * n < 2304L * GEMM_MULTITHREAD_THRESHOLD )
	--
	ger.c: In function 'sger_':
	ger.c:167:49: error: 'GEMM_MULTITHREAD_THRESHOLD' undeclared (first use in this function)
	167 |	if (incx == 1 && incy == 1 && 1L*m*n <= 2048 *GEMM_MULTITHREAD_THRESHOLD) {
	--
	gemv.c: In function 'cblas_sgemv':
	gemv.c:229:29: error: 'GEMM_MULTITHREAD_THRESHOLD' undeclared (first use in this function)
	229 |	if ( 1L * m * n < 2304L * GEMM_MULTITHREAD_THRESHOLD )
	--
	ger.c: In function 'cblas_sger':
	ger.c:167:49: error: 'GEMM_MULTITHREAD_THRESHOLD' undeclared (first use in this function)
	167 |	if (incx == 1 && incy == 1 && 1L*m*n <= 2048 *GEMM_MULTITHREAD_THRESHOLD) {

partclone-0.3.17-alt1
	0inputs+0outputs (0major+36092minor)pagefaults 0swaps
	Error: no exit code is found, failure.
	+ for fname in *.log
	--
	+ cat '*.log'
	cat: '*.log': No such file or directory

php8.1-pcntl-8.1.34-alt1
	0inputs+0outputs (0major+37592minor)pagefaults 0swaps
	Error: no exit code is found, failure.

php8.2-pcntl-8.2.31-alt1
	0inputs+0outputs (0major+36282minor)pagefaults 0swaps
	Error: no exit code is found, failure.

psmisc-23.3-alt2
	0inputs+0outputs (0major+35451minor)pagefaults 0swaps
	Error: no exit code is found, failure.

python3-module-openstackclient-6.2.0-alt0.p10
	- Worker 246 (3 tests) => 0:00:00.110285
	- Worker 247 (4 tests) => 0:00:00.075376
	- Worker 248 (3 tests) => 0:00:00.091521
	- Worker 249 (4 tests) => 0:00:00.063459
	- Worker 250 (5 tests) => 0:00:00.051483
	- Worker 251 (11 tests) => 0:00:00.098542
	- Worker 252 (10 tests) => 0:00:01.279006
	- Worker 253 (3 tests) => 0:00:00.090250
	- Worker 254 (7 tests) => 0:00:00.080399
	- Worker 255 (12 tests) => 0:00:00.095868

python3-module-pyside6-6.4.2-alt2.p10.1
	[2023/2092] cd
	/usr/src/RPM/BUILD/pyside-setup-opensource-6.4.2/x86_64-alt-linux/sources/pyside6/PySide6/QtGui
	&& /usr/bin/cmake -E env
	LD_LIBRARY_PATH=/usr/src/RPM/BUILD/pyside-setup-opensource-6.4.2/x86_64-alt-linux/sources/pyside6/libpyside:/usr/src/RPM/BUILD/pyside-setup-opensource-6.4.2/x86_64-alt-linux/sources/pyside6/libpysideqml:/usr/src/RPM/BUILD/pyside-setup-opensource-6.4.2/x86_64-alt-linux/sources/shiboken6/libshiboken
	python3
	/usr/src/RPM/BUILD/pyside-setup-opensource-6.4.2/sources/pyside6/PySide6/QtGui/../support/generate_pyi.py
	QtGui --sys-path
	/usr/src/RPM/BUILD/pyside-setup-opensource-6.4.2/x86_64-alt-linux/sources/pyside6
	/usr/src/RPM/BUILD/pyside-setup-opensource-6.4.2/x86_64-alt-linux/sources/shiboken6/shibokenmodule/..
	FAILED: sources/pyside6/PySide6/QtGui/CMakeFiles/QtGui_pyi
	/usr/src/RPM/BUILD/pyside-setup-opensource-6.4.2/x86_64-alt-linux/sources/pyside6/PySide6/QtGui/CMakeFiles/QtGui_pyi
	cd
	/usr/src/RPM/BUILD/pyside-setup-opensource-6.4.2/x86_64-alt-linux/sources/pyside6/PySide6/QtGui
	&& /usr/bin/cmake -E env
	LD_LIBRARY_PATH=/usr/src/RPM/BUILD/pyside-setup-opensource-6.4.2/x86_64-alt-linux/sources/pyside6/libpyside:/usr/src/RPM/BUILD/pyside-setup-opensource-6.4.2/x86_64-alt-linux/sources/pyside6/libpysideqml:/usr/src/RPM/BUILD/pyside-setup-opensource-6.4.2/x86_64-alt-linux/sources/shiboken6/libshiboken
	python3
	/usr/src/RPM/BUILD/pyside-setup-opensource-6.4.2/sources/pyside6/PySide6/QtGui/../support/generate_pyi.py
	QtGui --sys-path
	/usr/src/RPM/BUILD/pyside-setup-opensource-6.4.2/x86_64-alt-linux/sources/pyside6
	/usr/src/RPM/BUILD/pyside-setup-opensource-6.4.2/x86_64-alt-linux/sources/shiboken6/shibokenmodule/..
	--
	from shiboken6.Shiboken import *
	ImportError:
	/usr/src/RPM/BUILD/pyside-setup-opensource-6.4.2/x86_64-alt-linux/sources/shiboken6/Shiboken.abi3.so:
	file too short
	[2024/2092] cd
	/usr/src/RPM/BUILD/pyside-setup-opensource-6.4.2/x86_64-alt-linux/sources/pyside6/PySide6/QtCore
	&& /usr/bin/cmake -E env
	LD_LIBRARY_PATH=/usr/src/RPM/BUILD/pyside-setup-opensource-6.4.2/x86_64-alt-linux/sources/pyside6/libpyside:/usr/src/RPM/BUILD/pyside-setup-opensource-6.4.2/x86_64-alt-linux/sources/pyside6/libpysideqml:/usr/src/RPM/BUILD/pyside-setup-opensource-6.4.2/x86_64-alt-linux/sources/shiboken6/libshiboken
	python3
	/usr/src/RPM/BUILD/pyside-setup-opensource-6.4.2/sources/pyside6/PySide6/QtCore/../support/generate_pyi.py
	QtCore --sys-path
	/usr/src/RPM/BUILD/pyside-setup-opensource-6.4.2/x86_64-alt-linux/sources/pyside6
	/usr/src/RPM/BUILD/pyside-setup-opensource-6.4.2/x86_64-alt-linux/sources/shiboken6/shibokenmodule/..
	FAILED: sources/pyside6/PySide6/QtCore/CMakeFiles/QtCore_pyi
	/usr/src/RPM/BUILD/pyside-setup-opensource-6.4.2/x86_64-alt-linux/sources/pyside6/PySide6/QtCore/CMakeFiles/QtCore_pyi
	cd
	/usr/src/RPM/BUILD/pyside-setup-opensource-6.4.2/x86_64-alt-linux/sources/pyside6/PySide6/QtCore
	&& /usr/bin/cmake -E env
	LD_LIBRARY_PATH=/usr/src/RPM/BUILD/pyside-setup-opensource-6.4.2/x86_64-alt-linux/sources/pyside6/libpyside:/usr/src/RPM/BUILD/pyside-setup-opensource-6.4.2/x86_64-alt-linux/sources/pyside6/libpysideqml:/usr/src/RPM/BUILD/pyside-setup-opensource-6.4.2/x86_64-alt-linux/sources/shiboken6/libshiboken
	python3
	/usr/src/RPM/BUILD/pyside-setup-opensource-6.4.2/sources/pyside6/PySide6/QtCore/../support/generate_pyi.py
	QtCore --sys-path
	/usr/src/RPM/BUILD/pyside-setup-opensource-6.4.2/x86_64-alt-linux/sources/pyside6
	/usr/src/RPM/BUILD/pyside-setup-opensource-6.4.2/x86_64-alt-linux/sources/shiboken6/shibokenmodule/..
	--
	from shiboken6.Shiboken import *
	ImportError:
	/usr/src/RPM/BUILD/pyside-setup-opensource-6.4.2/x86_64-alt-linux/sources/shiboken6/Shiboken.abi3.so:
	file too short
	[2025/2092] Building CXX object
	sources/pyside6/PySide6/Qt3DExtras/CMakeFiles/Qt3DExtras.dir/PySide6/Qt3DExtras/qt3dextras_qtorusgeometry_wrapper.cpp.o
	--
	[2027/2092] cd
	/usr/src/RPM/BUILD/pyside-setup-opensource-6.4.2/x86_64-alt-linux/sources/pyside6/PySide6/QtPrintSupport
	&& /usr/bin/cmake -E env
	LD_LIBRARY_PATH=/usr/src/RPM/BUILD/pyside-setup-opensource-6.4.2/x86_64-alt-linux/sources/pyside6/libpyside:/usr/src/RPM/BUILD/pyside-setup-opensource-6.4.2/x86_64-alt-linux/sources/pyside6/libpysideqml:/usr/src/RPM/BUILD/pyside-setup-opensource-6.4.2/x86_64-alt-linux/sources/shiboken6/libshiboken
	python3
	/usr/src/RPM/BUILD/pyside-setup-opensource-6.4.2/sources/pyside6/PySide6/QtPrintSupport/../support/generate_pyi.py
	QtPrintSupport --sys-path
	/usr/src/RPM/BUILD/pyside-setup-opensource-6.4.2/x86_64-alt-linux/sources/pyside6
	/usr/src/RPM/BUILD/pyside-setup-opensource-6.4.2/x86_64-alt-linux/sources/shiboken6/shibokenmodule/..
	FAILED: sources/pyside6/PySide6/QtPrintSupport/CMakeFiles/QtPrintSupport_pyi
	/usr/src/RPM/BUILD/pyside-setup-opensource-6.4.2/x86_64-alt-linux/sources/pyside6/PySide6/QtPrintSupport/CMakeFiles/QtPrintSupport_pyi
	cd
	/usr/src/RPM/BUILD/pyside-setup-opensource-6.4.2/x86_64-alt-linux/sources/pyside6/PySide6/QtPrintSupport
	&& /usr/bin/cmake -E env
	LD_LIBRARY_PATH=/usr/src/RPM/BUILD/pyside-setup-opensource-6.4.2/x86_64-alt-linux/sources/pyside6/libpyside:/usr/src/RPM/BUILD/pyside-setup-opensource-6.4.2/x86_64-alt-linux/sources/pyside6/libpysideqml:/usr/src/RPM/BUILD/pyside-setup-opensource-6.4.2/x86_64-alt-linux/sources/shiboken6/libshiboken
	python3
	/usr/src/RPM/BUILD/pyside-setup-opensource-6.4.2/sources/pyside6/PySide6/QtPrintSupport/../support/generate_pyi.py
	QtPrintSupport --sys-path
	/usr/src/RPM/BUILD/pyside-setup-opensource-6.4.2/x86_64-alt-linux/sources/pyside6
	/usr/src/RPM/BUILD/pyside-setup-opensource-6.4.2/x86_64-alt-linux/sources/shiboken6/shibokenmodule/..
	--
	from shiboken6.Shiboken import *
	ImportError:
	/usr/src/RPM/BUILD/pyside-setup-opensource-6.4.2/x86_64-alt-linux/sources/shiboken6/Shiboken.abi3.so:
	file too short
	[2028/2092] Linking CXX shared module sources/pyside6/PySide6/Qt3DLogic.abi3.so
	--
	[2030/2092] cd
	/usr/src/RPM/BUILD/pyside-setup-opensource-6.4.2/x86_64-alt-linux/sources/pyside6/PySide6/QtWidgets
	&& /usr/bin/cmake -E env
	LD_LIBRARY_PATH=/usr/src/RPM/BUILD/pyside-setup-opensource-6.4.2/x86_64-alt-linux/sources/pyside6/libpyside:/usr/src/RPM/BUILD/pyside-setup-opensource-6.4.2/x86_64-alt-linux/sources/pyside6/libpysideqml:/usr/src/RPM/BUILD/pyside-setup-opensource-6.4.2/x86_64-alt-linux/sources/shiboken6/libshiboken
	python3
	/usr/src/RPM/BUILD/pyside-setup-opensource-6.4.2/sources/pyside6/PySide6/QtWidgets/../support/generate_pyi.py
	QtWidgets --sys-path
	/usr/src/RPM/BUILD/pyside-setup-opensource-6.4.2/x86_64-alt-linux/sources/pyside6
	/usr/src/RPM/BUILD/pyside-setup-opensource-6.4.2/x86_64-alt-linux/sources/shiboken6/shibokenmodule/..
	FAILED: sources/pyside6/PySide6/QtWidgets/CMakeFiles/QtWidgets_pyi
	/usr/src/RPM/BUILD/pyside-setup-opensource-6.4.2/x86_64-alt-linux/sources/pyside6/PySide6/QtWidgets/CMakeFiles/QtWidgets_pyi
	cd
	/usr/src/RPM/BUILD/pyside-setup-opensource-6.4.2/x86_64-alt-linux/sources/pyside6/PySide6/QtWidgets
	&& /usr/bin/cmake -E env
	LD_LIBRARY_PATH=/usr/src/RPM/BUILD/pyside-setup-opensource-6.4.2/x86_64-alt-linux/sources/pyside6/libpyside:/usr/src/RPM/BUILD/pyside-setup-opensource-6.4.2/x86_64-alt-linux/sources/pyside6/libpysideqml:/usr/src/RPM/BUILD/pyside-setup-opensource-6.4.2/x86_64-alt-linux/sources/shiboken6/libshiboken
	python3
	/usr/src/RPM/BUILD/pyside-setup-opensource-6.4.2/sources/pyside6/PySide6/QtWidgets/../support/generate_pyi.py
	QtWidgets --sys-path
	/usr/src/RPM/BUILD/pyside-setup-opensource-6.4.2/x86_64-alt-linux/sources/pyside6
	/usr/src/RPM/BUILD/pyside-setup-opensource-6.4.2/x86_64-alt-linux/sources/shiboken6/shibokenmodule/..
	--
	from shiboken6.Shiboken import *
	ImportError:
	/usr/src/RPM/BUILD/pyside-setup-opensource-6.4.2/x86_64-alt-linux/sources/shiboken6/Shiboken.abi3.so:
	file too short
	[2031/2092] Linking CXX shared module
	sources/shiboken6/tests/minimalbinding/minimal.abi3.so

tarantool-3.0.1-alt1
	[235]
	[235] Test failed! Result content mismatch:
	[235] --- replication/election_qsync_stress.result	Thu Jan 25 13:35:22 2024

tarantool-picodata-2.11.5.165-alt1
	[203] box-luatest/builtin_events_test.lua			    [ fail ]
	[203] Test failed! Output from reject file
	/tmp/t/rejects/box-luatest/builtin_events.reject:
	[203] Tarantool version is 2.11.5-165-gfae9c5bbe
	--
	[014] ssl-luatest/basic_test.lua				    [ fail ]
	[014] Test failed! Output from reject file /tmp/t/rejects/ssl-luatest/basic.reject:
	[014] Tarantool version is 2.11.5-165-gfae9c5bbe
	--
	[014] not ok 5	ssl-luatest.basic.test_server_verify_client
	[014] #   ...tool-picodata-2.11.5.165/test/ssl-luatest/basic_test.lua:285: expected:
	nil, actual: "Init session error: error:14094415:SSL routines:ssl3_read_bytes:sslv3
	alert certificate expired"
	[014] #   stack traceback:
	--
	[014] not ok 7	ssl-luatest.basic.test_server_client_verify_both
	[014] #   ...tool-picodata-2.11.5.165/test/ssl-luatest/basic_test.lua:429: expected:
	nil, actual: "Init session error: error:14094415:SSL routines:ssl3_read_bytes:sslv3
	alert certificate expired"
	[014] #   stack traceback:
	--
	[014] ssl-luatest/basic_test.lua				    [ fail ]
	[014] Test failed! Output from reject file /tmp/t/rejects/ssl-luatest/basic.reject:
	[014] Tarantool version is 2.11.5-165-gfae9c5bbe
	--
	[014] not ok 5	ssl-luatest.basic.test_server_verify_client
	[014] #   ...tool-picodata-2.11.5.165/test/ssl-luatest/basic_test.lua:285: expected:
	nil, actual: "Init session error: error:14094415:SSL routines:ssl3_read_bytes:sslv3
	alert certificate expired"
	[014] #   stack traceback:
	--
	[014] not ok 7	ssl-luatest.basic.test_server_client_verify_both
	[014] #   ...tool-picodata-2.11.5.165/test/ssl-luatest/basic_test.lua:429: expected:
	nil, actual: "Init session error: error:14094415:SSL routines:ssl3_read_bytes:sslv3
	alert certificate expired"
	[014] #   stack traceback:

xdg-desktop-portal-1.18.3-alt1
	7/28 xdg-desktop-portal:portals / test-portals-email	     OK		      1.90s
	9 subtests passed
	▶  8/28 xdg-desktop-portal:ERROR:../tests/inhibit.c:327:session_state_changed_cb:
	assertion failed (state == XDP_LOGIN_SESSION_RUNNING): (2 == 1) ERROR
	8/28 xdg-desktop-portal:portals / test-portals-inhibit	     ERROR	      2.23s
	killed by signal 6 SIGABRT
	>>> G_TEST_BUILDDIR=/usr/src/RPM/BUILD/xdg-desktop-portal-1.18.3/x86_64-alt-linux/tests
	XDG_DATA_DIRS=/usr/src/RPM/BUILD/xdg-desktop-portal-1.18.3/x86_64-alt-linux/tests/share
	XDG_CURRENT_DESKTOP=test G_DEBUG=gc-friendly XDP_UNINSTALLED=1 MALLOC_PERTURB_=135
	G_TEST_SRCDIR=/usr/src/RPM/BUILD/xdg-desktop-portal-1.18.3/tests
	/usr/src/RPM/BUILD/xdg-desktop-portal-1.18.3/x86_64-alt-linux/tests/test-portals
	--verbose --keep-going --tap -p /portal/inhibit
	--
	XDP: providing portal org.freedesktop.portal.GameMode
	(/usr/src/RPM/BUILD/xdg-desktop-portal-1.18.3/x86_64-alt-linux/tests/../src/xdg-desktop-portal:3017816):
	xdg-desktop-portal-WARNING **: 11:50:51.169: Failed to create RealtimeKit proxy: Could
	not connect: No such file or directory
	XDP: providing portal org.freedesktop.portal.Realtime
	--
	Summary of Failures:
	8/28 xdg-desktop-portal:portals / test-portals-inhibit	     ERROR	      2.23s
	killed by signal 6 SIGABRT
	Ok:		    26

	16 error logs REMOVED from the list
automake_1.11-1.11.6-alt9
bind-9.16.50-alt3
fwupd-1.9.20-alt1.p10.1
gawk-5.1.0.0.213.d04f-alt1
gcr-3.40.0-alt1
gnome-builder-3.40.2-alt1.1
kernel-modules-dm-secdel-un-def-2:1.0.9-alt1.393647.1
lightdm-1.30.0-alt24
perl-Coro-2:6.570-alt4_1
php7-7.4.33-alt1.p10.1
php8.3-pcntl-8.3.31-alt1
pocl-6.0-alt0.1.p10.2
python3.11-3.11.15-alt1.p10.1
trace-cmd-3.1.6-alt2
tuned-2.22.1-alt1
util-linux-2.39.2-alt0.p10.2

Total 101 error logs.


^ permalink raw reply	[flat|nested] only message in thread

only message in thread, other threads:[~2026-07-12 16:38 UTC | newest]

Thread overview: (only message) (download: mbox.gz / follow: Atom feed)
-- links below jump to the message on this page --
2026-07-12 16:38 [cyber] I: p10-20260712 x86_64 beehive_status: +22 -16 (101) ALT beekeeper

ALT Linux Sisyphus cybertalk

This inbox may be cloned and mirrored by anyone:

	git clone --mirror http://lore.altlinux.org/sisyphus-cybertalk/0 sisyphus-cybertalk/git/0.git

	# If you have public-inbox 1.1+ installed, you may
	# initialize and index your mirror using the following commands:
	public-inbox-init -V2 sisyphus-cybertalk sisyphus-cybertalk/ http://lore.altlinux.org/sisyphus-cybertalk \
		sisyphus-cybertalk@lists.altlinux.org sisyphus-cybertalk@lists.altlinux.ru sisyphus-cybertalk@lists.altlinux.com
	public-inbox-index sisyphus-cybertalk

Example config snippet for mirrors.
Newsgroup available over NNTP:
	nntp://lore.altlinux.org/org.altlinux.lists.sisyphus-cybertalk


AGPL code for this site: git clone https://public-inbox.org/public-inbox.git