* [cyber] I: Sisyphus-20260712 x86_64 beehive_status: +15 -16 (494)
@ 2026-07-12 10:28 ALT beekeeper
0 siblings, 0 replies; only message in thread
From: ALT beekeeper @ 2026-07-12 10:28 UTC (permalink / raw)
To: sisyphus-cybertalk
[-- Warning: decoded text below may be mangled, UTF-8 assumed --]
[-- Attachment #1: Type: text/plain; charset=unknown-8bit, Size: 12514 bytes --]
15 NEW error logs
fonts-ttf-IosevkaSlab-34.7.0-alt1
[ACTION] Create TTF 'dist/IosevkaSlab/TTF-Unhinted/IosevkaSlab-HeavyItalic.ttf'
[ACTION] Create TTF 'dist/IosevkaSlab/TTF-Unhinted/IosevkaSlab-ExtendedHeavyItalic.ttf'
[ACTION] Create TTF 'dist/IosevkaSlab/TTF-Unhinted/IosevkaSlab-Thin.ttf'
[ACTION] Create TTF 'dist/IosevkaSlab/TTF-Unhinted/IosevkaSlab-ExtendedThin.ttf'
[ACTION] Create TTF 'dist/IosevkaSlab/TTF-Unhinted/IosevkaSlab-ThinOblique.ttf'
[ACTION] Create TTF 'dist/IosevkaSlab/TTF-Unhinted/IosevkaSlab-ExtendedThinOblique.ttf'
/usr/src/tmp/rpmb-tmp.hSqRNV: line 131: 129371 CPU time limit exceeded npm run build --
ttf::IosevkaSlab
error: Bad exit status from /usr/src/tmp/rpmb-tmp.hSqRNV (%build)
RPM build errors:
Bad exit status from /usr/src/tmp/rpmb-tmp.hSqRNV (%build)
fonts-ttf-IosevkaTermCurly-34.7.0-alt1
[ACTION] Create TTF 'dist/IosevkaCurly/TTF-Unhinted/IosevkaCurly-HeavyItalic.ttf'
[ACTION] Create TTF 'dist/IosevkaCurly/TTF-Unhinted/IosevkaCurly-ExtendedHeavyItalic.ttf'
[ACTION] Create TTF 'dist/IosevkaCurly/TTF-Unhinted/IosevkaCurly-Thin.ttf'
[ACTION] Create TTF 'dist/IosevkaCurly/TTF-Unhinted/IosevkaCurly-ExtendedThin.ttf'
[ACTION] Create TTF 'dist/IosevkaCurly/TTF-Unhinted/IosevkaCurly-ThinOblique.ttf'
[ACTION] Create TTF 'dist/IosevkaCurly/TTF-Unhinted/IosevkaCurly-ExtendedThinOblique.ttf'
/usr/src/tmp/rpmb-tmp.kimH2R: line 131: 3738946 CPU time limit exceeded npm run build
-- ttf::IosevkaTermCurly
error: Bad exit status from /usr/src/tmp/rpmb-tmp.kimH2R (%build)
RPM build errors:
Bad exit status from /usr/src/tmp/rpmb-tmp.kimH2R (%build)
gnuplot-1:6.0.4-alt1
make[1]: Leaving directory '/usr/src/RPM/BUILD/gnuplot-6.0.4/docs'
make[1]: *** Deleting file 'gnuplot.tex'
make[1]: Entering directory '/usr/src/RPM/BUILD/gnuplot-6.0.4/docs'
./doc2tex -figures ./gnuplot.doc gnuplot.tex
make[1]: *** [Makefile:1101: gnuplot.tex] Segmentation fault
make[1]: Leaving directory '/usr/src/RPM/BUILD/gnuplot-6.0.4/docs'
make: *** [Makefile:1104: pdf] Error 2
error: Bad exit status from /usr/src/tmp/rpmb-tmp.60Dslx (%build)
RPM build errors:
Bad exit status from /usr/src/tmp/rpmb-tmp.60Dslx (%build)
guile-fibers-1.4.3-alt1
make check-TESTS
hasher-privd: parent: handle_io: idle time limit (3600 seconds) exceeded
lightdm-1.32.0-alt14
# SKIP: 0
# XFAIL: 0
# FAIL: 1
# XPASS: 0
# ERROR: 0
See tests/test-suite.log
--
# SKIP: 0
# XFAIL: 0
# FAIL: 1
# XPASS: 0
# ERROR: 0
.. contents:: :depth: 2
FAIL: test-autologin-unknown
** (process:4123395): WARNING **: 06:05:51.215: Error loading passwd file: Failed to
open file “/tmp/.r0/etc/passwd”: No such file or directory
** (process:4123408): WARNING **: 06:05:51.217: Error loading passwd file: Failed to
open file “/tmp/.r0/etc/passwd”: No such file or directory
** (process:4123410): WARNING **: 06:05:51.220: Error loading passwd file: Failed to
open file “/tmp/.r0/etc/passwd”: No such file or directory
** (process:4123413): WARNING **: 06:05:51.222: Error loading passwd file: Failed to
open file “/tmp/.r0/etc/passwd”: No such file or directory
pkcs11-provider-1.2.0-alt3
Full log written to
/usr/src/RPM/BUILD/pkcs11-provider-1.2.0/x86_64-alt-linux/meson-logs/testlog.txt
FAILED: [code=1] meson-internal__test
/usr/bin/meson test --no-rebuild --print-errorlogs
python3-module-crosshair-tool-0.0.107-alt1
assert found == {expected}, assertmsg
AssertionError: Got MessageType.CANNOT_CONFIRM instead of MessageType.CONFIRMED (use
`pytest -v` to show trace)
=============================== warnings summary ===============================
--
XFAIL crosshair/libimpl/codecslib_test.py::test_supported_codec_streamwriter - not
yet implemented
FAILED crosshair/libimpl/timelib_test.py::test_monotonic_confirm - AssertionE...
= 1 failed, 12077 passed, 10 skipped, 1 xfailed, 132 warnings in 585.49s (0:09:45) =
INFO : Command's result: FAILURE
INFO : Command's error: Command '['python3',
'-m', 'pytest', '-vra', '-n', '32', '--deselect',
'crosshair/libimpl/datetimelib_ch_test.py::test_builtin[check_timedelta_new]',
'--deselect', 'crosshair/libimpl/datetimelib_test.py::test_leap_year']' returned non-zero
exit status 1.
error: Bad exit status from /usr/src/tmp/rpmb-tmp.rJmsnX (%check)
python3-module-jupyter_server-2.20.0-alt1
SKIPPED [7] tests/conftest.py:42: Skipping this test because it's marked
'integration_test'. Run integration tests using the `--integration_tests` flag.
FAILED
tests/services/contents/test_manager.py::test_created_timestamp[jp_contents_manager3]
= 1 failed, 1122 passed, 21 skipped, 12 deselected, 262 warnings in 202.46s (0:03:22) =
INFO : Command's result: FAILURE
INFO : Command's error: Command '['python3', '-m', 'pytest', '-v', '-W', 'default',
'-m', 'not network', '-k', 'not test_restart_kernel and not test_connection']' returned
non-zero exit status 1.
error: Bad exit status from /usr/src/tmp/rpmb-tmp.OKHgde (%check)
python3-module-python-lsp-server-1.14.0-alt1
stream.write(msg + self.terminator)
ValueError: I/O operation on closed file.
Call stack:
--
stream.write(msg + self.terminator)
ValueError: I/O operation on closed file.
Call stack:
--
stream.write(msg + self.terminator)
ValueError: I/O operation on closed file.
Call stack:
--
stream.write(msg + self.terminator)
ValueError: I/O operation on closed file.
Call stack:
--
stream.write(msg + self.terminator)
ValueError: I/O operation on closed file.
Call stack:
--
INFO : Command's result: FAILURE
INFO : Command's error: Command '['python3', '-m',
'pytest', '-ra', '-o=addopts=-Wignore', 'test', '--deselect',
'test/plugins/test_completion.py::test_jedi_completion_environment', '--deselect',
'test/plugins/test_symbols.py::test_symbols_all_scopes_with_jedi_environment']' returned
non-zero exit status 1.
error: Bad exit status from /usr/src/tmp/rpmb-tmp.WA8LYH (%check)
python3-module-rapidfuzz-3.14.5-alt1
python3-module-requests-unixsocket2-1.0.1-alt1
raise BadStatusLine(line)
E urllib3.exceptions.ProtocolError: ('Connection aborted.', BadStatusLine('Hello
world!HTTP/1.1 200 OK\r\n'))
During handling of the above exception, another exception occurred:
--
raise ConnectionError(err, request=request)
E requests.exceptions.ConnectionError: ('Connection aborted.', BadStatusLine('Hello
world!HTTP/1.1 200 OK\r\n'))
=========================== short test summary info ============================
FAILED requests_unixsocket/tests/test_requests_unixsocket.py::test_unix_domain_adapter_ok
========================= 1 failed, 5 passed in 0.26s ==========================
INFO : Command's result: FAILURE
INFO : Command's error: Command '['python3', '-m', 'pytest', '-ra', '-Wignore',
'requests_unixsocket/tests']' returned non-zero exit status 1.
error: Bad exit status from /usr/src/tmp/rpmb-tmp.TL9WQE (%check)
python3-module-retrying-1.4.2-alt1
"msg": "calls_per_second_final was not within +/-20% of calls_per_second_initial"
E AssertionError: False is not true : {'calls_per_second_initial': 24561.63624731386,
'calls_per_second_final': 19118.558727651296, 'msg': 'calls_per_second_final was not
within +/-20% of calls_per_second_initial'}
test_retrying.py:530: AssertionError
=========================== short test summary info ============================
FAILED test_retrying.py::LoadTest::test_load - AssertionError: False is not t...
======================== 1 failed, 26 passed in 24.52s =========================
INFO : Command's result: FAILURE
INFO : Command's error: Command '['python3', '-m', 'pytest', 'test_retrying.py']'
returned non-zero exit status 1.
error: Bad exit status from /usr/src/tmp/rpmb-tmp.RquL30 (%check)
python3-module-tempest-45.0.0-alt1
with testtools.ExpectedException(testtools.testcase.TestSkipped):
AttributeError: module 'testtools.testcase' has no attribute 'TestSkipped'
tempest.tests.test_test.TestTempestBaseTestClass.test_skip_checks_identity_v2_not_available
--
with testtools.ExpectedException(testtools.testcase.TestSkipped):
AttributeError: module 'testtools.testcase' has no attribute 'TestSkipped'
tempest.tests.test_test.TestTempestBaseTestClass.test_skip_checks_identity_v3_not_available
--
with testtools.ExpectedException(testtools.testcase.TestSkipped):
AttributeError: module 'testtools.testcase' has no attribute 'TestSkipped'
Totals
qemu-10.2.2-alt1
411/585 qtest+qtest-aarch64 - qemu:qtest-aarch64/test-hmp TIMEOUT
240.09s killed by signal 15 SIGTERM
Ok: 528
Fail: 0
Skipped: 56
Timeout: 1
Full log written to /usr/src/RPM/BUILD/qemu-10.2.2/build-dynamic/meson-logs/testlog.txt
make: *** [Makefile.mtest:26: do-meson-check] Error 1
error: Bad exit status from /usr/src/tmp/rpmb-tmp.3yjuOn (%check)
RPM build errors:
Bad exit status from /usr/src/tmp/rpmb-tmp.3yjuOn (%check)
zstd-1.5.5-alt2
test209 : thread pool API tests :
thread pool test : threadPool re-use roundtrips: OK
thread pool test : threadPool simultaneous usage: OK
thread pool tests OK
1 17 39 48 72 85
97 123 127 146 148
171 193 206 207 213 222
236 261 274 275 293
302 308 316 318 328 355
361 370 375 389 398
407 416 427 449 471 485
504 529 545 555 572
596 605 619 622 635 648
651 660 678 700 723
751 763 782 798 828 838
858 891 897 912 916
919 936 946 950 958 975
992 1007 1028 1033 1042
1054 1055 1061 1083 1097 1110
1137 1150 1187 1198 1222
1233 1255 1261 1275 1299 1319
1346 1352 1377 1408 1413
1427 1451 1480 1491 1514 1521
1531 1556 1569 1572 1583
1598 1608 1617 1629 1644
1662 1681 1696 1713 1731
1764 1765 1777 1792 1803
1814 1826 1840 1867 1870
1877 1891 1922 1930 1936
1944 1959 1987 1989 1990
2015 2024 2052 2060 2063
2111 2118 2131 2152 2159
2171 2181 2201 2209 2212
2217 2236 2254 2271 2295
2298 2301 2312 2320 2332
2348 2403 2408 2410 2413
2427 2436 2451 2459 2497
2501 2519 2545 2563 2589
2603 2605 2610 2620 2640
2650 2687 2696 2711 2727
2732 2742 2750 2771 2787
2799 2815 2831 2847 2860
2871 2906 2919 2932 2955
2960 2961 2985 3004 3018
3027 3040 3054 3079 3102
3128 3132 3172 3179 3189
3202 3235 3250 3271 3286
3296 3304 3310 3328 3341
3358 3376 3406 3436 3451
3465 3481 3501 3512 3537 3561
make: Leaving directory '/usr/src/RPM/BUILD/zstd-1.5.5-alt2/tests'
make: Target 'test' not remade because of errors.
error: Bad exit status from /usr/src/tmp/rpmb-tmp.Nkwk1b (%check)
RPM build errors:
Bad exit status from /usr/src/tmp/rpmb-tmp.Nkwk1b (%check)
16 error logs REMOVED from the list
apache-commons-dbutils-1.8.1-alt1
bind-9.18.50-alt1
eartag-1.0.2-alt1.1
eden-0.2.1-alt2
elixir-1.19.5-alt1
fonts-ttf-IosevkaSlab-34.4.0-alt1
glassfish-jsp-api2.3-2.3.3-alt3_2jpp11
gz-gui-10.0.0-alt2
jss-5.8.0-alt1
perl-Tie-DBI-1.08-alt1
python3-module-chess-1.11.2-alt1
python3-module-fabio-2025.10.0-alt1
python3-module-mkdocs-1.6.1-alt2
python3-module-scikit-build-core-0.12.2-alt2
python3-module-websockets-16.1-alt1
vitalium-verb-1.3.0-alt1
Total 494 error logs.
^ permalink raw reply [flat|nested] only message in thread
only message in thread, other threads:[~2026-07-12 10:28 UTC | newest]
Thread overview: (only message) (download: mbox.gz / follow: Atom feed)
-- links below jump to the message on this page --
2026-07-12 10:28 [cyber] I: Sisyphus-20260712 x86_64 beehive_status: +15 -16 (494) ALT beekeeper
ALT Linux Sisyphus cybertalk
This inbox may be cloned and mirrored by anyone:
git clone --mirror http://lore.altlinux.org/sisyphus-cybertalk/0 sisyphus-cybertalk/git/0.git
# If you have public-inbox 1.1+ installed, you may
# initialize and index your mirror using the following commands:
public-inbox-init -V2 sisyphus-cybertalk sisyphus-cybertalk/ http://lore.altlinux.org/sisyphus-cybertalk \
sisyphus-cybertalk@lists.altlinux.org sisyphus-cybertalk@lists.altlinux.ru sisyphus-cybertalk@lists.altlinux.com
public-inbox-index sisyphus-cybertalk
Example config snippet for mirrors.
Newsgroup available over NNTP:
nntp://lore.altlinux.org/org.altlinux.lists.sisyphus-cybertalk
AGPL code for this site: git clone https://public-inbox.org/public-inbox.git