ALT Linux Sisyphus cybertalk
 help / color / mirror / Atom feed
* [cyber] I: Sisyphus-20260711 x86_64 beehive_status: +16 -13 (495)
@ 2026-07-11  3:38 ALT beekeeper
  0 siblings, 0 replies; only message in thread
From: ALT beekeeper @ 2026-07-11  3:38 UTC (permalink / raw)
  To: sisyphus-cybertalk

	16 NEW error logs

apache-commons-dbutils-1.8.1-alt1
	[ERROR] -> [Help 1]
	[ERROR]
	[ERROR] To see the full stack trace of the errors, re-run Maven with the -e switch.
	[ERROR] Re-run Maven using the -X switch to enable full debug logging.
	[ERROR]
	[ERROR] For more information about the errors and possible solutions, please read the
	following articles:
	[ERROR] [Help 1] http://cwiki.apache.org/confluence/display/MAVEN/MojoFailureException
	error: Bad exit status from /usr/src/tmp/rpmb-tmp.SrAaIH (%build)
	RPM build errors:
	Bad exit status from /usr/src/tmp/rpmb-tmp.SrAaIH (%build)

bind-9.18.50-alt1
	SKIPPED [1] rfc5011/tests_rfc5011.py:22: CI_ENABLE_LIVE_INTERNET_TESTS not set\r
	FAILED database/tests_database.py::test_database - OSError: [Errno 61] No data available\r
	============= 1 failed, 40 passed, 6 skipped in 176.17s (0:02:56) ==============\r

elixir-1.19.5-alt1
	(elixir 1.19.5) lib/task/supervised.ex:105: Task.Supervised.invoke_mfa/2
	(elixir 1.19.5) lib/task/supervised.ex:40: Task.Supervised.reply/4
	^[[32m.^[[0m^[[32m.^[[0m^[[32m.^[[0m^[[32m.^[[0m^[[32m.^[[0m^[[32m.^[[0m^[[32m.^[[0m^[[32m.^[[0m^[[32m.^[[0m^[[32m.^[[0m^[[32m.^[[0m^[[32m.^[[0m^[[32m.^[[0m^[[32m.^[[0m^[[32m.^[[0m^[[32m.^[[0m^[[32m.^[[0m^[[32m.^[[0m^[[32m.^[[0m^[[32m.^[[0m^[[32m.^[[0m^[[32m.^[[0m^[[32m.^[[0m^[[32m.^[[0m^[[32m.^[[0m^[[32m.^[[0m^[[32m.^[[0m^[[32m.^[[0m^[[32m.^[[0m^[[32m.^[[0m^[[32m.^[[0m^[[32m.^[[0m^[[32m.^[[0m^[[32m.^[[0m^[[32m.^[[0m^[[32m.^[[0m^[[32m.^[[0m^[[32m.^[[0m^[[32m.^[[0m^[[32m.^[[0m^[[32m.^[[0m^[[32m.^[[0m^[[32m.^[[0m^[[32m.^[[0m^[[32m.^[[0m^[[32m.^[[0m^[[32m.^[[0m^[[32m.^[[0m^[[32m.^[[0m^[[32m.^[[0m^[[32m.^[[0m^[[32m.^[[0m^[[32m.^[[0m^[[32m.^[[0m^[[32m.^[[0m^[[32m.^[[0m^[[32m.^[[0m^[[32m.^[[0m^[[32m.^[[0m^[[32m.^[[0m^[[32m.^[[0m^[[32m.^[[0m^[[32m.^[[0m^[[32m.^[[0m^[[32m.^[[0m^[[32m.^[[0m^[[32m.^[[0m^[[32m.^[[0m^[[32m.^[[0m^[[32m.^[[0m^[[32m.^[[0m^[[32m.^[[0m^[[32m.^[[0m^[[32m.^[[0m^[[32m.^[[0m^[[32m.^[[0m^[[32m.^[[0m^[[32m.^[[0m^[[32m.^[[0m^[[32m.^[[0m^[[32m.^[[0m^[[32m.^[[0m^[[32m.^[[0m^[[32m.^[[0m^[[32m.^[[0m^[[32m.^[[0m^[[32m.^[[0m^[[32m.^[[0m^[[32m.^[[0m^[[32m.^[[0m^[[32m.^[[0m^[[32m.^[[0m^[[32m.^[[0m^[[32m.^[[0m^[[32m.^[[0m^[[32m.^[[0m^[[32m.^[[0m^[[32m.^[[0m^[[32m.^[[0m^[[32m.^[[0m^[[32m.^[[0m^[[32m.^[[0m^[[32m.^[[0m^[[32m.^[[0m^[[32m.^[[0m^[[32m.^[[0m^[[32m.^[[0m^[[32m.^[[0m^[[32m.^[[0m^[[32m.^[[0m^[[32m.^[[0m^[[32m.^[[0m^[[32m.^[[0m^[[32m.^[[0m^[[32m.^[[0m^[[32m.^[[0m^[[32m.^[[0m^[[32m.^[[0m^[[32m.^[[0m^[[32m.^[[0m^[[32m.^[[0m^[[32m.^[[0m^[[32m.^[[0m^[[32m.^[[0m^[[32m.^[[0m^[[32m.^[[0m^[[32m.^[[0m^[[32m.^[[0m^[[32m.^[[0m^[[32m.^[[0m^[[32m.^[[0m^[[32m.^[[0m^[[32m.^[[0m^[[32m.^[[0m^[[32m.^[[0m^[[32m.^[[0m^[[32m.^[[0m^[[32m.^[[0m^[[32m.^[[0m^[[32m.^[[0m^[[32m.^[[0m^[[32m.^[[0m^[[32m.^[[0m^[[32m.^[[0m^[[32m.^[[0m^[[32m.^[[0m^[[32m.^[[0m^[[32m.^[[0m^[[32m.^[[0m^[[32m.^[[0m^[[32m.^[[0m^[[32m.^[[0m^[[32m.^[[0m^[[32m.^[[0m^[[32m.^[[0m^[[32m.^[[0m^[[32m.^[[0m^[[32m.^[[0m^[[32m.^[[0m^[[32m.^[[0m^[[32m.^[[0m^[[32m.^[[0m^[[32m.^[[0m^[[32m.^[[0m^[[32m.^[[0m^[[32m.^[[0m^[[32m.^[[0m^[[32m.^[[0m^[[32m.^[[0m^[[32m.^[[0m^[[32m.^[[0m^[[32m.^[[0m^[[32m.^[[0m^[[32m.^[[0m^[[32m.^[[0m^[[32m.^[[0m^[[32m.^[[0m^[[32m.^[[0m^[[32m.^[[0m^[[32m.^[[0m^[[32m.^[[0m^[[32m.^[[0m^[[32m.^[[0m^[[32m.^[[0m^[[32m.^[[0m^[[32m.^[[0m^[[32m.^[[0m^[[32m.^[[0m^[[32m.^[[0m^[[32m.^[[0m^[[32m.^[[0m^[[32m.^[[0m^[[32m.^[[0m^[[32m.^[[0m^[[32m.^[[0m^[[32m.^[[0m^[[32m.^[[0m^[[32m.^[[0m^[[32m.^[[0m^[[32m.^[[0m^[[32m.^[[0m^[[32m.^[[0m^[[32m.^[[0m^[[32m.^[[0m^[[32m.^[[0m^[[32m.^[[0m^[[32m.^[[0m^[[32m.^[[0m^[[32m.^[[0m^[[32m.^[[0m^[[32m.^[[0m^[[32m.^[[0m^[[32m.^[[0m^[[32m.^[[0m^[[32m.^[[0m^[[32m.^[[0m^[[32m.^[[0m^[[32m.^[[0m^[[32m.^[[0m^[[32m.^[[0m^[[32m.^[[0m^[[32m.^[[0m^[[32m.^[[0m^[[32m.^[[0m^[[32m.^[[0m^[[32m.^[[0m^[[32m.^[[0m^[[32m.^[[0m^[[32m.^[[0m^[[32m.^[[0m^[[32m.^[[0m^[[32m.^[[0m^[[32m.^[[0m^[[32m.^[[0m^[[32m.^[[0m^[[32m.^[[0m^[[32m.^[[0m^[[32m.^[[0m^[[32m.^[[0m^[[32m.^[[0m^[[32m.^[[0m^[[32m.^[[0m^[[32m.^[[0m^[[32m.^[[0m^[[32m.^[[0m^[[32m.^[[0m^[[32m.^[[0m^[[32m.^[[0m^[[32m.^[[0m^[[32m.^[[0m^[[32m.^[[0m^[[32m.^[[0m^[[32m.^[[0m^[[32m.^[[0m^[[32m.^[[0m^[[32m.^[[0m^[[32m.^[[0m^[[32m.^[[0m^[[32m.^[[0m^[[32m.^[[0m^[[32m.^[[0m^[[32m.^[[0m^[[32m.^[[0m^[[32m.^[[0m^[[32m.^[[0m^[[32m.^[[0m^[[32m.^[[0m^[[32m.^[[0m^[[32m.^[[0m^[[32m.^[[0m^[[32m.^[[0m^[[32m.^[[0m^[[32m.^[[0m^[[32m.^[[0m^[[32m.^[[0m^[[32m.^[[0m^[[32m.^[[0m^[[32m.^[[0m^[[32m.^[[0m^[[32m.^[[0m^[[32m.^[[0m^[[32m.^[[0m^[[32m.^[[0m^[[32m.^[[0m^[[32m.^[[0m^[[32m.^[[0m^[[32m.^[[0m^[[32m.^[[0m^[[32m.^[[0m^[[32m.^[[0m^[[32m.^[[0m^[[32m.^[[0m^[[32m.^[[0m^[[32m.^[[0m^[[32m.^[[0m^[[32m.^[[0m^[[32m.^[[0m^[[32m.^[[0m^[[32m.^[[0m^[[32m.^[[0m^[[32m.^[[0m^[[32m.^[[0m^[[32m.^[[0m^[[32m.^[[0m^[[32m.^[[0m^[[32m.^[[0m^[[32m.^[[0m^[[32m.^[[0m^[[32m.^[[0m^[[32m.^[[0m^[[32m.^[[0m^[[32m.^[[0m^[[32m.^[[0m^[[32m.^[[0m^[[32m.^[[0m^[[32m.^[[0m^[[32m.^[[0m^[[32m.^[[0m^[[32m.^[[0m^[[32m.^[[0m^[[32m.^[[0m^[[32m.^[[0m^[[32m.^[[0m^[[32m.^[[0m^[[32m.^[[0m^[[32m.^[[0m^[[32m.^[[0m^[[32m.^[[0m^[[32m.^[[0m^[[32m.^[[0m^[[32m.^[[0m^[[32m.^[[0m^[[32m.^[[0m^[[32m.^[[0m^[[32m.^[[0m^[[32m.^[[0m^[[32m.^[[0m^[[32m.^[[0m^[[32m.^[[0m^[[32m.^[[0m^[[32m.^[[0m^[[32m.^[[0m^[[32m.^[[0m^[[32m.^[[0m^[[32m.^[[0m^[[32m.^[[0m^[[32m.^[[0m^[[32m.^[[0m^[[32m.^[[0m^[[32m.^[[0m^[[32m.^[[0m^[[32m.^[[0m^[[32m.^[[0m^[[32m.^[[0m^[[32m.^[[0m^[[32m.^[[0m^[[32m.^[[0m^[[32m.^[[0m^[[32m.^[[0m^[[32m.^[[0m^[[32m.^[[0m^[[32m.^[[0m^[[32m.^[[0m^[[32m.^[[0m^[[32m.^[[0m^[[32m.^[[0m^[[32m.^[[0m^[[32m.^[[0m^[[32m.^[[0m^[[32m.^[[0m^[[32m.^[[0m^[[32m.^[[0m^[[32m.^[[0m^[[32m.^[[0m^[[32m.^[[0m^[[32m.^[[0m^[[32m.^[[0m^[[32m.^[[0m^[[32m.^[[0m^[[32m.^[[0m^[[32m.^[[0m^[[32m.^[[0m^[[32m.^[[0m^[[32m.^[[0m^[[32m.^[[0m^[[32m.^[[0m^[[32m.^[[0m^[[32m.^[[0m^[[32m.^[[0m^[[32m.^[[0m^[[32m.^[[0m^[[32m.^[[0m^[[32m.^[[0m^[[32m.^[[0m^[[32m.^[[0m^[[32m.^[[0m^[[32m.^[[0m^[[32m.^[[0m^[[32m.^[[0m^[[32m.^[[0m^[[32m.^[[0m^[[32m.^[[0m^[[32m.^[[0m^[[32m.^[[0m^[[32m.^[[0m^[[32m.^[[0m^[[32m.^[[0m^[[32m.^[[0m^[[32m.^[[0m^[[32m.
	Finished in 43.2 seconds (16.5s on load, 17.5s async, 9.1s sync)
	^[[31m2191 doctests, 4882 tests, 4 failures (18 excluded)^[[0m
	make: *** [Makefile:289: test_stdlib] Error 2
	make: Leaving directory '/usr/src/RPM/BUILD/elixir-1.19.5'
	error: Bad exit status from /usr/src/tmp/rpmb-tmp.LgBPV8 (%check)
	RPM build errors:
	Bad exit status from /usr/src/tmp/rpmb-tmp.LgBPV8 (%check)

flexmark-java-0.64.6-alt3
	[ERROR] Re-run Maven using the -X switch to enable full debug logging.
	[ERROR]
	[ERROR] For more information about the errors and possible solutions, please read the
	following articles:
	[ERROR] [Help 1] http://cwiki.apache.org/confluence/display/MAVEN/MojoFailureException
	[ERROR]
	[ERROR] After correcting the problems, you can resume the build with the command
	[ERROR]   mvn <args> -rf :flexmark-html2md-converter
	error: Bad exit status from /usr/src/tmp/rpmb-tmp.NyK8iE (%build)
	RPM build errors:
	Bad exit status from /usr/src/tmp/rpmb-tmp.NyK8iE (%build)

fonts-ttf-IosevkaTerm-34.7.0-alt1
	[ACTION] Create TTF 'dist/Iosevka/TTF-Unhinted/Iosevka-HeavyItalic.ttf'
	[ACTION] Create TTF 'dist/Iosevka/TTF-Unhinted/Iosevka-ExtendedHeavyItalic.ttf'
	[ACTION] Create TTF 'dist/Iosevka/TTF-Unhinted/Iosevka-Thin.ttf'
	[ACTION] Create TTF 'dist/Iosevka/TTF-Unhinted/Iosevka-ExtendedThin.ttf'
	[ACTION] Create TTF 'dist/Iosevka/TTF-Unhinted/Iosevka-ThinOblique.ttf'
	[ACTION] Create TTF 'dist/Iosevka/TTF-Unhinted/Iosevka-ExtendedThinOblique.ttf'
	/usr/src/tmp/rpmb-tmp.5Cffa1: line 131: 3405309 CPU time limit exceeded npm run build
	-- ttf::IosevkaTerm
	error: Bad exit status from /usr/src/tmp/rpmb-tmp.5Cffa1 (%build)
	RPM build errors:
	Bad exit status from /usr/src/tmp/rpmb-tmp.5Cffa1 (%build)

gz-gui-10.0.0-alt2
	54/54 Test #54: check_INTEGRATION_transport_scene_manager ...	Passed	  0.01 sec
	98% tests passed, 1 tests failed out of 54
	Total Test time (real) =  99.18 sec
	The following tests FAILED:
	1 - UNIT_Application_TEST (Subprocess aborted)
	--
	0inputs+0outputs (0major+12703917minor)pagefaults 0swaps
	hasher-privd: parent: handle_io: idle time limit (3600 seconds) exceeded

hibernate-validator-9.1.0-alt1
	sisu-maven-plugin
	E: Package sisu-mojos has no installation candidate
	hsh-install: Failed to calculate package file list.

jss-5.8.0-alt1
	/usr/bin/ld.bfd: /usr/src/tmp/cclN2T6d.ltrans0.ltrans.o: in function
	`test_with_buffer_size':
	/usr/src/RPM/BUILD/jss-5.8.0/native/src/test/native/org/mozilla/jss/tests/TestBufferPRFD.c:81:(.text+0x31):
	undefined reference to `jb_alloc'
	/usr/bin/ld.bfd:
	/usr/src/RPM/BUILD/jss-5.8.0/native/src/test/native/org/mozilla/jss/tests/TestBufferPRFD.c:82:(.text+0x41):
	undefined reference to `jb_alloc'
	/usr/bin/ld.bfd:
	/usr/src/RPM/BUILD/jss-5.8.0/native/src/test/native/org/mozilla/jss/tests/TestBufferPRFD.c:84:(.text+0x5d):
	undefined reference to `newBufferPRFileDesc'
	/usr/bin/ld.bfd:
	/usr/src/RPM/BUILD/jss-5.8.0/native/src/test/native/org/mozilla/jss/tests/TestBufferPRFD.c:90:(.text+0x269):
	undefined reference to `jb_free'
	/usr/bin/ld.bfd:
	/usr/src/RPM/BUILD/jss-5.8.0/native/src/test/native/org/mozilla/jss/tests/TestBufferPRFD.c:91:(.text+0x297):
	undefined reference to `jb_free'
	collect2: error: ld returned 1 exit status
	gmake[2]: *** [CMakeFiles/generate_c_TestBufferPRFD.dir/build.make:74: bin/TestBufferPRFD]
	Error 1

keytool-maven-plugin-2.0.2-alt1
	sisu-maven-plugin
	E: Package sisu-mojos has no installation candidate
	hsh-install: Failed to calculate package file list.

perl-Tie-DBI-1.08-alt1
	Result: FAIL
	Failed 1/2 test programs. 0/46 subtests failed.
	make: *** [Makefile:781: test_dynamic] Error 255

python3-module-chess-1.11.2-alt1
	return await command.result
	chess.engine.EngineTerminatedError: engine process died unexpectedly (exit code: -11)
	ERROR: test_sf_multipv (__main__.EngineTestCase.test_sf_multipv)
	Traceback (most recent call last):
	--
	return await command.result
	chess.engine.EngineTerminatedError: engine process died unexpectedly (exit code: -11)
	ERROR: test_sf_options (__main__.EngineTestCase.test_sf_options)
	Traceback (most recent call last):
	--
	return await command.result
	chess.engine.EngineTerminatedError: engine process died unexpectedly (exit code: -11)
	ERROR: test_sf_quit (__main__.EngineTestCase.test_sf_quit)
	Traceback (most recent call last):
	--
	return await command.result
	chess.engine.EngineTerminatedError: engine process died unexpectedly (exit code: -11)
	Ran 288 tests in 0.915s
	FAILED (errors=4, skipped=17)
	py3: exit 1 (1.06 seconds) /usr/src/RPM/BUILD/python3-module-chess-1.11.2> python
	test.py --verbose pid=1135515

python3-module-fabio-2025.10.0-alt1
	+ umask 022
	+ /bin/mkdir -p /usr/src/RPM/BUILD
	+ cd /usr/src/RPM/BUILD
	+ cd python3-module-fabio-2025.10.0
	+ env
	PYTHONPATH=/usr/src/tmp/python3-module-fabio-buildroot/usr/lib64/python3/site-packages
	python3 run_tests.py --installed
	WARNING:run_tests:Test fabio 2025.10.0 from
	/usr/src/tmp/python3-module-fabio-buildroot/usr/lib64/python3/site-packages/fabio
	.........................................................sssssssssssssssssss...............................s........ssssssssss.........sssssssssss.....s..................sss....ssssssssssssssssssssss...sss...sssssss...ss.ssssss.sssssssssssssssssssssssssss...sssss/usr/src/tmp/rpmb-tmp.86Wyg5:
	line 135: 3736491 Illegal instruction	  env
	PYTHONPATH=/usr/src/tmp/python3-module-fabio-buildroot/usr/lib64/python3/site-packages
	python3 run_tests.py --installed
	error: Bad exit status from /usr/src/tmp/rpmb-tmp.86Wyg5 (%check)
	RPM build errors:
	Bad exit status from /usr/src/tmp/rpmb-tmp.86Wyg5 (%check)

python3-module-mkdocs-1.6.1-alt2
	..................................................................................................................................................................................................................................................................................................................................................................................................................................................E...............................................s..................................................s................s...............s........................................................................................................................
	ERROR: test_watch_with_broken_symlinks
	(mkdocs.tests.livereload_tests.BuildTests.test_watch_with_broken_symlinks)
	Traceback (most recent call last):
	--
	paths = [os.path.join(root, entry.name) for entry in self.listdir(root)]
	OSError: [Errno 40] Too many levels of symbolic links:
	'/usr/src/tmp/mkdocs_test-jcivv0u3/subdir/circular/subdir/circular/subdir/circular/subdir/circular/subdir/circular/subdir/circular/subdir/circular/subdir/circular/subdir/circular/subdir/circular/subdir/circular/subdir/circular/subdir/circular/subdir/circular/subdir/circular/subdir/circular/subdir/circular/subdir/circular/subdir/circular/subdir/circular/subdir/circular/subdir/circular/subdir/circular/subdir/circular/subdir/circular/subdir/circular/subdir/circular/subdir/circular/subdir/circular/subdir/circular/subdir'
	Ran 687 tests in 8.948s
	FAILED (errors=1, skipped=4)
	INFO	 : Command's result: FAILURE
	INFO	 : Command's error: Command '['python3', '-m', 'unittest', 'discover', '-p',
	'*tests.py', 'mkdocs', '--top-level-directory', '.']' returned non-zero exit status 1.
	error: Bad exit status from /usr/src/tmp/rpmb-tmp.3BKLRl (%check)

python3-module-scikit-build-core-0.12.2-alt2
	XFAIL tests/test_builder.py::test_get_python_library - Doesn't matter if this fails,
	usually not used
	FAILED tests/test_pyproject_pep517.py::test_prepare_metadata_for_build_wheel
	FAILED tests/test_pyproject_pep517.py::test_pep639_license_files_metadata[pep639_pure]
	===== 2 failed, 412 passed, 62 skipped, 76 deselected, 1 xfailed in 38.71s =====
	INFO	 : Command's result: FAILURE
	INFO	 : Command's error: Command '['python3', '-m', 'pytest', '-m', 'not network']'
	returned non-zero exit status 1.
	error: Bad exit status from /usr/src/tmp/rpmb-tmp.BfaTa4 (%check)

python3-module-uvicorn-0.45.0-alt1
	s.......
	hasher-privd: parent: handle_io: idle time limit (3600 seconds) exceeded

python3-module-websockets-16.1-alt1
	.........................................sssssssssssssss.......ssssssss...........................................................................................................................................................................s....s.s...........................................................................................................................................................................................................................................................................................................................................................................................................................................................................................ss...........................................................................................................................................................................................................................................................................................................................................................................................sssssssssssssss.....ssssssss....................................................................................................F................s.s.....................................................................................................................................................................................................................................................................................................................................................................................................................................................................................................................................................................................................................................................................................................................................................
	FAIL: test_writing_in_send_context_fails
	(tests.sync.test_connection.ClientConnectionTests.test_writing_in_send_context_fails)
	Error when sending outgoing frame is correctly reported.
	--
	self.assertIsInstance(raised.exception.__cause__, BrokenPipeError)
	AssertionError: None is not an instance of <class 'BrokenPipeError'>
	Ran 1979 tests in 73.256s
	FAILED (failures=1, skipped=53)
	INFO	 : Command's result: FAILURE
	INFO	 : Command's error: Command '['python3', '-m', 'unittest']' returned non-zero
	exit status 1.
	error: Bad exit status from /usr/src/tmp/rpmb-tmp.Mx1Tgv (%check)

	13 error logs REMOVED from the list
binwalk3-3.1.0-alt1
dbus-cpp-5.0.6-alt1
dufs-0.46.0-alt1
fonts-ttf-IosevkaTermCurly-34.7.0-alt1
gawk-5.1.0.0.213.d04f-alt2
gnuplot-1:6.0.4-alt1
libabigail-2.8-alt1
perl-Parallel-Runner-0.014-alt1_3
pinentry-1.3.2-alt1
python3-module-httpdbg-2.1.7-alt1
python3-module-tempest-45.0.0-alt1
python3-module-zmq-27.1.0-alt1
zed-1.10.0-alt1

Total 495 error logs.


^ permalink raw reply	[flat|nested] only message in thread

only message in thread, other threads:[~2026-07-11  3:38 UTC | newest]

Thread overview: (only message) (download: mbox.gz / follow: Atom feed)
-- links below jump to the message on this page --
2026-07-11  3:38 [cyber] I: Sisyphus-20260711 x86_64 beehive_status: +16 -13 (495) ALT beekeeper

ALT Linux Sisyphus cybertalk

This inbox may be cloned and mirrored by anyone:

	git clone --mirror http://lore.altlinux.org/sisyphus-cybertalk/0 sisyphus-cybertalk/git/0.git

	# If you have public-inbox 1.1+ installed, you may
	# initialize and index your mirror using the following commands:
	public-inbox-init -V2 sisyphus-cybertalk sisyphus-cybertalk/ http://lore.altlinux.org/sisyphus-cybertalk \
		sisyphus-cybertalk@lists.altlinux.org sisyphus-cybertalk@lists.altlinux.ru sisyphus-cybertalk@lists.altlinux.com
	public-inbox-index sisyphus-cybertalk

Example config snippet for mirrors.
Newsgroup available over NNTP:
	nntp://lore.altlinux.org/org.altlinux.lists.sisyphus-cybertalk


AGPL code for this site: git clone https://public-inbox.org/public-inbox.git