ALT Linux Sisyphus cybertalk
 help / color / mirror / Atom feed
* [cyber] I: Sisyphus-20250318 x86_64 beehive_status: +21 -21 (294)
@ 2025-03-18  6:11 ALT beekeeper
  0 siblings, 0 replies; only message in thread
From: ALT beekeeper @ 2025-03-18  6:11 UTC (permalink / raw)
  To: sisyphus-cybertalk

[-- Warning: decoded text below may be mangled, UTF-8 assumed --]
[-- Attachment #1: Type: text/plain; charset=unknown-8bit, Size: 19432 bytes --]

	21 NEW error logs

ImageMagick-7.1.1.41-alt1
	MI2a:	 marked for install (shallow): libjbig2.1
	E: Couldn't find package liblcms-devel
	hsh-install: Failed to calculate package file list.

cosmic-applets-1.0.0-alt0.60.alpha.6
	Compiling cosmic-applets v0.1.1
	(/usr/src/RPM/BUILD/cosmic-applets-epoch-1.0.0-alpha.6/cosmic-applets)
	hasher-privd: parent: handle_io: idle time limit (3600 seconds) exceeded

foot-1.20.2-alt1
	[104/128] Compiling C object foot.p/main.c.o
	FAILED: foot.p/main.c.o
	cc -Ifoot.p -I. -I.. -I/usr/include/pixman-1 -I/usr/include/freetype2
	-I/usr/include/libpng16 -I/usr/include/harfbuzz -I/usr/include/glib-2.0
	-I/usr/lib64/glib-2.0/include -fdiagnostics-color=always -D_FILE_OFFSET_BITS=64
	-Wall -Winvalid-pch -Werror -std=c11 -O2 -g -DMEMFD_CREATE -DEXECVPE
	-D_GNU_SOURCE=200809L '-DFOOT_DEFAULT_TERM="foot"' '-DUTMP_ADD="add"' '-DUTMP_DEL="del"'
	'-DUTMP_DEFAULT_HELPER_PATH="/usr/lib64/utempter/utempter"' -DUTMP_DEL_HAVE_ARGUMENT=1
	-D_DEBUG -DFOOT_IME_ENABLED=1 -pedantic -fstrict-aliasing -Wstrict-aliasing
	-fmacro-prefix-map=../= -DFOOT_GRAPHEME_CLUSTERING=1 -DHAVE_XDG_TOPLEVEL_ICON -pipe
	-frecord-gcc-switches -Wall -g -O2 -flto=auto -DUTF8PROC_EXPORTS -pthread -MD -MQ
	foot.p/main.c.o -MF foot.p/main.c.o.d -o foot.p/main.c.o -c ../main.c
	../main.c: In function ‘main’:
	../main.c:519:5: error: ‘fcft_set_scaling_filter’ is deprecated
	[-Werror=deprecated-declarations]
	519 |	  fcft_set_scaling_filter(conf.tweak.fcft_filter);
	--
	190 | bool fcft_set_scaling_filter(enum fcft_scaling_filter filter) FCFT_DEPRECATED;
	cc1: all warnings being treated as errors
	[105/128] Compiling C object foot.p/reaper.c.o

gnuplot-1:6.0.2-alt2
	make[1]: Leaving directory '/usr/src/RPM/BUILD/gnuplot-6.0.2/docs'
	make[1]: Entering directory '/usr/src/RPM/BUILD/gnuplot-6.0.2/docs'
	x86_64-alt-linux-gcc  -pipe -frecord-gcc-switches -Wall -g -O2 -flto=auto  -lcerf   -o
	doc2tex doc2tex-doc2tex.o doc2tex-termdoc.o  -lm -lopenspecfun -lcerf  -lz -lpangocairo-1.0
	-lpango-1.0 -lgobject-2.0 -lharfbuzz -lcairo -lglib-2.0
	make[1]: Leaving directory '/usr/src/RPM/BUILD/gnuplot-6.0.2/docs'
	make[1]: *** Deleting file 'gnuplot.tex'
	make[1]: Entering directory '/usr/src/RPM/BUILD/gnuplot-6.0.2/docs'
	./doc2tex -figures ./gnuplot.doc gnuplot.tex
	make[1]: *** [Makefile:1099: gnuplot.tex] Segmentation fault
	make[1]: Leaving directory '/usr/src/RPM/BUILD/gnuplot-6.0.2/docs'
	make: *** [Makefile:1102: pdf] Error 2

guile30-3.0.10-alt1
	# SKIP:  0
	# XFAIL: 0
	# FAIL:  0
	# XPASS: 0
	# ERROR: 0
	make[6]: Leaving directory '/usr/src/RPM/BUILD/guile30-3.0.10/test-suite/standalone'
	--
	Running 00-repl-server.test
	ERROR: 00-repl-server.test: repl-server: HTTP inter-protocol attack - arguments:
	((system-error "fport_write" "~A" ("Broken pipe") (32)))
	make[5]: *** [Makefile:2622: tests/00-repl-server.log] Error 1

libsecret-0.21.6-alt1
	24/24 libsecret:libsecret / test-service	  OK		 14.04s
	Summary of Failures:
	6/24 libsecret:libsecret / test-prompt		 FAIL		 0.14s	 (exit status
	134 or signal 6 SIGABRT)
	Ok:		    23
	Expected Fail:	    0
	Fail:		    1
	Unexpected Pass:    0
	Skipped:	    0
	Timeout:	    0
	Full log written to
	/usr/src/RPM/BUILD/libsecret-0.21.6/x86_64-alt-linux/meson-logs/testlog.txt

llama-swap-92-alt1
	/usr/lib/golang/src/runtime/asm_amd64.s:1700
	Error:		Not equal:
	expected: 200
	--
	/usr/lib/golang/src/runtime/asm_amd64.s:1700
	Error:		"unable to start process: invalid state transition from ready to
	starting\n" does not contain "testing91931"
	Test:		TestProcess_WaitOnMultipleStarts
	Messages:	Worker 4 got wrong message
	--- FAIL: TestProcess_WaitOnMultipleStarts (0.26s)
	=== RUN   TestProcess_BrokenModelConfig

octave-9.4.0-alt1
	MI2a:	 marked for install (shallow): libSM
	E: Couldn't find package liblcms-devel
	hsh-install: Failed to calculate package file list.

oddjob-0.34.7-alt1
	@@ -0,0 +1 @@
	+ls: cannot access '/proc/3188194/fd/3': No such file or directory
	FAIL

perl-Glib-1.3294-alt1
	t/g.t ...................... ok
	#   Failed test 'check set_app_info/1'
	#   at t/h.t line 100.
	--
	t/h.t			 (Wstat: 256 (exited 1) Tests: 30 Failed: 1)
	Failed test:  19
	Non-zero exit status: 1
	--
	Result: FAIL
	Failed 1/33 test programs. 1/1193 subtests failed.
	make: *** [Makefile:1116: test_dynamic] Error 255

pytables-1:3.10.2-alt1
	......................................ss....................................................................................................................................................................................................................................................................................................................................................................................................................................................................................................................................................................................................................................................................................................................................................................................................................................................ssssssssssssssssssssssssssssssss...............................................................................................................................................................................................................................................................................................................................................................................................................................................................................................................................................................................................................................................................................................................................................................................................................................................................................................................................................................................................................................................................................................................................................................................................................................................................................................................................................................................................................................................................................................................................................................................................................................................................................................................................................................................................................................sssss....................................................................................................................................sssss...............sssss....................................................................................................................................................................ssssss......................................................................................................................................................................................................................s...............................................................................................................................................................................................................................................................................................s...s..............................................................................................................................................................................................................................................................................................................................................................................................................................................................................................................................................................................................................................
	FAIL: None (tables.tests.test_basics.ThreadingTestCase.None)
	Traceback (most recent call last):
	--
	self.assertEqual(q.get(), "OK")
	AssertionError: (<class 'tables.exceptions.HDF5ExtError'>[129 chars]700>) != 'OK'
	Ran 6860 tests in 295.114s
	FAILED (failures=1, skipped=59)
	/usr/src/RPM/BUILD/pytables-3.10.2/build/lib.linux-x86_64-cpython-312/tables/file.py:130:
	UnclosedFileWarning: Closing remaining open file: /usr/src/tmp/ThreadingTestCase1mhgbqib.h5

python-2.7.18-alt11
	self._sslobj.do_handshake()
	SSLZeroReturnError: TLS/SSL connection has been closed (EOF) (_ssl.c:735)
	Exception in thread Thread-75:
	--
	self._sslobj.do_handshake()
	SSLZeroReturnError: TLS/SSL connection has been closed (EOF) (_ssl.c:735)
	Exception in thread Thread-76:
	--
	self._sslobj.do_handshake()
	SSLZeroReturnError: TLS/SSL connection has been closed (EOF) (_ssl.c:735)
	Exception in thread Thread-77:
	--
	self._sslobj.do_handshake()
	SSLZeroReturnError: TLS/SSL connection has been closed (EOF) (_ssl.c:735)
	Exception in thread Thread-78:
	--
	self._sslobj.do_handshake()
	SSLZeroReturnError: TLS/SSL connection has been closed (EOF) (_ssl.c:735)
	Exception in thread Thread-79:
	--
	self._sslobj.do_handshake()
	SSLZeroReturnError: TLS/SSL connection has been closed (EOF) (_ssl.c:735)
	Exception in thread Thread-80:
	--
	self._sslobj.do_handshake()
	SSLZeroReturnError: TLS/SSL connection has been closed (EOF) (_ssl.c:735)
	Warning -- asyncore.socket_map was modified by test_ftplib

python3-module-aiohttp-3.11.13-alt1
	SKIPPED [1] tests/test_multipart_helpers.py:99: need more smart parser which respects
	quoted text
	SKIPPED [1] tests/test_multipart_helpers.py:446: should raise decoding error: %82 is
	invalid for latin1
	SKIPPED [1] tests/test_multipart_helpers.py:455: should raise decoding error: %E4 is
	invalid for utf-8
	SKIPPED [1] tests/test_multipart_helpers.py:510: urllib.parse.unquote is tolerate to
	standalone % chars
	--
	XFAIL tests/test_worker.py::test__create_ssl_context_with_ciphers[AsyncioWorker-pyloop]
	- reason: trustme is not supported
	FAILED
	tests/test_client_ws_functional.py::test_heartbeat_no_pong_after_send_many_messages[pyloop]
	=========== 1 failed, 3067 passed, 36 skipped, 26 xfailed in 50.49s ============
	INFO	 : Command's result: FAILURE
	INFO	 : Command's error: Command '['python3', '-m', 'pytest', '-m', 'not dev_mode
	and not internal', '--ignore=tests/autobahn', '--ignore=tests/test_proxy_functional.py',
	'--ignore-glob=tests/test_benchmarks_*', 'tests']' returned non-zero exit status 1.

python3-module-eventlet-0.39.1-alt1
	>	    assert ok, 'Expected single line "pass" in stdout'
	E	    AssertionError: Expected single line "pass" in stdout
	tests/__init__.py:358: AssertionError
	--
	assert len(mod._active) == n, 'Expected {} {} threads, got {}'.format(n, tag, mod._active)
	AssertionError: Expected 2 post-fork patched threads, got {140667889596224:
	<_MainThread(MainThread, started 140667889596224)>}
	=============================== warnings summary ===============================
	--
	=========================== short test summary info ============================
	FAILED tests/patcher_test.py::test_fork_after_monkey_patch - AssertionError: ...
	= 1 failed, 640 passed, 89 skipped, 12 deselected, 52 warnings in 73.50s (0:01:13) =
	INFO	 : Command's result: FAILURE
	INFO	 : Command's error: Command '['python3', '-m', 'pytest', '-v', '-k', 'not
	test_dns_methods_are_green and not test_noraise_dns_tcp and not test_clear and not
	test_raise_dns_tcp']' returned non-zero exit status 1.
	error: Bad exit status from /usr/src/tmp/rpm-tmp.24663 (%check)

python3-module-fastapi-0.115.11-alt1
	........................................................................ [ 97%]
	hasher-privd: parent: handle_io: idle time limit (3600 seconds) exceeded

python3-module-haversine-2.9.0-alt1
	SKIPPED [1] tests/test_performance.py:41: Skipped
	FAILED tests/test_performance.py::test_inverse_haversine - assert 1.108458855...
	=================== 1 failed, 73 passed, 2 skipped in 6.71s ====================
	INFO	 : Command's result: FAILURE
	INFO	 : Command's error: Command '['python3', '-m', 'pytest', '-ra']' returned
	non-zero exit status 1.

python3-module-hypothesis-6.129.3-alt1
	XPASS
	tests/datetime/test_zoneinfo_timezones.py::test_can_generate_prefixes_if_allowed_and_available
	- newly failing on GitHub Actions
	FAILED tests/cover/test_database_backend.py::test_database_listener_memory - ...
	FAILED tests/redis/test_redis_exampledatabase.py::test_redis_listener - hypot...
	= 2 failed, 7016 passed, 18 skipped, 6 xfailed, 1 xpassed in 452.79s (0:07:32) =
	INFO	 : Command's result: FAILURE
	INFO	 : Command's error: Command '['python3', '-m', 'pytest', '-ra',
	'-nauto', '-Wignore::UserWarning:dateutil.zoneinfo', '--ignore=tests/crosshair',
	'--ignore=tests/watchdog', 'tests']' returned non-zero exit status 1.

python3-module-jupyter_server-2.15.0-alt2
	SKIPPED [7] tests/conftest.py:42: Skipping this test because it's marked
	'integration_test'. Run integration tests using the `--integration_tests` flag.
	FAILED tests/services/kernels/test_execution_state.py::test_execution_state
	= 1 failed, 985 passed, 15 skipped, 8 deselected, 34 warnings in 212.07s (0:03:32) =
	INFO	 : Command's result: FAILURE
	INFO	 : Command's error: Command '['python3', '-m', 'pytest', '-v', '-W', 'default',
	'-m', 'not network', '-k', 'not test_restart_kernel and not test_connection']' returned
	non-zero exit status 1.

qt3-3.3.8d-alt16.2
	libbeecrypt7 is already the newest version.
	E: Couldn't find package liblcms
	hsh-install: Failed to calculate package file list.

vaultwarden-1.33.2-alt2
	Running `rustc --crate-name vaultwarden --edition=2021 src/main.rs --error-format=json
	--json=diagnostic-rendered-ansi,artifacts,future-incompat --crate-type bin
	--emit=dep-info,link -C opt-level=3 -C lto=fat -C codegen-units=1 --deny=unused
	--deny=rust_2024_compatibility --deny=rust_2021_compatibility --deny=rust_2018_idioms
	--deny=refining_impl_trait --deny=let_underscore --deny=keyword_idents
	--deny=future_incompatible '--deny=clippy::zero_sized_map_values'
	'--deny=clippy::verbose_file_reads' --deny=variant_size_differences
	'--deny=clippy::unused_self' --deny=unused_qualifications --deny=unused_lifetimes
	--deny=unused_import_braces '--deny=clippy::unused_async' --forbid=unsafe_code
	'--deny=clippy::unnested_or_patterns' '--deny=clippy::unnecessary_self_imports'
	'--deny=clippy::unnecessary_join' --deny=trivial_numeric_casts --deny=trivial_casts
	'--warn=clippy::todo' --allow=tail_expr_drop_order '--deny=clippy::string_to_string'
	'--deny=clippy::string_add_assign' --deny=single_use_lifetimes
	'--deny=clippy::option_option' --deny=noop_method_call --forbid=non_ascii_idents
	'--deny=clippy::needless_lifetimes' '--deny=clippy::needless_continue'
	'--deny=clippy::mem_forget' '--deny=clippy::match_wildcard_for_single_variants'
	'--deny=clippy::match_on_vec_items' '--deny=clippy::manual_string_new'
	'--deny=clippy::manual_instant_elapsed' '--deny=clippy::manual_assert'
	'--deny=clippy::macro_use_imports' '--deny=clippy::linkedlist'
	'--deny=clippy::iter_on_single_items' '--deny=clippy::iter_on_empty_collections'
	'--deny=clippy::inefficient_to_string' --allow=if_let_rescope
	'--deny=clippy::float_cmp_const' '--deny=clippy::filter_map_next'
	'--deny=clippy::equatable_if_let' --allow=edition_2024_expr_fragment_specifier
	--deny=deprecated_in_future '--warn=clippy::dbg_macro' '--deny=clippy::clone_on_ref_ptr'
	'--deny=clippy::cast_lossless' '--deny=clippy::case_sensitive_file_extension_comparisons'
	--cfg 'feature="mysql"' --cfg 'feature="postgresql"' --cfg 'feature="sqlite"'
	--check-cfg 'cfg(docsrs,test)' --check-cfg 'cfg(feature, values("enable_mimalloc",
	"enable_syslog", "mysql", "postgresql", "query_logger", "sqlite", "unstable",
	"vendored_openssl"))' -C metadata=f3e2d64f627c5b26 -C extra-filename=-0af19586d4f5713b
	--out-dir /usr/src/RPM/BUILD/vaultwarden-1.33.2/target/release/deps -L
	dependency=/usr/src/RPM/BUILD/vaultwarden-1.33.2/target/release/deps --extern
	argon2=/usr/src/RPM/BUILD/vaultwarden-1.33.2/target/release/deps/libargon2-acf080c07828bf3d.rlib
	--extern
	bigdecimal=/usr/src/RPM/BUILD/vaultwarden-1.33.2/target/release/deps/libbigdecimal-080b9270fb68e108.rlib
	--extern
	bytes=/usr/src/RPM/BUILD/vaultwarden-1.33.2/target/release/deps/libbytes-b6d57e4f55122b14.rlib
	--extern
	cached=/usr/src/RPM/BUILD/vaultwarden-1.33.2/target/release/deps/libcached-3860092cbc355f49.rlib
	--extern
	chrono=/usr/src/RPM/BUILD/vaultwarden-1.33.2/target/release/deps/libchrono-8acc2791150f9bcd.rlib
	--extern
	chrono_tz=/usr/src/RPM/BUILD/vaultwarden-1.33.2/target/release/deps/libchrono_tz-1c6f5d05ae20b379.rlib
	--extern
	cookie=/usr/src/RPM/BUILD/vaultwarden-1.33.2/target/release/deps/libcookie-212155927c899c65.rlib
	--extern
	cookie_store=/usr/src/RPM/BUILD/vaultwarden-1.33.2/target/release/deps/libcookie_store-6f987f4b61fe9268.rlib
	--extern
	dashmap=/usr/src/RPM/BUILD/vaultwarden-1.33.2/target/release/deps/libdashmap-f23c042e3ec9cfbb.rlib
	--extern
	data_encoding=/usr/src/RPM/BUILD/vaultwarden-1.33.2/target/release/deps/libdata_encoding-b86bcddfaa3b0aba.rlib
	--extern
	data_url=/usr/src/RPM/BUILD/vaultwarden-1.33.2/target/release/deps/libdata_url-9977f5843fd0d5cd.rlib
	--extern
	derive_more=/usr/src/RPM/BUILD/vaultwarden-1.33.2/target/release/deps/libderive_more-5971d2a31efe4390.rlib
	--extern
	diesel=/usr/src/RPM/BUILD/vaultwarden-1.33.2/target/release/deps/libdiesel-d4868d22b85c4b2c.rlib
	--extern
	diesel_derive_newtype=/usr/src/RPM/BUILD/vaultwarden-1.33.2/target/release/deps/libdiesel_derive_newtype-e46313ea15c55450.so
	--extern
	diesel_migrations=/usr/src/RPM/BUILD/vaultwarden-1.33.2/target/release/deps/libdiesel_migrations-aba97dd5e2c3bd7c.rlib
	--extern dotenvy=/usr
	hasher-privd: parent: handle_io: idle time limit (3600 seconds) exceeded

zig-0.13.0-alt1
	/usr/bin/gmake	-f CMakeFiles/stage3.dir/build.make CMakeFiles/stage3.dir/build
	hasher-privd: parent: handle_io: idle time limit (3600 seconds) exceeded

	21 error logs REMOVED from the list
altlinux-freedesktop-menu-0.70-alt1
ceph-18.2.4-alt4.1
cuneiform-1.1.0-alt6
dm-secdel-1.0.11-alt2
dopewars-1.5.12-alt2_20.1033svn
dropbear-2025.87-alt1
event-driven-servers-1.0-alt4
gnome-builder-48.0-alt1
libdb6.1-6.1.19-alt9
libgtksourceview3-3.24.11-alt1
liblcms-1.19-alt6
libpixman-3:0.44.2-alt1
plank-0.11.89-alt2
polars-cli-0.8.0-alt1
protobuf-3.25.5-alt6
python3-module-audioplayer-0.6-alt1
python3-module-cheroot-10.0.1-alt3
python3-module-hypothesis-6.129.0-alt1
python3-module-sanic-24.6.0-alt2
python3-module-websockets-14.1-alt1
signon-8.61-alt1

Total 294 error logs.


^ permalink raw reply	[flat|nested] only message in thread

only message in thread, other threads:[~2025-03-18  6:11 UTC | newest]

Thread overview: (only message) (download: mbox.gz / follow: Atom feed)
-- links below jump to the message on this page --
2025-03-18  6:11 [cyber] I: Sisyphus-20250318 x86_64 beehive_status: +21 -21 (294) ALT beekeeper

ALT Linux Sisyphus cybertalk

This inbox may be cloned and mirrored by anyone:

	git clone --mirror http://lore.altlinux.org/sisyphus-cybertalk/0 sisyphus-cybertalk/git/0.git

	# If you have public-inbox 1.1+ installed, you may
	# initialize and index your mirror using the following commands:
	public-inbox-init -V2 sisyphus-cybertalk sisyphus-cybertalk/ http://lore.altlinux.org/sisyphus-cybertalk \
		sisyphus-cybertalk@lists.altlinux.org sisyphus-cybertalk@lists.altlinux.ru sisyphus-cybertalk@lists.altlinux.com
	public-inbox-index sisyphus-cybertalk

Example config snippet for mirrors.
Newsgroup available over NNTP:
	nntp://lore.altlinux.org/org.altlinux.lists.sisyphus-cybertalk


AGPL code for this site: git clone https://public-inbox.org/public-inbox.git