* [cyber] I: Sisyphus-20250315 i586 beehive_status: +20 -27 (300)
@ 2025-03-15 15:08 ALT beekeeper
0 siblings, 0 replies; only message in thread
From: ALT beekeeper @ 2025-03-15 15:08 UTC (permalink / raw)
To: sisyphus-cybertalk
20 NEW error logs
accountsservice-23.13.9-alt5
>>> MALLOC_PERTURB_=237
GI_TYPELIB_PATH=/usr/src/RPM/BUILD/accountsservice-23.13.9/i586-alt-linux/src/libaccountsservice
MESON_TEST_ITERATION=1
MOCKLIBC_LD_PRELOAD=/usr/src/RPM/BUILD/accountsservice-23.13.9/i586-alt-linux/subprojects/mocklibc-1.0/src/libmocklibc.so.0.0.0
MSAN_OPTIONS=halt_on_error=1:abort_on_error=1:print_summary=1:print_stacktrace=1
top_builddir=/usr/src/RPM/BUILD/accountsservice-23.13.9/i586-alt-linux
LD_LIBRARY_PATH=/usr/src/RPM/BUILD/accountsservice-23.13.9/i586-alt-linux/src/libaccountsservice
UBSAN_OPTIONS=halt_on_error=1:abort_on_error=1:print_summary=1:print_stacktrace=1
top_srcdir=/usr/src/RPM/BUILD/accountsservice-23.13.9
ASAN_OPTIONS=halt_on_error=1:abort_on_error=1:print_summary=1
G_MESSAGES_DEBUG=all G_DEBUG=fatal-criticals /usr/bin/python3
/usr/src/RPM/BUILD/accountsservice-23.13.9/i586-alt-linux/../tests/test-libaccountsservice.py
TestAccountsService.test_empty
setUpClass (__main__.TestAccountsService) ... ERROR
ERROR: setUpClass (__main__.TestAccountsService)
Traceback (most recent call last):
--
Ran 0 tests in 0.004s
FAILED (errors=1)
Summary of Failures:
--
Full log written to
/usr/src/RPM/BUILD/accountsservice-23.13.9/i586-alt-linux/meson-logs/testlog.txt
FAILED: meson-internal__test
/usr/bin/meson test --no-rebuild --print-errorlogs
deepin-file-manager-6.0.50-alt1
but CMake did not find one.
Could not find a package configuration file provided by "DtkCMake" with any
of the following names:
DtkCMakeConfig.cmake
dtkcmake-config.cmake
Add the installation prefix of "DtkCMake" to CMAKE_PREFIX_PATH or set
"DtkCMake_DIR" to a directory containing one of the above files. If
"DtkCMake" provides a separate development package or SDK, be sure it has
been installed.
-- Configuring incomplete, errors occurred!
deepin-network-core-2.0.26-alt1
[179/406] Building CXX object
dock-network-plugin/CMakeFiles/dock-network-plugin.dir/dock-network-plugin_autogen/mocs_compilation.cpp.o
FAILED:
dock-network-plugin/CMakeFiles/dock-network-plugin.dir/dock-network-plugin_autogen/mocs_compilation.cpp.o
/usr/bin/c++ -DDSG_DATA_DIR=\"/usr/share/dsg\" -DDSYSINFO_PREFIX=\"\"
-DPREFIX=\"/usr\" -DQT_CORE_LIB -DQT_DBUS_LIB -DQT_GUI_LIB
-DQT_MESSAGELOGCONTEXT -DQT_NETWORK_LIB -DQT_NO_DEBUG -DQT_PRINTSUPPORT_LIB
-DQT_SVG_LIB -DQT_WIDGETS_LIB -DQT_XML_LIB -Ddock_network_plugin_EXPORTS
-I/usr/src/RPM/BUILD/dde-network-core-2.0.26/BUILD/dock-network-plugin/dock-network-plugin_autogen/include
-I/usr/include/dde-dock -I/usr/include/qt5/QGSettings
-I/usr/src/RPM/BUILD/dde-network-core-2.0.26/src
-I/usr/include/KF5/NetworkManagerQt -I/usr/include/KF5
-I/usr/src/RPM/BUILD/dde-network-core-2.0.26/dock-network-plugin/../common-plugin
-I/usr/src/RPM/BUILD/dde-network-core-2.0.26/src/realize -isystem /usr/include/dtk5/DWidget
-isystem /usr/include/dqt5 -isystem /usr/include/dqt5/QtDBus -isystem
/usr/include/dqt5/QtCore -isystem /usr/share/dqt5/../../lib/dqt5/mkspecs/linux-g++
-isystem /usr/include/dqt5/QtNetwork -isystem /usr/include/dqt5/QtWidgets
-isystem /usr/include/dqt5/QtGui -isystem /usr/include/dqt5/QtPrintSupport
-isystem /usr/include/dtk5/DGui -isystem /usr/include/dtk5/DCore
-isystem /usr/include/dqt5/QtXml -isystem /usr/include/dtk5/DLog -isystem
/usr/include/dqt5/QtSvg -pipe -frecord-gcc-switches -Wall -g -O2 -flto=auto -march=i586
-mtune=generic -fstack-protector-all -O2 -g -DNDEBUG -fPIC -DQT_PLUGIN -fPIC -MD -MT
dock-network-plugin/CMakeFiles/dock-network-plugin.dir/dock-network-plugin_autogen/mocs_compilation.cpp.o
-MF
dock-network-plugin/CMakeFiles/dock-network-plugin.dir/dock-network-plugin_autogen/mocs_compilation.cpp.o.d
-o
dock-network-plugin/CMakeFiles/dock-network-plugin.dir/dock-network-plugin_autogen/mocs_compilation.cpp.o
-c
/usr/src/RPM/BUILD/dde-network-core-2.0.26/BUILD/dock-network-plugin/dock-network-plugin_autogen/mocs_compilation.cpp
--
from
/usr/src/RPM/BUILD/dde-network-core-2.0.26/BUILD/dock-network-plugin/dock-network-plugin_autogen/mocs_compilation.cpp:11:
/usr/src/RPM/BUILD/dde-network-core-2.0.26/BUILD/dock-network-plugin/dock-network-plugin_autogen/EWIEGA46WW/../../../../dock-network-plugin/networkplugin.h:54:5:
error: 'PluginFlags' does not name a type
54 | PluginFlags flags() const override;
/usr/src/RPM/BUILD/dde-network-core-2.0.26/BUILD/dock-network-plugin/dock-network-plugin_autogen/EWIEGA46WW/../../../../dock-network-plugin/networkplugin.h:57:22:
error: 'DockPart' does not name a type
57 | QIcon icon(const DockPart &dockPart, DGuiApplicationHelper::ColorType themeType)
override;
/usr/src/RPM/BUILD/dde-network-core-2.0.26/BUILD/dock-network-plugin/dock-network-plugin_autogen/EWIEGA46WW/../../../../dock-network-plugin/networkplugin.h:58:5:
error: 'PluginMode' does not name a type; did you mean 'PluginType'?
58 | PluginMode status() const override;
| PluginType
/usr/src/RPM/BUILD/dde-network-core-2.0.26/BUILD/dock-network-plugin/dock-network-plugin_autogen/EWIEGA46WW/../../../../dock-network-plugin/networkplugin.h:57:11:
error: 'QIcon NetworkPlugin::icon(const int&, Dtk::Gui::DGuiApplicationHelper::ColorType)'
marked 'override', but does not override
57 | QIcon icon(const DockPart &dockPart, DGuiApplicationHelper::ColorType themeType)
override;
/usr/src/RPM/BUILD/dde-network-core-2.0.26/BUILD/dock-network-plugin/dock-network-plugin_autogen/EWIEGA46WW/../../../../dock-network-plugin/networkplugin.h:59:13:
error: 'QString NetworkPlugin::description() const' marked 'override', but does not
override
59 | QString description() const override;
--
[185/406] Building CXX object
dock-network-plugin/CMakeFiles/dock-network-plugin.dir/networkplugin.cpp.o
FAILED: dock-network-plugin/CMakeFiles/dock-network-plugin.dir/networkplugin.cpp.o
/usr/bin/c++ -DDSG_DATA_DIR=\"/usr/share/dsg\" -DDSYSINFO_PREFIX=\"\"
-DPREFIX=\"/usr\" -DQT_CORE_LIB -DQT_DBUS_LIB -DQT_GUI_LIB
-DQT_MESSAGELOGCONTEXT -DQT_NETWORK_LIB -DQT_NO_DEBUG -DQT_PRINTSUPPORT_LIB
-DQT_SVG_LIB -DQT_WIDGETS_LIB -DQT_XML_LIB -Ddock_network_plugin_EXPORTS
-I/usr/src/RPM/BUILD/dde-network-core-2.0.26/BUILD/dock-network-plugin/dock-network-plugin_autogen/include
-I/usr/include/dde-dock -I/usr/include/qt5/QGSettings
-I/usr/src/RPM/BUILD/dde-network-core-2.0.26/src
-I/usr/include/KF5/NetworkManagerQt -I/usr/include/KF5
-I/usr/src/RPM/BUILD/dde-network-core-2.0.26/dock-network-plugin/../common-plugin
-I/usr/src/RPM/BUILD/dde-network-core-2.0.26/src/realize -isystem /usr/include/dtk5/DWidget
-isystem /usr/include/dqt5 -isystem /usr/include/dqt5/QtDBus -isystem
/usr/include/dqt5/QtCore -isystem /usr/share/dqt5/../../lib/dqt5/mkspecs/linux-g++
-isystem /usr/include/dqt5/QtNetwork -isystem /usr/include/dqt5/QtWidgets
-isystem /usr/include/dqt5/QtGui -isystem /usr/include/dqt5/QtPrintSupport
-isystem /usr/include/dtk5/DGui -isystem /usr/include/dtk5/DCore -isystem
/usr/include/dqt5/QtXml -isystem /usr/include/dtk5/DLog -isystem /usr/include/dqt5/QtSvg
-pipe -frecord-gcc-switches -Wall -g -O2 -flto=auto -march=i586 -mtune=generic
-fstack-protector-all -O2 -g -DNDEBUG -fPIC -DQT_PLUGIN -fPIC -MD -MT
dock-network-plugin/CMakeFiles/dock-network-plugin.dir/networkplugin.cpp.o -MF
dock-network-plugin/CMakeFiles/dock-network-plugin.dir/networkplugin.cpp.o.d -o
dock-network-plugin/CMakeFiles/dock-network-plugin.dir/networkplugin.cpp.o -c
/usr/src/RPM/BUILD/dde-network-core-2.0.26/dock-network-plugin/networkplugin.cpp
In file included from
/usr/src/RPM/BUILD/dde-network-core-2.0.26/dock-network-plugin/networkplugin.cpp:5:
/usr/src/RPM/BUILD/dde-network-core-2.0.26/dock-network-plugin/networkplugin.h:54:5:
error: 'PluginFlags' does not name a type
54 | PluginFlags flags() const override;
/usr/src/RPM/BUILD/dde-network-core-2.0.26/dock-network-plugin/networkplugin.h:57:22:
error: 'DockPart' does not name a type
57 | QIcon icon(const DockPart &dockPart, DGuiApplicationHelper::ColorType themeType)
override;
/usr/src/RPM/BUILD/dde-network-core-2.0.26/dock-network-plugin/networkplugin.h:57:42:
error: 'DGuiApplicationHelper' has not been declared
57 | QIcon icon(const DockPart &dockPart, DGuiApplicationHelper::ColorType themeType)
override;
dm-secdel-1.0.11-alt2
systemctl daemon-reload
make: systemctl: No such file or directory
make: [Makefile:24: install-bin] Error 127 (ignored)
systemctl enable secdeltab
make: systemctl: No such file or directory
make: [Makefile:25: install-bin] Error 127 (ignored)
gcr4-4.3.1-alt1
+ xvfb-run /usr/bin/meson test --no-rebuild --print-errorlogs -C i586-alt-linux -t 8
_XSERVTransmkdir: ERROR: euid != 0,directory /tmp/.X11-unix will not be created.
<12>Mar 15 14:06:18 egg-hkdf: Libgcrypt warning: missing initialization - please fix
the application\r
guile-fibers-1.3.1-alt1
;;; compiled
/usr/src/.cache/guile/ccache/2.2-LE-4-3.A/usr/src/RPM/BUILD/guile-fibers-1.3.1/tests/basic.scm.go
Backtrace:
16 (apply-smob/1 #<catch-closure fc520>)
--
In procedure cdr: Wrong type argument in position 1 (expecting pair): ()
ERROR: In procedure port-write-buffer:
In procedure port-write-buffer: Wrong type argument in position 1 (expecting open port):
#<closed: file d2a10>
FAIL: tests/basic.scm
assert (condition? cv) equal to #t: ok
--
PASS: tests/concurrent-web-server.scm
1 of 11 tests failed
make[2]: *** [Makefile:1081: check-TESTS] Error 1
ktechlab-0.51.0-alt2.1
rpm-build-ninja is already the newest version.
E: Couldn't find package kf5-khtml-devel
hsh-install: Failed to calculate package file list.
libextractor-1.13-alt1
Selected version libflac-devel#1.5.0-alt1:sisyphus+374510.100.1.1@1739436141 for
libflac-devel>=1.3
E: Couldn't find package libqt4-devel
hsh-install: Failed to calculate package file list.
libgupnp-igd-1.6.0-alt1
1/1 gupnp-simple-igd FAIL 8.32s killed by signal 5 SIGTRAP
Summary of Failures:
1/1 gupnp-simple-igd FAIL 8.32s killed by signal 5 SIGTRAP
Ok: 0
Expected Fail: 0
Fail: 1
Unexpected Pass: 0
Skipped: 0
Timeout: 0
Full log written to
/usr/src/RPM/BUILD/gupnp-igd-1.6.0/i586-alt-linux/meson-logs/testlog.txt
micmac-1.1.1-alt1.1
rpm-macros-cmake is already the newest version.
E: Couldn't find package libqt4-devel
hsh-install: Failed to calculate package file list.
pdfmixtool-1.1.1-alt2.1
/usr/src/RPM/BUILD/pdfmixtool-1.1.1/src/operations/extract_images.cpp: In lambda function:
/usr/src/RPM/BUILD/pdfmixtool-1.1.1/src/operations/extract_images.cpp:170:29: error:
'PointerHolder' was not declared in this scope
170 | PointerHolder<Buffer> buffer =
obj.getStreamData(qpdf_dl_all);
/usr/src/RPM/BUILD/pdfmixtool-1.1.1/src/operations/extract_images.cpp:170:49: error:
expected primary-expression before '>' token
170 | PointerHolder<Buffer> buffer =
obj.getStreamData(qpdf_dl_all);
/usr/src/RPM/BUILD/pdfmixtool-1.1.1/src/operations/extract_images.cpp:170:51: error:
'buffer' was not declared in this scope; did you mean 'Buffer'?
170 | PointerHolder<Buffer> buffer =
obj.getStreamData(qpdf_dl_all);
| Buffer
/usr/src/RPM/BUILD/pdfmixtool-1.1.1/src/operations/extract_images.cpp:175:85: error:
no matching function for call to 'Magick::Blob::Blob(<brace-enclosed initializer list>)'
175 | Magick::Blob blob{buffer->getBuffer(),
buffer->getSize()};
python3-module-aiohttp-3.11.13-alt1
SKIPPED [1] tests/test_http_parser.py:1593: C based HTTP parser not available
SKIPPED [1] tests/test_multipart_helpers.py:446: should raise decoding error: %82 is
invalid for latin1
SKIPPED [1] tests/test_multipart_helpers.py:455: should raise decoding error: %E4 is
invalid for utf-8
SKIPPED [1] tests/test_multipart_helpers.py:510: urllib.parse.unquote is tolerate to
standalone % chars
--
XFAIL
tests/test_worker.py::test__create_ssl_context_without_certs_and_ciphers[AsyncioWorker-pyloop]
- reason: trustme is not supported
FAILED
tests/test_client_ws_functional.py::test_heartbeat_no_pong_after_send_many_messages[pyloop]
====== 1 failed, 3067 passed, 36 skipped, 26 xfailed in 68.88s (0:01:08) =======
INFO : Command's result: FAILURE
INFO : Command's error: Command '['python3', '-m', 'pytest', '-m', 'not dev_mode
and not internal', '--ignore=tests/autobahn', '--ignore=tests/test_proxy_functional.py',
'--ignore-glob=tests/test_benchmarks_*', 'tests']' returned non-zero exit status 1.
python3-module-fastapi-0.115.11-alt1
........................................................................ [ 97%]
hasher-privd: parent: handle_io: idle time limit (3600 seconds) exceeded
python3-module-jupyter_server-2.15.0-alt2
SKIPPED [7] tests/conftest.py:42: Skipping this test because it's marked
'integration_test'. Run integration tests using the `--integration_tests` flag.
FAILED tests/services/kernels/test_execution_state.py::test_execution_state
= 1 failed, 985 passed, 15 skipped, 8 deselected, 34 warnings in 205.34s (0:03:25) =
INFO : Command's result: FAILURE
INFO : Command's error: Command '['python3', '-m', 'pytest', '-v', '-W', 'default',
'-m', 'not network', '-k', 'not test_restart_kernel and not test_connection']' returned
non-zero exit status 1.
python3-module-oslo.db-17.1.0-alt1
{9}
oslo_db.tests.sqlalchemy.test_update_match.MySQLUpdateMatchTest.test_update_specimen_query_mismatch_error
... SKIPPED: Backend 'mysql+pymysql' is unavailable: Could not connect
ERROR [oslo_db.api] DB exceeded retry limit.
Traceback (most recent call last):
--
raise mismatch_error
testtools.matchers._impl.MismatchError: !=:
reference = 'soft_deleted_project_id_test_model.project_id IN (:project_id_1, NULL)'
python3-module-pytest-xprocess-1.0.2-alt1
tests/test_process_initialization.py::test_startup_without_pattern[s1] PASSED [ 49%]
tests/test_process_initialization.py::test_startup_without_pattern[s2] FAILED [ 50%]
tests/test_process_initialization.py::test_startup_without_pattern[s3] PASSED [ 52%]
tests/test_process_initialization.py::test_startup_with_pattern_and_callback[s1-will
not match-21] PASSED [ 54%]
tests/test_process_initialization.py::test_startup_with_pattern_and_callback[s2-spam,
bacon, eggs-30] FAILED [ 56%]
tests/test_process_initialization.py::test_startup_with_pattern_and_callback[s3-finally
started-130] PASSED [ 58%]
--
> sock.connect(("localhost", tcp_port))
E ConnectionRefusedError: [Errno 111] Connection refused
tests/test_process_initialization.py:16: ConnectionRefusedError
--
> sock.connect(("localhost", tcp_port))
E ConnectionRefusedError: [Errno 111] Connection refused
tests/test_process_initialization.py:16: ConnectionRefusedError
=========================== short test summary info ============================
FAILED tests/test_process_initialization.py::test_startup_without_pattern[s2]
FAILED
tests/test_process_initialization.py::test_startup_with_pattern_and_callback[s2-spam,
bacon, eggs-30]
======================== 2 failed, 49 passed in 35.66s =========================
--
INFO : Command's result: FAILURE
INFO : Command's error: Command '['pytest', '-vra']' returned non-zero exit status 1.
python3-module-setuptools-1:75.8.0-alt3
===== 1218 passed, 42 skipped, 10 xfailed, 2 xpassed in 431.49s (0:07:11) ======
hasher-privd: parent: handle_io: idle time limit (3600 seconds) exceeded
python3-module-textdistance-4.6.3-alt1
XFAIL tests/test_external.py::test_list_of_numbers[Levenshtein] - reason: module not
installed: distance.levenshtein
FAILED tests/test_compression/test_common.py::test_is_normalized[alg0] - hypo...
============= 1 failed, 417 passed, 12 xfailed in 90.83s (0:01:30) =============
INFO : Command's result: FAILURE
INFO : Command's error: Command '['python3', '-m', 'pytest', '-vra']' returned
non-zero exit status 1.
python3-module-websockets-14.1-alt1
.........................................................................................................................................................................................................s....s.s...........................................................................................................................................................................................................................................................................................................................................................................................................................................................................ss.......s..................................................................................................................................s.......................................................................................................................................s...........................................................................................................................s........................s.............................................EF..............sss.......................s.............................................EF............................................................................................................................................................................................................................s.................................................................................................................................................................................................................................................................................................................................................................................
ERROR: test_writing_in_recv_events_fails
(tests.sync.test_connection.ClientConnectionTests.test_writing_in_recv_events_fails)
Error when responding to incoming frames is correctly reported.
--
raise self.protocol.close_exc from original_exc
websockets.exceptions.ConnectionClosedError: no close frame received or sent
ERROR: test_writing_in_recv_events_fails
(tests.sync.test_connection.ServerConnectionTests.test_writing_in_recv_events_fails)
Error when responding to incoming frames is correctly reported.
--
raise self.protocol.close_exc from original_exc
websockets.exceptions.ConnectionClosedError: no close frame received or sent
FAIL: test_writing_in_send_context_fails
(tests.sync.test_connection.ClientConnectionTests.test_writing_in_send_context_fails)
Error when sending outgoing frame is correctly reported.
--
self.assertIsInstance(raised.exception.__cause__, BrokenPipeError)
AssertionError: None is not an instance of <class 'BrokenPipeError'>
FAIL: test_writing_in_send_context_fails
(tests.sync.test_connection.ServerConnectionTests.test_writing_in_send_context_fails)
Error when sending outgoing frame is correctly reported.
--
self.assertIsInstance(raised.exception.__cause__, BrokenPipeError)
AssertionError: None is not an instance of <class 'BrokenPipeError'>
Ran 1819 tests in 66.802s
FAILED (failures=2, errors=2, skipped=15)
INFO : Command's result: FAILURE
INFO : Command's error: Command '['python3', '-m', 'unittest']' returned non-zero
exit status 1.
qtcurve-2:1.9.1-alt3.git4e56a76a
MI2a: marked for install (shallow): rpm-macros-ninja-build
E: Couldn't find package rpm-macros-qt4
hsh-install: Failed to calculate package file list.
27 error logs REMOVED from the list
auditd-plugin-clickhouse-lite-0.1.8-alt2
cockpit-311.1-alt3
deepin-editor-6.5.11-alt1
deepin-movie-6.0.11-alt1
deepin-system-monitor-6.5.2-alt1
gmsh-4.11.1-alt1
itest-1.4.1.1-alt1.svn77.1.qa1
kile-2.9.93-alt1
libabseil-cpp2301.0.0-20230125.3-alt4
libgtk-engines-default-1:2.20.2-alt3.2
libkate-0.4.1-alt1.6
libpari23-2.3.5-alt1_18
nheko-0.11.3-alt1.1
pdal-2.8.1-alt1
php8.1-intl-8.1.31-alt1
python3-module-aiohttp-3.11.12-alt1
python3-module-cheroot-10.0.1-alt3
python3-module-ipykernel-6.29.5-alt1
python3-module-jupyter_server-2.15.0-alt1
python3-module-opentelemetry-contrib-0.47b0-alt1.1
python3-module-pexpect-4.9.0-alt1
python3-module-pytest-examples-0.0.13-alt1
qt4-4.8.7-alt51
qt6-tools-6.8.2-alt1
samba-4.20.7-alt1
wireplumber-0.4-0.4.17-alt3
zziplib-0.13.72-alt1
Total 300 error logs.
^ permalink raw reply [flat|nested] only message in thread
only message in thread, other threads:[~2025-03-15 15:08 UTC | newest]
Thread overview: (only message) (download: mbox.gz / follow: Atom feed)
-- links below jump to the message on this page --
2025-03-15 15:08 [cyber] I: Sisyphus-20250315 i586 beehive_status: +20 -27 (300) ALT beekeeper
ALT Linux Sisyphus cybertalk
This inbox may be cloned and mirrored by anyone:
git clone --mirror http://lore.altlinux.org/sisyphus-cybertalk/0 sisyphus-cybertalk/git/0.git
# If you have public-inbox 1.1+ installed, you may
# initialize and index your mirror using the following commands:
public-inbox-init -V2 sisyphus-cybertalk sisyphus-cybertalk/ http://lore.altlinux.org/sisyphus-cybertalk \
sisyphus-cybertalk@lists.altlinux.org sisyphus-cybertalk@lists.altlinux.ru sisyphus-cybertalk@lists.altlinux.com
public-inbox-index sisyphus-cybertalk
Example config snippet for mirrors.
Newsgroup available over NNTP:
nntp://lore.altlinux.org/org.altlinux.lists.sisyphus-cybertalk
AGPL code for this site: git clone https://public-inbox.org/public-inbox.git