* [cyber] I: Sisyphus-20250315 x86_64 beehive_status: +6 -17 (280)
@ 2025-03-15 10:41 ALT beekeeper
0 siblings, 0 replies; only message in thread
From: ALT beekeeper @ 2025-03-15 10:41 UTC (permalink / raw)
To: sisyphus-cybertalk
6 NEW error logs
editorconfig-0.12.8-alt1
gmake[2]: Entering directory
'/usr/src/RPM/BUILD/editorconfig-core-c-0.12.8/x86_64-alt-linux'
[ 81%] Linking C shared library ../../lib/libeditorconfig.so
cd /usr/src/RPM/BUILD/editorconfig-core-c-0.12.8/x86_64-alt-linux/src/lib && /usr/bin/cmake
-E cmake_link_script CMakeFiles/editorconfig_shared.dir/link.txt --verbose=1
/usr/bin/cc -fPIC -pipe -frecord-gcc-switches -Wall -g -O2 -flto=auto
-Wl,--dependency-file=CMakeFiles/editorconfig_shared.dir/link.d -shared
-Wl,-soname,libeditorconfig.so.0 -o ../../lib/libeditorconfig.so.0.12.8
CMakeFiles/editorconfig_shared.dir/ec_glob.c.o
CMakeFiles/editorconfig_shared.dir/editorconfig.c.o
CMakeFiles/editorconfig_shared.dir/editorconfig_handle.c.o
CMakeFiles/editorconfig_shared.dir/ini.c.o CMakeFiles/editorconfig_shared.dir/misc.c.o
/usr/lib64/libpcre2-8.so
cd /usr/src/RPM/BUILD/editorconfig-core-c-0.12.8/x86_64-alt-linux/src/lib && /usr/bin/cmake
-E cmake_symlink_library ../../lib/libeditorconfig.so.0.12.8 ../../lib/libeditorconfig.so.0
../../lib/libeditorconfig.so
gmake[2]: Leaving directory
'/usr/src/RPM/BUILD/editorconfig-core-c-0.12.8/x86_64-alt-linux'
gmake[1]: Entering directory
'/usr/src/RPM/BUILD/editorconfig-core-c-0.12.8/x86_64-alt-linux'
[ 81%] Built target editorconfig_shared
gmake[1]: Leaving directory
'/usr/src/RPM/BUILD/editorconfig-core-c-0.12.8/x86_64-alt-linux'
gmake: *** [Makefile:156: all] Error 2
fractal-7-alt1
373 | Json(()),
hasher-privd: parent: handle_io: idle time limit (3600 seconds) exceeded
python3-module-easyprocess-1.1-alt2
tests/test_fast/test_proc.py::test_start3 PASSED [ 15%]
tests/test_fast/test_proc.py::test_alive FAILED [ 18%]
tests/test_fast/test_proc.py::test_std PASSED [ 21%]
--
tests/test_fast/test_proc.py::test_wrap PASSED [ 26%]
tests/test_fast/test_proc.py::test_with FAILED [ 28%]
tests/test_fast/test_proc.py::test_parse PASSED [ 31%]
--
=========================== short test summary info ============================
FAILED tests/test_fast/test_proc.py::test_alive - assert False
FAILED tests/test_fast/test_proc.py::test_with - assert False
=================== 2 failed, 36 passed in 77.87s (0:01:17) ====================
python3-module-pyshark-0.6-alt2
==================================== ERRORS ====================================
_________________ ERROR at teardown of test_sum_lengths[True] __________________
request = <SubRequest 'simple_xml_and_json_capture' for <Function test_sum_lengths[True]>>
--
return await asyncio.wait_for(process.wait(), 1)
except asyncTimeoutError:
self._log.debug(
"Waiting for process to close failed, may have zombie process.")
except ProcessLookupError:
pass
except OSError:
if os.name != "nt":
--
raise RuntimeError('This event loop is already running')
RuntimeError: This event loop is already running
warnings.warn(pytest.PytestUnraisableExceptionWarning(msg))
--
=========================== short test summary info ============================
ERROR ../tests/test_basic_parsing.py::test_sum_lengths[True] - pyshark.captur...
================== 73 passed, 123 warnings, 1 error in 21.15s ==================
tmux-3.5a-alt1
sh kill-session-process-exit.sh
sh new-session-base-index.sh
sh new-session-command.sh
sh new-session-environment.sh
sh new-session-no-client.sh
sh new-session-size.sh
sh new-window-command.sh
sh osc-11colours.sh
make: *** [Makefile:9: osc-11colours.sh] Error 1
make: Leaving directory '/usr/src/RPM/BUILD/tmux-3.5a/regress'
zig-0.13.0-alt1
/usr/bin/gmake -f CMakeFiles/stage3.dir/build.make CMakeFiles/stage3.dir/build
hasher-privd: parent: handle_io: idle time limit (3600 seconds) exceeded
17 error logs REMOVED from the list
chromium-gost-125.0.6422.112-alt1
dopewars-1.5.12-alt2_20.1033svn
gnuplot-1:6.0.2-alt2
libgupnp-igd-1.6.0-alt1
libsecret-0.21.6-alt1
libwebrtc-audio-processing-1.3-alt2
php8.1-intl-8.1.31-alt1
python-2.7.18-alt11
python3-module-eventlet-0.39.1-alt1
python3-module-hypothesis-6.129.0-alt1
python3-module-pexpect-4.9.0-alt1
python3-module-sanic-24.6.0-alt2
redis-7.2.7-alt1
snapd-glib-2-1.66-alt1
vaultwarden-1.33.2-alt2
verilator-5.018-alt1
zstd-1.5.5-alt2
Total 280 error logs.
^ permalink raw reply [flat|nested] only message in thread
only message in thread, other threads:[~2025-03-15 10:41 UTC | newest]
Thread overview: (only message) (download: mbox.gz / follow: Atom feed)
-- links below jump to the message on this page --
2025-03-15 10:41 [cyber] I: Sisyphus-20250315 x86_64 beehive_status: +6 -17 (280) ALT beekeeper
ALT Linux Sisyphus cybertalk
This inbox may be cloned and mirrored by anyone:
git clone --mirror http://lore.altlinux.org/sisyphus-cybertalk/0 sisyphus-cybertalk/git/0.git
# If you have public-inbox 1.1+ installed, you may
# initialize and index your mirror using the following commands:
public-inbox-init -V2 sisyphus-cybertalk sisyphus-cybertalk/ http://lore.altlinux.org/sisyphus-cybertalk \
sisyphus-cybertalk@lists.altlinux.org sisyphus-cybertalk@lists.altlinux.ru sisyphus-cybertalk@lists.altlinux.com
public-inbox-index sisyphus-cybertalk
Example config snippet for mirrors.
Newsgroup available over NNTP:
nntp://lore.altlinux.org/org.altlinux.lists.sisyphus-cybertalk
AGPL code for this site: git clone https://public-inbox.org/public-inbox.git