ALT Linux Sisyphus cybertalk
 help / color / mirror / Atom feed
* [cyber] I: Sisyphus-20250313 x86_64 beehive_status: +15 -14 (291)
@ 2025-03-13  5:53 ALT beekeeper
  0 siblings, 0 replies; only message in thread
From: ALT beekeeper @ 2025-03-13  5:53 UTC (permalink / raw)
  To: sisyphus-cybertalk

	15 NEW error logs

cilk-5.4.6-alt13
	perl -I. ./bfnnconv.pl ./cilk-faq.bfnn
	no ./cilk-faq.xrefdb (No such file or directory) at ./bfnnconv.pl line 43.
	S0	    \rS1		 \rQ1.1		\rQ1.2	       \rQ1.3	      \rQ1.4	     \rQ1.5
	\rQ1.6	       \rQ1.7	      \rQ1.8	     \rS2	  \rQ2.1		 \rQ2.2
	\rQ2.3	       \rQ2.4	      \rS3	   \rQ3.1	  \rQ3.2		 \rQ3.3
	\rQ3.4	       \runknown question `compile' at ./bfnnconv.pl line 221, <> line 263.
	--
	libtool: install: /usr/libexec/rpm-build/install -p .libs/libcilk.p.so.0.0.0
	/usr/src/tmp/cilk-buildroot/usr/lib64/libcilk.p.so.0.0.0
	/bin/install: cannot stat '.libs/libcilk.p.so.0.0.0': No such file or directory
	make[2]: *** [Makefile:567: install-libLTLIBRARIES] Error 1

cosmic-applets-1.0.0-alt0.60.alpha.6
	Compiling cosmic-applets v0.1.1
	(/usr/src/RPM/BUILD/cosmic-applets-epoch-1.0.0-alpha.6/cosmic-applets)
	hasher-privd: parent: handle_io: idle time limit (3600 seconds) exceeded

gnuplot-1:6.0.2-alt2
	make[1]: Leaving directory '/usr/src/RPM/BUILD/gnuplot-6.0.2/docs'
	make[1]: Entering directory '/usr/src/RPM/BUILD/gnuplot-6.0.2/docs'
	x86_64-alt-linux-gcc  -pipe -frecord-gcc-switches -Wall -g -O2 -flto=auto  -lcerf   -o
	doc2tex doc2tex-doc2tex.o doc2tex-termdoc.o  -lm -lopenspecfun -lcerf  -lz -lpangocairo-1.0
	-lpango-1.0 -lgobject-2.0 -lharfbuzz -lcairo -lglib-2.0
	make[1]: Leaving directory '/usr/src/RPM/BUILD/gnuplot-6.0.2/docs'
	make[1]: *** Deleting file 'gnuplot.tex'
	make[1]: Entering directory '/usr/src/RPM/BUILD/gnuplot-6.0.2/docs'
	./doc2tex -figures ./gnuplot.doc gnuplot.tex
	make[1]: *** [Makefile:1099: gnuplot.tex] Segmentation fault
	make[1]: Leaving directory '/usr/src/RPM/BUILD/gnuplot-6.0.2/docs'
	make: *** [Makefile:1102: pdf] Error 2

java-1.8.0-openjdk-0:1.8.0.442.b06-alt1_1jpp8
	+ /usr/bin/gmake VERBOSE= LOG_LEVEL=trace -R -I
	/usr/src/RPM/BUILD/java-1.8.0-openjdk-1.8.0.442.b06-0.x86_64/openjdk/make/common
	-f adlc.make -r -rRw
	-I/usr/src/RPM/BUILD/java-1.8.0-openjdk-1.8.0.442.b06-0.x86_64/openjdk/make/common -j2
	-Otarget --sync-mutex=fnm:/usr/src/tmp/Gm -j -Bo919
	gmake: *** cannot open output sync mutex /usr/src/tmp/Gm: No such file or directory.  Stop.
	gmake[5]: ***
	[/usr/src/RPM/BUILD/java-1.8.0-openjdk-1.8.0.442.b06-0.x86_64/jdk8u442-b06/hotspot/make/linux/makefiles/top.make:91:
	ad_stuff] Error 2

nss-3.109-alt1
	NSS_DISABLE_PCLMUL=
	NSS_DISABLE_AVX=
	NSS_DISABLE_ARM_NEON=
	NSS_DISABLE_SSSE3=
	Tests summary:
	Passed:		    76066
	Failed:		    1
	Failed with core:   0
	ASan failures:	    0
	Unknown status:     0

oddjob-0.34.7-alt1
	@@ -0,0 +1 @@
	+ls: cannot access '/proc/1830444/fd/4': No such file or directory
	FAIL

perl-Crypt-RSA-1.99-alt2
	t/11-wrapper.t	   (Wstat: 0 Tests: 13 Failed: 1)
	Failed test:  12
	Parse errors: Tests out of sequence.  Found (5) but expected (6)
	--
	Tests out of sequence.	Found (9) but expected (10)
	Displayed the first 5 of 9 TAP syntax errors.
	Re-run prove with the -p option to see them all.
	--
	Result: FAIL
	Failed 1/16 test programs. 1/95 subtests failed.
	make: *** [Makefile:791: test_dynamic] Error 255

polars-cli-0.8.0-alt1
	Compiling polars-cli v0.8.0 (/usr/src/RPM/BUILD/polars-cli-0.8.0)
	hasher-privd: parent: handle_io: idle time limit (3600 seconds) exceeded

python3-module-jupyter_server-2.15.0-alt2
	SKIPPED [7] tests/conftest.py:42: Skipping this test because it's marked
	'integration_test'. Run integration tests using the `--integration_tests` flag.
	FAILED tests/services/kernels/test_execution_state.py::test_execution_state
	= 1 failed, 985 passed, 15 skipped, 8 deselected, 34 warnings in 232.04s (0:03:52) =
	INFO	 : Command's result: FAILURE
	INFO	 : Command's error: Command '['python3', '-m', 'pytest', '-v', '-W', 'default',
	'-m', 'not network', '-k', 'not test_restart_kernel and not test_connection']' returned
	non-zero exit status 1.

python3-module-oslo.db-17.1.0-alt1
	{14}
	oslo_db.tests.sqlalchemy.test_utils.TestGetInnoDBTables.test_skip_tables_use_passed_value
	... SKIPPED: Backend 'mysql+pymysql' is unavailable: Could not connect
	{14} oslo_db.tests.sqlalchemy.test_utils.TestModelQuery.test_project_filter_allow_none
	[0.002076s] ... FAILED
	Captured traceback:
	--
	raise mismatch_error
	testtools.matchers._impl.MismatchError: !=:
	reference = 'soft_deleted_project_id_test_model.project_id IN (:project_id_1, NULL)'
	--
	raise mismatch_error
	testtools.matchers._impl.MismatchError: !=:
	reference = 'soft_deleted_project_id_test_model.project_id IN (:project_id_1, NULL)'

python3-module-pyshark-0.6-alt2
	>		raise KeyError(f"Packet of index {packet_index} does not exist in capture")
	E		KeyError: 'Packet of index 0 does not exist in capture'
	.tox/py3/lib/python3/site-packages/pyshark/capture/file_capture.py:75: KeyError
	--
	=========================== short test summary info ============================
	FAILED ../tests/test_cap_operations.py::test_getting_packet_summary - KeyErro...
	================= 1 failed, 72 passed, 121 warnings in 27.89s ==================

python3-module-schemathesis-3.39.9-alt1
	>	assert "Schemathesis test server is running!" in stdout
	E	AssertionError: assert 'Schemathesis test server is running!' in ''
	/usr/src/RPM/BUILD/python3-module-schemathesis-3.39.9/test/test_app.py:42: AssertionError
	--
	XPASS test/contrib/test_unique_data.py::test_python_tests[None] - The
	`schemathesis.contrib.unique_data` hook is deprecated
	FAILED test/test_app.py::test_app[flask] - AssertionError: assert 'Schemathes...
	FAILED test/test_app.py::test_app[aiohttp] - AssertionError: assert 'Schemath...
	= 2 failed, 2745 passed, 2 skipped, 4 xpassed, 330 warnings in 1175.91s (0:19:35) =
	INFO	 : Command's result: FAILURE
	INFO	 : Command's error: Command '['python3', '-m', 'pytest', 'test/']' returned
	non-zero exit status 1.

python3-module-silx-2.2.1-alt1
	SKIPPED [2] ../../../../lib/python3/site-packages/_pytest/unittest.py:385: Network or
	silx website not available
	FAILED
	.run_venv/lib64/python3/site-packages/silx/io/test/test_h5py_utils.py::TestH5pyUtils::test_modes_multi_process
	================ 1 failed, 1151 passed, 1407 skipped in 43.09s =================
	INFO	 : Command's result: FAILURE
	INFO	 : Command's error: Command '['python', '-c', "import silx.test, sys;
	sys.exit(silx.test.run_tests(verbosity=1, args=['-ra', '-Wignore', '--low-mem']))"]'
	returned non-zero exit status 1.
	error: Bad exit status from /usr/src/tmp/rpm-tmp.32272 (%check)

tmux-3.5a-alt1
	sh cursor-test4.sh
	sh format-strings.sh
	sh has-session-return.sh
	sh if-shell-TERM.sh
	sh if-shell-error.sh
	sh if-shell-nested.sh
	sh input-keys.sh
	[FAIL] Tab -> ^I (Got:	       )
	make: *** [Makefile:9: input-keys.sh] Error 1
	make: Leaving directory '/usr/src/RPM/BUILD/tmux-3.5a/regress'

zig-0.13.0-alt1
	-- Install configuration: "RelWithDebInfo"
	hasher-privd: parent: handle_io: idle time limit (3600 seconds) exceeded

	14 error logs REMOVED from the list
Mayavi-4.8.2-alt4
auditd-plugin-clickhouse-lite-0.1.8-alt2
autogen-5.18.16-alt1
erlang-proper-1.4.0.19.3bbd-alt1
ghc9.2-9.2.8-alt2
gmsh-4.11.1-alt1
litmus-0.15.0-alt1
python-2.7.18-alt11
python3-module-anyio-4.8.0-alt2
python3-module-opentelemetry-contrib-0.47b0-alt1.1
python3-module-syrupy-4.9.0-alt1
qemu-9.2.1-alt1
samba-4.20.7-alt1
zziplib-0.13.72-alt1

Total 291 error logs.


^ permalink raw reply	[flat|nested] only message in thread

only message in thread, other threads:[~2025-03-13  5:53 UTC | newest]

Thread overview: (only message) (download: mbox.gz / follow: Atom feed)
-- links below jump to the message on this page --
2025-03-13  5:53 [cyber] I: Sisyphus-20250313 x86_64 beehive_status: +15 -14 (291) ALT beekeeper

ALT Linux Sisyphus cybertalk

This inbox may be cloned and mirrored by anyone:

	git clone --mirror http://lore.altlinux.org/sisyphus-cybertalk/0 sisyphus-cybertalk/git/0.git

	# If you have public-inbox 1.1+ installed, you may
	# initialize and index your mirror using the following commands:
	public-inbox-init -V2 sisyphus-cybertalk sisyphus-cybertalk/ http://lore.altlinux.org/sisyphus-cybertalk \
		sisyphus-cybertalk@lists.altlinux.org sisyphus-cybertalk@lists.altlinux.ru sisyphus-cybertalk@lists.altlinux.com
	public-inbox-index sisyphus-cybertalk

Example config snippet for mirrors.
Newsgroup available over NNTP:
	nntp://lore.altlinux.org/org.altlinux.lists.sisyphus-cybertalk


AGPL code for this site: git clone https://public-inbox.org/public-inbox.git