* [cyber] I: Sisyphus-20250331 x86_64 beehive_status: +10 -8 (245)
@ 2025-03-31 5:49 ALT beekeeper
0 siblings, 0 replies; only message in thread
From: ALT beekeeper @ 2025-03-31 5:49 UTC (permalink / raw)
To: sisyphus-cybertalk
10 NEW error logs
altlinux-freedesktop-menu-0.70-alt1
+ j=altlinux-webdevelopment.directory
+ grep altlinux-webdevelopment.directory ignore.list
+ grep 'Name\[ru\]=' desktop-directories/altlinux-webdevelopment.directory
+ for i in desktop-directories/*.directory
++ basename desktop-directories/altlinux-xfce.directory
+ j=altlinux-xfce.directory
+ grep altlinux-xfce.directory ignore.list
+ rm ignore.list
+ '[' 0 -gt 0 ']'
+ exit 1
bind-9.18.35-alt1
SKIPPED [1] nzd2nzf/tests_sh_nzd2nzf.py:23: Prerequisites missing.
FAILED dupsigs/tests_sh_dupsigs.py::test_dupsigs
- subprocess.CalledProcessError: Command '['/bin/sh',
'/usr/src/RPM/BUILD/bind-9.18.35/bin/tests/system/dupsigs_tmp_uuneul9h/tests.sh']'
returned non-zero exit status 1.
======= 1 failed, 42 passed, 9 skipped, 1 warning in 1073.05s (0:17:53) ========
dm-secdel-1.0.11-alt2
systemctl daemon-reload
make: systemctl: No such file or directory
make: [Makefile:24: install-bin] Error 127 (ignored)
systemctl enable secdeltab
make: systemctl: No such file or directory
make: [Makefile:25: install-bin] Error 127 (ignored)
gnuplot-1:6.0.2-alt2
make[1]: Leaving directory '/usr/src/RPM/BUILD/gnuplot-6.0.2/docs'
make[1]: Entering directory '/usr/src/RPM/BUILD/gnuplot-6.0.2/docs'
x86_64-alt-linux-gcc -pipe -frecord-gcc-switches -Wall -g -O2 -flto=auto -lcerf -o
doc2tex doc2tex-doc2tex.o doc2tex-termdoc.o -lm -lopenspecfun -lcerf -lz -lpangocairo-1.0
-lpango-1.0 -lgobject-2.0 -lharfbuzz -lcairo -lglib-2.0
make[1]: Leaving directory '/usr/src/RPM/BUILD/gnuplot-6.0.2/docs'
make[1]: *** Deleting file 'gnuplot.tex'
make[1]: Entering directory '/usr/src/RPM/BUILD/gnuplot-6.0.2/docs'
./doc2tex -figures ./gnuplot.doc gnuplot.tex
make[1]: *** [Makefile:1099: gnuplot.tex] Segmentation fault
make[1]: Leaving directory '/usr/src/RPM/BUILD/gnuplot-6.0.2/docs'
make: *** [Makefile:1102: pdf] Error 2
mailutils-3.17.90-alt1
## GNU Mailutils 3.17.90 test suite. ##
1: mail version FAILED (version.at:19)
2: reading mail with HOME unset ok
--
## Test results. ##
ERROR: 21 tests were run,
1 failed unexpectedly.
mumps-5.3.5-alt3
/usr/lib64/openmpi/bin/mpicc -shared graph.o gbipart.o gbisect.o ddcreate.o ddbisect.o
nestdiss.o multisector.o gelim.o bucket.o tree.o symbfac.o interface.o sort.o minpriority.o
-Wl,-soname,libpord-5.3.so -o libpord-5.3.so -Wl,--as-needed,-rpath,/usr/lib64/openmpi/lib
-L/usr/lib64/openmpi/lib -Wl,-z,defs
lto1: internal compiler error: resolution sub id 0x1b1cec8cad1fd09d not in object file
libbacktrace could not find executable to open
--
See <http://bugzilla.altlinux.org> for instructions.
lto-wrapper: fatal error: x86_64-alt-linux-gcc returned 1 exit status
compilation terminated.
ld: error: lto-wrapper failed
collect2: error: ld returned 1 exit status
make[2]: *** [Makefile:34: libpord.so] Error 1
python3-module-mdp-3.6.0.15.g64f14eee-alt4
> return func(*args, **kwds)
E AssertionError:
E Not equal to tolerance rtol=0.01, atol=0
--
=========================== short test summary info ============================
FAILED mdp/test/test_VartimeCovariance.py::test_VartimeCovarianceMatrix1 - As...
==== 1 failed, 730 passed, 26 skipped, 176076 warnings in 237.86s (0:03:57) ====
python3-module-qtsass-0.3.0-alt3
tests/test_functions.py::TestQLinearGradientFunc::test_rgba PASSED [ 89%]
tests/test_watchers.py::test_watchers[PollingWatcher] FAILED [ 91%]
tests/test_watchers.py::test_watchers[None] PASSED [ 94%]
--
SKIPPED [1] tests/test_watchers.py:100: Fails on linux
FAILED tests/test_watchers.py::test_watchers[PollingWatcher] - assert 1 == 2
=================== 1 failed, 35 passed, 1 skipped in 10.54s ===================
redis-7.2.7-alt1
01:54:47> Restarting the previously killed master nodes:
hasher-privd: parent: handle_io: idle time limit (3600 seconds) exceeded
valkey-8.0.2-alt1
53 seconds - unit/moduleapi/testrdb
!!! WARNING The following tests failed:
*** [err]: Diskless load swapdb RedisModuleEvent_ReplAsyncLoad handling: during loading,
can keep module variable same as before in tests/unit/moduleapi/testrdb.tcl
8 error logs REMOVED from the list
fractal-7-alt1
libwebrtc-audio-processing-1.3-alt2
llama-swap-92-alt1
python3-module-fastapi-0.115.11-alt1
python3-module-jupyter_server-2.15.0-alt2
python3-module-qtconsole-5.6.1-alt1
python3-module-sanic-24.6.0-alt2
zstd-1.5.5-alt2
Total 245 error logs.
^ permalink raw reply [flat|nested] only message in thread
only message in thread, other threads:[~2025-03-31 5:49 UTC | newest]
Thread overview: (only message) (download: mbox.gz / follow: Atom feed)
-- links below jump to the message on this page --
2025-03-31 5:49 [cyber] I: Sisyphus-20250331 x86_64 beehive_status: +10 -8 (245) ALT beekeeper
ALT Linux Sisyphus cybertalk
This inbox may be cloned and mirrored by anyone:
git clone --mirror http://lore.altlinux.org/sisyphus-cybertalk/0 sisyphus-cybertalk/git/0.git
# If you have public-inbox 1.1+ installed, you may
# initialize and index your mirror using the following commands:
public-inbox-init -V2 sisyphus-cybertalk sisyphus-cybertalk/ http://lore.altlinux.org/sisyphus-cybertalk \
sisyphus-cybertalk@lists.altlinux.org sisyphus-cybertalk@lists.altlinux.ru sisyphus-cybertalk@lists.altlinux.com
public-inbox-index sisyphus-cybertalk
Example config snippet for mirrors.
Newsgroup available over NNTP:
nntp://lore.altlinux.org/org.altlinux.lists.sisyphus-cybertalk
AGPL code for this site: git clone https://public-inbox.org/public-inbox.git