ALT Linux Sisyphus cybertalk
 help / color / mirror / Atom feed
* [cyber] I: Sisyphus-20250329 i586 beehive_status: +18 -50 (267)
@ 2025-03-29 11:07 ALT beekeeper
  0 siblings, 0 replies; only message in thread
From: ALT beekeeper @ 2025-03-29 11:07 UTC (permalink / raw)
  To: sisyphus-cybertalk

[-- Warning: decoded text below may be mangled, UTF-8 assumed --]
[-- Attachment #1: Type: text/plain; charset=unknown-8bit, Size: 20566 bytes --]

	18 NEW error logs

cca-spec-classic-0.5.7-alt8
	Installing cxx/include/ports/StringConsumerPort.h
	Installing cxx/include/ports/TimeProducerPort.h
	/usr/bin/babel-libtool --mode=install \
	cp cxx/src/libclassic_0_5_7.la /usr/src/tmp/cca-spec-classic-buildroot/usr/lib
	babel-libtool: install: `cxx/src/libclassic_0_5_7.la' is not a valid libtool archive
	babel-libtool: install: Try `babel-libtool --help --mode=install' for more information.
	make[1]: *** [Makefile.install:124: install-lib-libtool] Error 1
	make[1]: Leaving directory '/usr/src/RPM/BUILD/cca-spec-classic-0.5.7'
	make: *** [Makefile:51: install] Error 2
	make: Leaving directory '/usr/src/RPM/BUILD/cca-spec-classic-0.5.7'

erlang-proper-1.4.0.19.3bbd-alt1
	1) proper_tests:-options_test_/0-fun-131-/0:1157
	^[[0;31m     Failure/Error: ?assertMatch(false, proper : check ( ? FORALL ( T , any (
	) , T < 42 ) , CExm1 , [ any_to_integer , verbose , nocolors ] ))
	expected: = false
	--
	OK: Passed 100 test(s).
	Error: The property code returned a non-boolean result.
	^[[0m
	--
	OK: Passed 100 test(s).
	Error: The property code returned a non-boolean result.
	^[[0m

guile22-2.2.7-alt1
	make[2]: Leaving directory '/usr/src/RPM/BUILD/guile22-2.2.7/bootstrap'
	hasher-privd: parent: handle_io: idle time limit (3600 seconds) exceeded

kyotocabinet-1.2.76-alt3
	error
	FAILED: KCRNDSEED=3782231069 PID=3557852 ./kcdirtest queue -th 4 -it 4 casket 500
	make[1]: *** [Makefile:551: check-dir] Error 1

liboil-0.3.17-alt1.qa2
	../test-driver: line 112: 2341135 Segmentation fault	  "$@" >> "$log_file" 2>&1
	FAIL: stride
	PASS: dso_check
	--
	# SKIP:  0
	# XFAIL: 0
	# FAIL:  1
	# XPASS: 0
	# ERROR: 0
	See testsuite/test-suite.log

liboqs-0.12.0-alt1
	tests/test_kat.py::test_kem[Classic-McEliece-6688128]
	[gw0] [ 96%] PASSED tests/test_speed.py::test_kem[Classic-McEliece-8192128]
	[gw4] [ 96%] PASSED tests/test_cmdline.py::test_kem[Classic-McEliece-6960119]
	tests/test_cmdline.py::test_kem[Classic-McEliece-6960119f]
	[gw4] [ 97%] PASSED tests/test_cmdline.py::test_kem[Classic-McEliece-6960119f]
	tests/test_cmdline.py::test_kem[Classic-McEliece-8192128]
	[gw6] [ 97%] PASSED tests/test_kat.py::test_kem[Classic-McEliece-6688128]
	tests/test_kat.py::test_kem[Classic-McEliece-6688128f]
	[gw6] [ 97%] PASSED tests/test_kat.py::test_kem[Classic-McEliece-6688128f]
	tests/test_kat.py::test_kem[Classic-McEliece-6960119] ninja: build stopped: interrupted
	by user.

perl-XML-Parser-2.47-alt1
	t/partial.t	    (Wstat: 0 Tests: 3 Failed: 1)
	Failed test:  3
	Files=15, Tests=140,  0 wallclock secs ( 0.03 usr  0.02 sys +  0.55 cusr  0.12 csys =
	0.72 CPU)
	Result: FAIL
	Failed 1/15 test programs. 1/140 subtests failed.
	make: *** [Makefile:904: test_dynamic] Error 255

plasma-discover-6.3.3-alt2
	from
	/usr/src/RPM/BUILD/discover-6.3.3/libdiscover/backends/SnapBackend/libsnapclient/SnapAuthHelper.cpp:14:
	/usr/include/snapd-qt-2/Snapd/enums.h:15:10: fatal error: snapdqt_global.h: No such
	file or directory
	15 | #include "snapdqt_global.h"

puppetdb-8.4.1-alt3
	shebang.req.files: executable script
	/usr/src/tmp/puppetdb-buildroot/usr/lib/puppetdb/resources/ext/cli/upgrade is not
	executable
	/usr/src/tmp/puppetdb-buildroot/usr/lib/puppetdb/resources/ext/cli/delete-reports.erb:
	line 5: syntax error near unexpected token `newline'
	/usr/src/tmp/puppetdb-buildroot/usr/lib/puppetdb/resources/ext/cli/delete-reports.erb:
	line 5: `pdb_db_name=<%= EZBake::Config[:user] %>'
	shell.req: ERROR:
	/usr/src/tmp/puppetdb-buildroot/usr/lib/puppetdb/resources/ext/cli/delete-reports.erb:
	/bin/bash --rpm-requires failed
	find-requires: ERROR: /usr/lib/rpm/shell.req failed
	error: /bin/sh failed
	error: Failed to find Requires
	RPM build errors:

python-2.7.18-alt11
	self._sslobj.do_handshake()
	SSLZeroReturnError: TLS/SSL connection has been closed (EOF) (_ssl.c:735)
	Exception in thread Thread-71:
	--
	self._sslobj.do_handshake()
	SSLZeroReturnError: TLS/SSL connection has been closed (EOF) (_ssl.c:735)
	Exception in thread Thread-72:
	--
	self._sslobj.do_handshake()
	SSLZeroReturnError: TLS/SSL connection has been closed (EOF) (_ssl.c:735)
	Exception in thread Thread-73:
	--
	self._sslobj.do_handshake()
	SSLZeroReturnError: TLS/SSL connection has been closed (EOF) (_ssl.c:735)
	Exception in thread Thread-74:
	--
	self._sslobj.do_handshake()
	SSLZeroReturnError: TLS/SSL connection has been closed (EOF) (_ssl.c:735)
	Exception in thread Thread-75:
	--
	self._sslobj.do_handshake()
	SSLZeroReturnError: TLS/SSL connection has been closed (EOF) (_ssl.c:735)
	Exception in thread Thread-76:
	--
	self._sslobj.do_handshake()
	SSLZeroReturnError: TLS/SSL connection has been closed (EOF) (_ssl.c:735)
	Warning -- asyncore.socket_map was modified by test_ftplib

python3-module-cheroot-10.0.1-alt3
	>	    assert col in needed_collectors, "previous item was not torn down properly"
	E	    AssertionError: previous item was not torn down properly
	col	   = <Module test_server.py>
	--
	/usr/lib/python3/site-packages/_pytest/runner.py:505: AssertionError
	_______________ ERROR at setup of test_https_over_http_error[::] _______________
	[gw10] linux -- Python 3.12.9
	/usr/src/RPM/BUILD/python3-module-cheroot-10.0.1/.run_venv/bin/python3
	--
	>	    assert col in needed_collectors, "previous item was not torn down properly"
	E	    AssertionError: previous item was not torn down properly
	col	   = <Module test_server.py>
	--
	XFAIL cheroot/test/test_core.py::test_large_request -
	https://github.com/cherrypy/cheroot/issues/106
	ERROR cheroot/test/test_ssl.py::test_http_over_https_error[0.0.0.0-builtin]
	ERROR cheroot/test/test_ssl.py::test_https_over_http_error[::] - AssertionErr...
	================== 151 passed, 3 xfailed, 2 errors in 16.32s ===================
	INFO	 : Command's result: FAILURE
	INFO	 : Command's error: Command '['python3', '-m', 'pytest', '-k', 'not
	test_tls_client_auth']' returned non-zero exit status 1.

python3-module-eventlet-0.39.1-alt1
	>	    assert ok, 'Expected single line "pass" in stdout'
	E	    AssertionError: Expected single line "pass" in stdout
	tests/__init__.py:358: AssertionError
	--
	assert len(mod._active) == n, 'Expected {} {} threads, got {}'.format(n, tag, mod._active)
	AssertionError: Expected 2 post-fork patched threads, got {4160174848:
	<_MainThread(MainThread, started 4160174848)>}
	=============================== warnings summary ===============================
	--
	=========================== short test summary info ============================
	FAILED tests/patcher_test.py::test_fork_after_monkey_patch - AssertionError: ...
	= 1 failed, 640 passed, 89 skipped, 12 deselected, 52 warnings in 83.88s (0:01:23) =
	INFO	 : Command's result: FAILURE
	INFO	 : Command's error: Command '['python3', '-m', 'pytest', '-v', '-k', 'not
	test_dns_methods_are_green and not test_noraise_dns_tcp and not test_clear and not
	test_raise_dns_tcp']' returned non-zero exit status 1.
	error: Bad exit status from /usr/src/tmp/rpm-tmp.14978 (%check)

python3-module-jupyter_server-2.15.0-alt2
	SKIPPED [7] tests/conftest.py:42: Skipping this test because it's marked
	'integration_test'. Run integration tests using the `--integration_tests` flag.
	FAILED tests/services/kernels/test_execution_state.py::test_execution_state
	= 1 failed, 985 passed, 15 skipped, 8 deselected, 34 warnings in 204.31s (0:03:24) =
	INFO	 : Command's result: FAILURE
	INFO	 : Command's error: Command '['python3', '-m', 'pytest', '-v', '-W', 'default',
	'-m', 'not network', '-k', 'not test_restart_kernel and not test_connection']' returned
	non-zero exit status 1.

python3-module-manilaclient-5.2.0-alt1
	raise mismatch_error
	testtools.matchers._impl.MismatchError: !=:
	reference = ('access_rules_status',

python3-module-openstackclient-7.2.1-alt1
	raise mismatch_error
	testtools.matchers._impl.MismatchError: !=:
	reference = {'admin_state_up',
	--
	raise mismatch_error
	testtools.matchers._impl.MismatchError: !=:
	reference = {'admin_state_up',

python3-module-pytz-deprecation-shim-0.1.0.post0-alt3
	|   File "<frozen importlib._bootstrap>", line 1324, in _find_and_load_unlocked
	| ModuleNotFoundError: No module named 'tzdata'
	| During handling of the above exception, another exception occurred:
	--
	|     raise ZoneInfoNotFoundError(f"No time zone found with key {key}")
	| zoneinfo._common.ZoneInfoNotFoundError: 'No time zone found with key America/Coyhaique'
	| while generating 'shim_zone' from one_of(sampled_from(['Africa/Abidjan',
	'Africa/Accra', 'Africa/Addis_Ababa', 'Africa/Algiers', 'Africa/Asmara',
	'Africa/Asmera', 'Africa/Bamako', 'Africa/Bangui', 'Africa/Banjul', 'Africa/Bissau',
	'Africa/Blantyre', 'Africa/Brazzaville', 'Africa/Bujumbura', 'Africa/Cairo',
	'Africa/Casablanca', 'Africa/Ceuta', 'Africa/Conakry', 'Africa/Dakar',
	'Africa/Dar_es_Salaam', 'Africa/Djibouti', 'Africa/Douala', 'Africa/El_Aaiun',
	'Africa/Freetown', 'Africa/Gaborone', 'Africa/Harare', 'Africa/Johannesburg',
	'Africa/Juba', 'Africa/Kampala', 'Africa/Khartoum', 'Africa/Kigali', 'Africa/Kinshasa',
	'Africa/Lagos', 'Africa/Libreville', 'Africa/Lome', 'Africa/Luanda', 'Africa/Lubumbashi',
	'Africa/Lusaka', 'Africa/Malabo', 'Africa/Maputo', 'Africa/Maseru', 'Africa/Mbabane',
	'Africa/Mogadishu', 'Africa/Monrovia', 'Africa/Nairobi', 'Africa/Ndjamena',
	'Africa/Niamey', 'Africa/Nouakchott', 'Africa/Ouagadougou', 'Africa/Porto-Novo',
	'Africa/Sao_Tome', 'Africa/Timbuktu', 'Africa/Tripoli', 'Africa/Tunis', 'Africa/Windhoek',
	'America/Adak', 'America/Anchorage', 'America/Anguilla', 'America/Antigua',
	'America/Araguaina', 'America/Argentina/Buenos_Aires', 'America/Argentina/Catamarca',
	'America/Argentina/ComodRivadavia', 'America/Argentina/Cordoba',
	'America/Argentina/Jujuy', 'America/Argentina/La_Rioja', 'America/Argentina/Mendoza',
	'America/Argentina/Rio_Gallegos', 'America/Argentina/Salta', 'America/Argentina/San_Juan',
	'America/Argentina/San_Luis', 'America/Argentina/Tucuman', 'America/Argentina/Ushuaia',
	'America/Aruba', 'America/Asuncion', 'America/Atikokan', 'America/Atka', 'America/Bahia',
	'America/Bahia_Banderas', 'America/Barbados', 'America/Belem', 'America/Belize',
	'America/Blanc-Sablon', 'America/Boa_Vista', 'America/Bogota', 'America/Boise',
	'America/Buenos_Aires', 'America/Cambridge_Bay', 'America/Campo_Grande', 'America/Cancun',
	'America/Caracas', 'America/Catamarca', 'America/Cayenne', 'America/Cayman',
	'America/Chicago', 'America/Chihuahua', 'America/Ciudad_Juarez', 'America/Coral_Harbour',
	'America/Cordoba', 'America/Costa_Rica', 'America/Coyhaique', 'America/Creston',
	'America/Cuiaba', 'America/Curacao', 'America/Danmarkshavn', 'America/Dawson',
	'America/Dawson_Creek', 'America/Denver', 'America/Detroit', 'America/Dominica',
	'America/Edmonton', 'America/Eirunepe', 'America/El_Salvador', 'America/Ensenada',
	'America/Fort_Nelson', 'America/Fort_Wayne', 'America/Fortaleza', 'America/Glace_Bay',
	'America/Godthab', 'America/Goose_Bay', 'America/Grand_Turk', 'America/Grenada',
	'America/Guadeloupe', 'America/Guatemala', 'America/Guayaquil', 'America/Guyana',
	'America/Halifax', 'America/Havana', 'America/Hermosillo', 'America/Indiana/Indianapolis',
	'America/Indiana/Knox', 'America/Indiana/Marengo', 'America/Indiana/Petersburg',
	'America/Indiana/Tell_City', 'America/Indiana/Vevay', 'America/Indiana/Vincennes',
	'America/Indiana/Winamac', 'America/Indianapolis', 'America/Inuvik', 'America/Iqaluit',
	'America/Jamaica', 'America/Jujuy', 'America/Juneau', 'America/Kentucky/Louisville',
	'America/Kentucky/Monticello', 'America/Knox_IN', 'America/Kralendijk', 'America/La_Paz',
	'America/Lima', 'America/Los_Angeles', 'America/Louisville', 'America/Lower_Princes',
	'America/Maceio', 'America/Managua', 'America/Manaus', 'America/Marigot',
	'America/Martinique', 'America/Matamoros', 'America/Mazatlan', 'America/Mendoza',
	'America/Menominee', 'America/Merida', 'America/Metlakatla', 'America/Mexico_City',
	'America/Miquelon', 'America/Moncton', 'America/Monterrey', 'America/Montevideo',
	'America/Montreal', 'America/Montserrat', 'America/Nassau', 'America/New_York',
	'America/Nipigon', 'America/Nome', 'America/Noronha', 'America/North_Dakota/Beulah',
	'America/North_Dakota/Center', 'America/North_Dakota/New_Salem', 'America/Nuuk',
	'America/Ojinaga', 'America/Panama', 'America/Pangnirtung', 'America/Paramaribo',
	'America/Phoenix', 'America/Port-au-Prince', 'America/Port_of_Spain',
	'America/Porto_Acre', 'America/Porto_Velho', 'America/Puerto_Rico', 'America/Punta_Arenas',
	'America/Rainy_River', 'America/Rankin_Inlet', 'Ame
	--
	|   File "<frozen importlib._bootstrap>", line 1324, in _find_and_load_unlocked
	| ModuleNotFoundError: No module named 'tzdata'
	| During handling of the above exception, another exception occurred:
	--
	|     raise ZoneInfoNotFoundError(f"No time zone found with key {key}")
	| zoneinfo._common.ZoneInfoNotFoundError: 'No time zone found with key America/Coyhaique'
	| During handling of the above exception, another exception occurred:
	--
	|     raise get_exception(UnknownTimeZoneError, key)
	|
	pytz_deprecation_shim._exceptions._make_pytz_derived_errors.<locals>.UnknownTimeZoneError:
	'America/Coyhaique'
	| while generating 'shim_zone' from one_of(sampled_from(['Africa/Abidjan',
	'Africa/Accra', 'Africa/Addis_Ababa', 'Africa/Algiers', 'Africa/Asmara',
	'Africa/Asmera', 'Africa/Bamako', 'Africa/Bangui', 'Africa/Banjul', 'Africa/Bissau',
	'Africa/Blantyre', 'Africa/Brazzaville', 'Africa/Bujumbura', 'Africa/Cairo',
	'Africa/Casablanca', 'Africa/Ceuta', 'Africa/Conakry', 'Africa/Dakar',
	'Africa/Dar_es_Salaam', 'Africa/Djibouti', 'Africa/Douala', 'Africa/El_Aaiun',
	'Africa/Freetown', 'Africa/Gaborone', 'Africa/Harare', 'Africa/Johannesburg',
	'Africa/Juba', 'Africa/Kampala', 'Africa/Khartoum', 'Africa/Kigali', 'Africa/Kinshasa',
	'Africa/Lagos', 'Africa/Libreville', 'Africa/Lome', 'Africa/Luanda', 'Africa/Lubumbashi',
	'Africa/Lusaka', 'Africa/Malabo', 'Africa/Maputo', 'Africa/Maseru', 'Africa/Mbabane',
	'Africa/Mogadishu', 'Africa/Monrovia', 'Africa/Nairobi', 'Africa/Ndjamena',
	'Africa/Niamey', 'Africa/Nouakchott', 'Africa/Ouagadougou', 'Africa/Porto-Novo',
	'Africa/Sao_Tome', 'Africa/Timbuktu', 'Africa/Tripoli', 'Africa/Tunis', 'Africa/Windhoek',
	'America/Adak', 'America/Anchorage', 'America/Anguilla', 'America/Antigua',
	'America/Araguaina', 'America/Argentina/Buenos_Aires', 'America/Argentina/Catamarca',
	'America/Argentina/ComodRivadavia', 'America/Argentina/Cordoba',
	'America/Argentina/Jujuy', 'America/Argentina/La_Rioja', 'America/Argentina/Mendoza',
	'America/Argentina/Rio_Gallegos', 'America/Argentina/Salta', 'America/Argentina/San_Juan',
	'America/Argentina/San_Luis', 'America/Argentina/Tucuman', 'America/Argentina/Ushuaia',
	'America/Aruba', 'America/Asuncion', 'America/Atikokan', 'America/Atka', 'America/Bahia',
	'America/Bahia_Banderas', 'America/Barbados', 'America/Belem', 'America/Belize',
	'America/Blanc-Sablon', 'America/Boa_Vista', 'America/Bogota', 'America/Boise',
	'America/Buenos_Aires', 'America/Cambridge_Bay', 'America/Campo_Grande', 'America/Cancun',
	'America/Caracas', 'America/Catamarca', 'America/Cayenne', 'America/Cayman',
	'America/Chicago', 'America/Chihuahua', 'America/Ciudad_Juarez', 'America/Coral_Harbour',
	'America/Cordoba', 'America/Costa_Rica', 'America/Coyhaique', 'America/Creston',
	'America/Cuiaba', 'America/Curacao', 'America/Danmarkshavn', 'America/Dawson',
	'America/Dawson_Creek', 'America/Denver', 'America/Detroit', 'America/Dominica',
	'America/Edmonton', 'America/Eirunepe', 'America/El_Salvador', 'America/Ensenada',
	'America/Fort_Nelson', 'America/Fort_Wayne', 'America/Fortaleza', 'America/Glace_Bay',
	'America/Godthab', 'America/Goose_Bay', 'America/Grand_Turk', 'America/Grenada',
	'America/Guadeloupe', 'America/Guatemala', 'America/Guayaquil', 'America/Guyana',
	'America/Halifax', 'America/Havana', 'America/Hermosillo', 'America/Indiana/Indianapolis',
	'America/Indiana/Knox', 'America/Indiana/Marengo', 'America/Indiana/Petersburg',
	'America/Indiana/Tell_City', 'America/Indiana/Vevay', 'America/Indiana/Vincennes',
	'America/Indiana/Winamac', 'America/Indianapolis', 'America/Inuvik', 'America/Iqaluit',
	'America/Jamaica', 'America/Jujuy', 'America/Juneau', 'America/Kentucky/Louisville',
	'America/Kentucky/Monticello', 'America/Knox_IN', 'America/Kralendijk', 'America/La_Paz',
	'America/Lima', 'America/Los_Angeles', 'America/Louisville', 'America/Lower_Princes',
	'America/Maceio', 'America/Managua', 'America/Manaus', 'America/Marigot',
	'America/Martinique', 'America/Matamoros', 'America/Mazatlan', 'America/Mendoza',
	'America/Menominee', 'America/Merida', 'America/Metlakatla', 'America/Mexico_City',
	'America/Miquelon', 'America/Moncton', 'America/Monterrey', 'America/Montevideo',
	'America/Montreal', 'America/Montserrat', 'America/Nassau', 'America/New_York',
	'America/Nipigon', 'America/Nome', 'America/Noronha', 'America/North_Dakota/Beulah',
	'America/North_Dakota/Center', 'America/North_Dakota/New_Salem', 'America/Nuuk',
	'America/Ojinaga', 'America/Panama', 'America/Pangnirtung', 'America/Paramaribo',
	'America/Phoenix', 'America/Port-au-Prince', 'America/Port_of_Spain',
	'America/Porto_Acre', 'America/Porto_Velho', 'America/Puerto_Rico', 'America/Punta_Arenas',
	'America/Rainy_River', 'America/Rankin_Inlet', 'Ame
	--
	=========================== short test summary info ============================
	FAILED tests/test_errors.py::test_localize_aware_datetime - pytz_deprecation_...
	FAILED tests/test_errors.py::test_normalize_naive_datetime - pytz_deprecation...
	FAILED tests/test_pytz_equivalent.py::test_zone_attribute - pytz_deprecation_...
	FAILED tests/test_shims.py::test_pickle_round_trip - ExceptionGroup: Hypothes...
	============= 4 failed, 412 passed, 3 xfailed, 1 xpassed in 13.85s =============
	INFO	 : Command's result: FAILURE
	INFO	 : Command's error: Command '['python3', '-m', 'pytest', 'tests']' returned
	non-zero exit status 1.

scrutiny-0.8.1-alt1
	+ export GOPATH=/usr/src/RPM/BUILD/scrutiny-0.8.1/.gopath:/usr/share/gocode
	+ GOPATH=/usr/src/RPM/BUILD/scrutiny-0.8.1/.gopath:/usr/share/gocode
	+ export GOFLAGS=-mod=vendor
	+ GOFLAGS=-mod=vendor
	+ npm --prefix webapp/frontend run build
	> @treo/starter@1.0.1 build
	> ng build
	- Generating browser application bundles (phase: setup)...
	✔ Browser application bundle generation complete.
	/usr/src/tmp/rpm-tmp.1368: line 131: 3204963 Segmentation fault      npm --prefix
	webapp/frontend run build

tmux-3.5a-alt1
	sh kill-session-process-exit.sh
	sh new-session-base-index.sh
	sh new-session-command.sh
	sh new-session-environment.sh
	sh new-session-no-client.sh
	sh new-session-size.sh
	sh new-window-command.sh
	sh osc-11colours.sh
	make: *** [Makefile:9: osc-11colours.sh] Error 1
	make: Leaving directory '/usr/src/RPM/BUILD/tmux-3.5a/regress'

	50 error logs REMOVED from the list
babel-2.0.0-alt7
cjet-0.8.9-alt1
deepin-music-7.0.5-alt2
dm-secdel-1.0.11-alt2
dmraid-1.0.0.rc16-alt3
dropbear-2025.87-alt1
dunst-1.8.1-alt1
evolution-on-3.24.2-alt1
expect-1:5.45.4-alt4
faces-1.7.7-alt7
fbi-2.14-alt2.1
festival-2.5-alt0.4
fritzing-0.9.6-alt1
fwupd-2.0.6-alt1
ghc8.6.4-sha-1.6.4.4-alt1
gis-weather-0.8.4.17-alt2
inkscape-1.4-alt1.1
ispell-1:3.2.06-alt14
iwyu-0.22-alt1
java-1.8.0-openjdk-0:1.8.0.442.b06-alt1_1jpp8
kakasi-2.3.6-alt1
ktechlab-0.51.0-alt2.1
kvmtool-3.18.0-alt7
libcuefile-r475-alt1
llama-swap-92-alt1
netbox-4.2.2-alt1
perl-Audio-CD-0.05-alt4.2
perl-Crypt-Random-1.54-alt1
perl-Imager-1.012-alt1
perl-Math-BigInteger-1.01-alt4.1
perl-POE-Component-SSLify-1.012-alt1_17
protobuf-3.25.5-alt6
python3-module-chameleon.core-4.6.0-alt1
python3-module-hdf5storage-0.2-alt1.1
python3-module-hypothesis-jsonschema-0.23.1-alt1
python3-module-jupyter_client-8.6.3-alt1
python3-module-oslo.db-17.1.0-alt1
python3-module-pycall-2.3.0-alt2
python3-module-pyvfs-0.2.10-alt2
python3-module-sphinxcontrib-programoutput-0.17-alt2
python3-module-tpm2-pytss-2.2.1-alt1
python3-module-websockets-14.1-alt1
python3-module-xonsh-0.19.2-alt1
qt3-3.3.8d-alt16.2
scummvm-2.8.0-alt1
shepherd-0.10.5-alt1
syslinux1-1.62-alt4.1.qa1
xautomation-1.07-alt1
xli-1.17.0-alt9
xlsfonts-1.0.6-alt1

Total 267 error logs.


^ permalink raw reply	[flat|nested] only message in thread

only message in thread, other threads:[~2025-03-29 11:07 UTC | newest]

Thread overview: (only message) (download: mbox.gz / follow: Atom feed)
-- links below jump to the message on this page --
2025-03-29 11:07 [cyber] I: Sisyphus-20250329 i586 beehive_status: +18 -50 (267) ALT beekeeper

ALT Linux Sisyphus cybertalk

This inbox may be cloned and mirrored by anyone:

	git clone --mirror http://lore.altlinux.org/sisyphus-cybertalk/0 sisyphus-cybertalk/git/0.git

	# If you have public-inbox 1.1+ installed, you may
	# initialize and index your mirror using the following commands:
	public-inbox-init -V2 sisyphus-cybertalk sisyphus-cybertalk/ http://lore.altlinux.org/sisyphus-cybertalk \
		sisyphus-cybertalk@lists.altlinux.org sisyphus-cybertalk@lists.altlinux.ru sisyphus-cybertalk@lists.altlinux.com
	public-inbox-index sisyphus-cybertalk

Example config snippet for mirrors.
Newsgroup available over NNTP:
	nntp://lore.altlinux.org/org.altlinux.lists.sisyphus-cybertalk


AGPL code for this site: git clone https://public-inbox.org/public-inbox.git